hadoop-common-issues mailing list archives

Site index · List index
Message view « Date » · « Thread »
Top « Date » · « Thread »
From "Hadoop QA (JIRA)" <j...@apache.org>
Subject [jira] [Commented] (HADOOP-14658) branch-2 compilation is broken in hadoop-azure
Date Thu, 13 Jul 2017 15:20:00 GMT

    [ https://issues.apache.org/jira/browse/HADOOP-14658?page=com.atlassian.jira.plugin.system.issuetabpanels:comment-tabpanel&focusedCommentId=16085861#comment-16085861
] 

Hadoop QA commented on HADOOP-14658:
------------------------------------

| (x) *{color:red}-1 overall{color}* |
\\
\\
|| Vote || Subsystem || Runtime || Comment ||
| {color:blue}0{color} | {color:blue} reexec {color} | {color:blue}  0m 20s{color} | {color:blue}
Docker mode activated. {color} |
|| || || || {color:brown} Prechecks {color} ||
| {color:green}+1{color} | {color:green} @author {color} | {color:green}  0m  0s{color} |
{color:green} The patch does not contain any @author tags. {color} |
| {color:red}-1{color} | {color:red} test4tests {color} | {color:red}  0m  0s{color} | {color:red}
The patch doesn't appear to include any new or modified tests. Please justify why no new tests
are needed for this patch. Also please list what manual steps were performed to verify this
patch. {color} |
|| || || || {color:brown} branch-2 Compile Tests {color} ||
| {color:red}-1{color} | {color:red} mvninstall {color} | {color:red}  9m 16s{color} | {color:red}
root in branch-2 failed. {color} |
| {color:green}+1{color} | {color:green} compile {color} | {color:green}  0m 18s{color} |
{color:green} branch-2 passed with JDK v1.8.0_131 {color} |
| {color:red}-1{color} | {color:red} compile {color} | {color:red}  0m 15s{color} | {color:red}
hadoop-azure in branch-2 failed with JDK v1.7.0_131. {color} |
| {color:green}+1{color} | {color:green} checkstyle {color} | {color:green}  0m 15s{color}
| {color:green} branch-2 passed {color} |
| {color:red}-1{color} | {color:red} mvnsite {color} | {color:red}  0m 16s{color} | {color:red}
hadoop-azure in branch-2 failed. {color} |
| {color:red}-1{color} | {color:red} findbugs {color} | {color:red}  0m 15s{color} | {color:red}
hadoop-azure in branch-2 failed. {color} |
| {color:green}+1{color} | {color:green} javadoc {color} | {color:green}  0m 14s{color} |
{color:green} branch-2 passed with JDK v1.8.0_131 {color} |
| {color:green}+1{color} | {color:green} javadoc {color} | {color:green}  0m 15s{color} |
{color:green} branch-2 passed with JDK v1.7.0_131 {color} |
|| || || || {color:brown} Patch Compile Tests {color} ||
| {color:green}+1{color} | {color:green} mvninstall {color} | {color:green}  0m 18s{color}
| {color:green} the patch passed {color} |
| {color:green}+1{color} | {color:green} compile {color} | {color:green}  0m 14s{color} |
{color:green} the patch passed with JDK v1.8.0_131 {color} |
| {color:green}+1{color} | {color:green} javac {color} | {color:green}  0m 14s{color} | {color:green}
the patch passed {color} |
| {color:green}+1{color} | {color:green} compile {color} | {color:green}  0m 16s{color} |
{color:green} the patch passed with JDK v1.7.0_131 {color} |
| {color:red}-1{color} | {color:red} javac {color} | {color:red}  0m 16s{color} | {color:red}
hadoop-tools_hadoop-azure-jdk1.7.0_131 with JDK v1.7.0_131 generated 4 new + 1 unchanged -
2 fixed = 5 total (was 3) {color} |
| {color:green}+1{color} | {color:green} checkstyle {color} | {color:green}  0m 12s{color}
| {color:green} the patch passed {color} |
| {color:green}+1{color} | {color:green} mvnsite {color} | {color:green}  0m 23s{color} |
{color:green} the patch passed {color} |
| {color:green}+1{color} | {color:green} whitespace {color} | {color:green}  0m  0s{color}
| {color:green} The patch has no whitespace issues. {color} |
| {color:green}+1{color} | {color:green} findbugs {color} | {color:green}  0m 45s{color} |
{color:green} the patch passed {color} |
| {color:green}+1{color} | {color:green} javadoc {color} | {color:green}  0m 10s{color} |
{color:green} the patch passed with JDK v1.8.0_131 {color} |
| {color:green}+1{color} | {color:green} javadoc {color} | {color:green}  0m 13s{color} |
{color:green} the patch passed with JDK v1.7.0_131 {color} |
|| || || || {color:brown} Other Tests {color} ||
| {color:green}+1{color} | {color:green} unit {color} | {color:green}  1m 38s{color} | {color:green}
hadoop-azure in the patch passed with JDK v1.7.0_131. {color} |
| {color:green}+1{color} | {color:green} asflicense {color} | {color:green}  0m 19s{color}
| {color:green} The patch does not generate ASF License warnings. {color} |
| {color:black}{color} | {color:black} {color} | {color:black} 18m 46s{color} | {color:black}
{color} |
\\
\\
|| Subsystem || Report/Notes ||
| Docker |  Image:yetus/hadoop:5e40efe |
| JIRA Issue | HADOOP-14658 |
| JIRA Patch URL | https://issues.apache.org/jira/secure/attachment/12877067/HADOOP-14658-branch-2.001.patch
|
| Optional Tests |  asflicense  compile  javac  javadoc  mvninstall  mvnsite  unit  findbugs
 checkstyle  |
| uname | Linux 7f847b13f43d 3.13.0-116-generic #163-Ubuntu SMP Fri Mar 31 14:13:22 UTC 2017
x86_64 x86_64 x86_64 GNU/Linux |
| Build tool | maven |
| Personality | /testptch/hadoop/patchprocess/precommit/personality/provided.sh |
| git revision | branch-2 / 956e83c |
| Default Java | 1.7.0_131 |
| Multi-JDK versions |  /usr/lib/jvm/java-8-oracle:1.8.0_131 /usr/lib/jvm/java-7-openjdk-amd64:1.7.0_131
|
| mvninstall | https://builds.apache.org/job/PreCommit-HADOOP-Build/12776/artifact/patchprocess/branch-mvninstall-root.txt
|
| compile | https://builds.apache.org/job/PreCommit-HADOOP-Build/12776/artifact/patchprocess/branch-compile-hadoop-tools_hadoop-azure-jdk1.7.0_131.txt
|
| mvnsite | https://builds.apache.org/job/PreCommit-HADOOP-Build/12776/artifact/patchprocess/branch-mvnsite-hadoop-tools_hadoop-azure.txt
|
| findbugs | https://builds.apache.org/job/PreCommit-HADOOP-Build/12776/artifact/patchprocess/branch-findbugs-hadoop-tools_hadoop-azure.txt
|
| javac | https://builds.apache.org/job/PreCommit-HADOOP-Build/12776/artifact/patchprocess/diff-compile-javac-hadoop-tools_hadoop-azure-jdk1.7.0_131.txt
|
| JDK v1.7.0_131  Test Results | https://builds.apache.org/job/PreCommit-HADOOP-Build/12776/testReport/
|
| modules | C: hadoop-tools/hadoop-azure U: hadoop-tools/hadoop-azure |
| Console output | https://builds.apache.org/job/PreCommit-HADOOP-Build/12776/console |
| Powered by | Apache Yetus 0.6.0-SNAPSHOT   http://yetus.apache.org |


This message was automatically generated.



> branch-2 compilation is broken in hadoop-azure
> ----------------------------------------------
>
>                 Key: HADOOP-14658
>                 URL: https://issues.apache.org/jira/browse/HADOOP-14658
>             Project: Hadoop Common
>          Issue Type: Bug
>          Components: build, fs/azure
>    Affects Versions: 2.9.0
>         Environment: java 7
>            Reporter: Sunil G
>            Assignee: Sunil G
>            Priority: Blocker
>         Attachments: HADOOP-14658-branch-2.001.patch, YARN-6280-branch-2.001.patch
>
>
> Compilation failure. [link|https://builds.apache.org/job/PreCommit-YARN-Build/16414/artifact/patchprocess/branch-mvninstall-root.txt]
> {noformat}
> [ERROR] /home/sunilg/hadoop/repo/branch-2/hadoop/hadoop-tools/hadoop-azure/src/main/java/org/apache/hadoop/fs/azure/WasbRemoteCallHelper.java:[194,19]
cannot find symbol
> [ERROR] symbol:   method join(java.lang.String,java.lang.String[])
> [ERROR] location: class java.lang.String
> {noformat}



--
This message was sent by Atlassian JIRA
(v6.4.14#64029)

---------------------------------------------------------------------
To unsubscribe, e-mail: common-issues-unsubscribe@hadoop.apache.org
For additional commands, e-mail: common-issues-help@hadoop.apache.org


Mime
View raw message