hadoop-common-issues mailing list archives

Site index · List index
Message view « Date » · « Thread »
Top « Date » · « Thread »
From "John Zhuge (JIRA)" <j...@apache.org>
Subject [jira] [Commented] (HADOOP-13928) TestAdlFileContextMainOperationsLive.testGetFileContext1 runtime error
Date Tue, 21 Mar 2017 16:28:41 GMT

    [ https://issues.apache.org/jira/browse/HADOOP-13928?page=com.atlassian.jira.plugin.system.issuetabpanels:comment-tabpanel&focusedCommentId=15934837#comment-15934837
] 

John Zhuge commented on HADOOP-13928:
-------------------------------------

Backport to 2.8 as well.

> TestAdlFileContextMainOperationsLive.testGetFileContext1 runtime error
> ----------------------------------------------------------------------
>
>                 Key: HADOOP-13928
>                 URL: https://issues.apache.org/jira/browse/HADOOP-13928
>             Project: Hadoop Common
>          Issue Type: Bug
>          Components: fs/adl, test
>    Affects Versions: 3.0.0-alpha2
>         Environment: Mac OS X Sierra 10.12.1
>            Reporter: John Zhuge
>            Assignee: John Zhuge
>             Fix For: 3.0.0-alpha2
>
>         Attachments: HADOOP-13928.001.patch
>
>
> {nformat}
> Tests run: 61, Failures: 0, Errors: 1, Skipped: 2, Time elapsed: 102.532 sec <<<
FAILURE! - in org.apache.hadoop.fs.adl.live.TestAdlFileContextMainOperationsLive
> testGetFileContext1(org.apache.hadoop.fs.adl.live.TestAdlFileContextMainOperationsLive)
 Time elapsed: 0.445 sec  <<< ERROR!
> java.lang.RuntimeException: java.lang.reflect.InvocationTargetException
> 	at org.apache.hadoop.fs.AbstractFileSystem.newInstance(AbstractFileSystem.java:136)
> 	at org.apache.hadoop.fs.AbstractFileSystem.createFileSystem(AbstractFileSystem.java:165)
> 	at org.apache.hadoop.fs.AbstractFileSystem.get(AbstractFileSystem.java:250)
> 	at org.apache.hadoop.fs.FileContext$2.run(FileContext.java:331)
> 	at org.apache.hadoop.fs.FileContext$2.run(FileContext.java:328)
> 	at java.security.AccessController.doPrivileged(Native Method)
> 	at javax.security.auth.Subject.doAs(Subject.java:422)
> 	at org.apache.hadoop.security.UserGroupInformation.doAs(UserGroupInformation.java:1857)
> 	at org.apache.hadoop.fs.FileContext.getAbstractFileSystem(FileContext.java:328)
> 	at org.apache.hadoop.fs.FileContext.getFSofPath(FileContext.java:320)
> 	at org.apache.hadoop.fs.FSLinkResolver.resolve(FSLinkResolver.java:85)
> 	at org.apache.hadoop.fs.FileContext.create(FileContext.java:685)
> 	at org.apache.hadoop.fs.FileContextMainOperationsBaseTest.testGetFileContext1(FileContextMainOperationsBaseTest.java:1350)
> 	at sun.reflect.NativeMethodAccessorImpl.invoke0(Native Method)
> 	at sun.reflect.NativeMethodAccessorImpl.invoke(NativeMethodAccessorImpl.java:62)
> 	at sun.reflect.DelegatingMethodAccessorImpl.invoke(DelegatingMethodAccessorImpl.java:43)
> 	at java.lang.reflect.Method.invoke(Method.java:497)
> 	at org.junit.runners.model.FrameworkMethod$1.runReflectiveCall(FrameworkMethod.java:47)
> 	at org.junit.internal.runners.model.ReflectiveCallable.run(ReflectiveCallable.java:12)
> 	at org.junit.runners.model.FrameworkMethod.invokeExplosively(FrameworkMethod.java:44)
> 	at org.junit.internal.runners.statements.InvokeMethod.evaluate(InvokeMethod.java:17)
> 	at org.junit.internal.runners.statements.RunBefores.evaluate(RunBefores.java:26)
> 	at org.junit.internal.runners.statements.RunAfters.evaluate(RunAfters.java:27)
> 	at org.junit.runners.ParentRunner.runLeaf(ParentRunner.java:271)
> 	at org.junit.runners.BlockJUnit4ClassRunner.runChild(BlockJUnit4ClassRunner.java:70)
> 	at org.junit.runners.BlockJUnit4ClassRunner.runChild(BlockJUnit4ClassRunner.java:50)
> 	at org.junit.runners.ParentRunner$3.run(ParentRunner.java:238)
> 	at org.junit.runners.ParentRunner$1.schedule(ParentRunner.java:63)
> 	at org.junit.runners.ParentRunner.runChildren(ParentRunner.java:236)
> 	at org.junit.runners.ParentRunner.access$000(ParentRunner.java:53)
> 	at org.junit.runners.ParentRunner$2.evaluate(ParentRunner.java:229)
> 	at org.junit.internal.runners.statements.RunBefores.evaluate(RunBefores.java:26)
> 	at org.junit.runners.ParentRunner.run(ParentRunner.java:309)
> 	at org.apache.maven.surefire.junit4.JUnit4Provider.execute(JUnit4Provider.java:264)
> 	at org.apache.maven.surefire.junit4.JUnit4Provider.executeTestSet(JUnit4Provider.java:153)
> 	at org.apache.maven.surefire.junit4.JUnit4Provider.invoke(JUnit4Provider.java:124)
> 	at org.apache.maven.surefire.booter.ForkedBooter.invokeProviderInSameClassLoader(ForkedBooter.java:200)
> 	at org.apache.maven.surefire.booter.ForkedBooter.runSuitesInProcess(ForkedBooter.java:153)
> 	at org.apache.maven.surefire.booter.ForkedBooter.main(ForkedBooter.java:103)
> Caused by: java.lang.reflect.InvocationTargetException: null
> 	at sun.reflect.GeneratedConstructorAccessor14.newInstance(Unknown Source)
> 	at sun.reflect.DelegatingConstructorAccessorImpl.newInstance(DelegatingConstructorAccessorImpl.java:45)
> 	at java.lang.reflect.Constructor.newInstance(Constructor.java:422)
> 	at org.apache.hadoop.fs.AbstractFileSystem.newInstance(AbstractFileSystem.java:134)
> 	at org.apache.hadoop.fs.AbstractFileSystem.createFileSystem(AbstractFileSystem.java:165)
> 	at org.apache.hadoop.fs.AbstractFileSystem.get(AbstractFileSystem.java:250)
> 	at org.apache.hadoop.fs.FileContext$2.run(FileContext.java:331)
> 	at org.apache.hadoop.fs.FileContext$2.run(FileContext.java:328)
> 	at java.security.AccessController.doPrivileged(Native Method)
> 	at javax.security.auth.Subject.doAs(Subject.java:422)
> 	at org.apache.hadoop.security.UserGroupInformation.doAs(UserGroupInformation.java:1857)
> 	at org.apache.hadoop.fs.FileContext.getAbstractFileSystem(FileContext.java:328)
> 	at org.apache.hadoop.fs.FileContext.getFSofPath(FileContext.java:320)
> 	at org.apache.hadoop.fs.FSLinkResolver.resolve(FSLinkResolver.java:85)
> 	at org.apache.hadoop.fs.FileContext.create(FileContext.java:685)
> 	at org.apache.hadoop.fs.FileContextMainOperationsBaseTest.testGetFileContext1(FileContextMainOperationsBaseTest.java:1350)
> 	at sun.reflect.NativeMethodAccessorImpl.invoke0(Native Method)
> 	at sun.reflect.NativeMethodAccessorImpl.invoke(NativeMethodAccessorImpl.java:62)
> 	at sun.reflect.DelegatingMethodAccessorImpl.invoke(DelegatingMethodAccessorImpl.java:43)
> 	at java.lang.reflect.Method.invoke(Method.java:497)
> 	at org.junit.runners.model.FrameworkMethod$1.runReflectiveCall(FrameworkMethod.java:47)
> 	at org.junit.internal.runners.model.ReflectiveCallable.run(ReflectiveCallable.java:12)
> 	at org.junit.runners.model.FrameworkMethod.invokeExplosively(FrameworkMethod.java:44)
> 	at org.junit.internal.runners.statements.InvokeMethod.evaluate(InvokeMethod.java:17)
> 	at org.junit.internal.runners.statements.RunBefores.evaluate(RunBefores.java:26)
> 	at org.junit.internal.runners.statements.RunAfters.evaluate(RunAfters.java:27)
> 	at org.junit.runners.ParentRunner.runLeaf(ParentRunner.java:271)
> 	at org.junit.runners.BlockJUnit4ClassRunner.runChild(BlockJUnit4ClassRunner.java:70)
> 	at org.junit.runners.BlockJUnit4ClassRunner.runChild(BlockJUnit4ClassRunner.java:50)
> 	at org.junit.runners.ParentRunner$3.run(ParentRunner.java:238)
> 	at org.junit.runners.ParentRunner$1.schedule(ParentRunner.java:63)
> 	at org.junit.runners.ParentRunner.runChildren(ParentRunner.java:236)
> 	at org.junit.runners.ParentRunner.access$000(ParentRunner.java:53)
> 	at org.junit.runners.ParentRunner$2.evaluate(ParentRunner.java:229)
> 	at org.junit.internal.runners.statements.RunBefores.evaluate(RunBefores.java:26)
> 	at org.junit.runners.ParentRunner.run(ParentRunner.java:309)
> 	at org.apache.maven.surefire.junit4.JUnit4Provider.execute(JUnit4Provider.java:264)
> 	at org.apache.maven.surefire.junit4.JUnit4Provider.executeTestSet(JUnit4Provider.java:153)
> 	at org.apache.maven.surefire.junit4.JUnit4Provider.invoke(JUnit4Provider.java:124)
> 	at org.apache.maven.surefire.booter.ForkedBooter.invokeProviderInSameClassLoader(ForkedBooter.java:200)
> 	at org.apache.maven.surefire.booter.ForkedBooter.runSuitesInProcess(ForkedBooter.java:153)
> 	at org.apache.maven.surefire.booter.ForkedBooter.main(ForkedBooter.java:103)
> Caused by: java.lang.IllegalArgumentException: No value for dfs.adls.oauth2.access.token.provider
found in conf file.
> 	at org.apache.hadoop.fs.adl.AdlFileSystem.getNonEmptyVal(AdlFileSystem.java:935)
> 	at org.apache.hadoop.fs.adl.AdlFileSystem.getCustomAccessTokenProvider(AdlFileSystem.java:207)
> 	at org.apache.hadoop.fs.adl.AdlFileSystem.getAccessTokenProvider(AdlFileSystem.java:241)
> 	at org.apache.hadoop.fs.adl.AdlFileSystem.initialize(AdlFileSystem.java:151)
> 	at org.apache.hadoop.fs.DelegateToFileSystem.<init>(DelegateToFileSystem.java:52)
> 	at org.apache.hadoop.fs.adl.Adl.<init>(Adl.java:39)
> 	at sun.reflect.GeneratedConstructorAccessor14.newInstance(Unknown Source)
> 	at sun.reflect.DelegatingConstructorAccessorImpl.newInstance(DelegatingConstructorAccessorImpl.java:45)
> 	at java.lang.reflect.Constructor.newInstance(Constructor.java:422)
> 	at org.apache.hadoop.fs.AbstractFileSystem.newInstance(AbstractFileSystem.java:134)
> 	at org.apache.hadoop.fs.AbstractFileSystem.createFileSystem(AbstractFileSystem.java:165)
> 	at org.apache.hadoop.fs.AbstractFileSystem.get(AbstractFileSystem.java:250)
> 	at org.apache.hadoop.fs.FileContext$2.run(FileContext.java:331)
> 	at org.apache.hadoop.fs.FileContext$2.run(FileContext.java:328)
> 	at java.security.AccessController.doPrivileged(Native Method)
> 	at javax.security.auth.Subject.doAs(Subject.java:422)
> 	at org.apache.hadoop.security.UserGroupInformation.doAs(UserGroupInformation.java:1857)
> 	at org.apache.hadoop.fs.FileContext.getAbstractFileSystem(FileContext.java:328)
> 	at org.apache.hadoop.fs.FileContext.getFSofPath(FileContext.java:320)
> 	at org.apache.hadoop.fs.FSLinkResolver.resolve(FSLinkResolver.java:85)
> 	at org.apache.hadoop.fs.FileContext.create(FileContext.java:685)
> 	at org.apache.hadoop.fs.FileContextMainOperationsBaseTest.testGetFileContext1(FileContextMainOperationsBaseTest.java:1350)
> 	at sun.reflect.NativeMethodAccessorImpl.invoke0(Native Method)
> 	at sun.reflect.NativeMethodAccessorImpl.invoke(NativeMethodAccessorImpl.java:62)
> 	at sun.reflect.DelegatingMethodAccessorImpl.invoke(DelegatingMethodAccessorImpl.java:43)
> 	at java.lang.reflect.Method.invoke(Method.java:497)
> 	at org.junit.runners.model.FrameworkMethod$1.runReflectiveCall(FrameworkMethod.java:47)
> 	at org.junit.internal.runners.model.ReflectiveCallable.run(ReflectiveCallable.java:12)
> 	at org.junit.runners.model.FrameworkMethod.invokeExplosively(FrameworkMethod.java:44)
> 	at org.junit.internal.runners.statements.InvokeMethod.evaluate(InvokeMethod.java:17)
> 	at org.junit.internal.runners.statements.RunBefores.evaluate(RunBefores.java:26)
> 	at org.junit.internal.runners.statements.RunAfters.evaluate(RunAfters.java:27)
> 	at org.junit.runners.ParentRunner.runLeaf(ParentRunner.java:271)
> 	at org.junit.runners.BlockJUnit4ClassRunner.runChild(BlockJUnit4ClassRunner.java:70)
> 	at org.junit.runners.BlockJUnit4ClassRunner.runChild(BlockJUnit4ClassRunner.java:50)
> 	at org.junit.runners.ParentRunner$3.run(ParentRunner.java:238)
> 	at org.junit.runners.ParentRunner$1.schedule(ParentRunner.java:63)
> 	at org.junit.runners.ParentRunner.runChildren(ParentRunner.java:236)
> 	at org.junit.runners.ParentRunner.access$000(ParentRunner.java:53)
> 	at org.junit.runners.ParentRunner$2.evaluate(ParentRunner.java:229)
> 	at org.junit.internal.runners.statements.RunBefores.evaluate(RunBefores.java:26)
> 	at org.junit.runners.ParentRunner.run(ParentRunner.java:309)
> 	at org.apache.maven.surefire.junit4.JUnit4Provider.execute(JUnit4Provider.java:264)
> 	at org.apache.maven.surefire.junit4.JUnit4Provider.executeTestSet(JUnit4Provider.java:153)
> 	at org.apache.maven.surefire.junit4.JUnit4Provider.invoke(JUnit4Provider.java:124)
> 	at org.apache.maven.surefire.booter.ForkedBooter.invokeProviderInSameClassLoader(ForkedBooter.java:200)
> 	at org.apache.maven.surefire.booter.ForkedBooter.runSuitesInProcess(ForkedBooter.java:153)
> 	at org.apache.maven.surefire.booter.ForkedBooter.main(ForkedBooter.java:103)
> {noformat}



--
This message was sent by Atlassian JIRA
(v6.3.15#6346)

---------------------------------------------------------------------
To unsubscribe, e-mail: common-issues-unsubscribe@hadoop.apache.org
For additional commands, e-mail: common-issues-help@hadoop.apache.org


Mime
View raw message