hadoop-common-issues mailing list archives

Site index · List index
Message view « Date » · « Thread »
Top « Date » · « Thread »
From "Yiqun Lin (JIRA)" <j...@apache.org>
Subject [jira] [Assigned] (HADOOP-13818) TestLocalFileSystem#testSetTimes fails
Date Mon, 21 Nov 2016 10:01:09 GMT

     [ https://issues.apache.org/jira/browse/HADOOP-13818?page=com.atlassian.jira.plugin.system.issuetabpanels:all-tabpanel
]

Yiqun Lin reassigned HADOOP-13818:
----------------------------------

    Assignee: Yiqun Lin

> TestLocalFileSystem#testSetTimes fails
> --------------------------------------
>
>                 Key: HADOOP-13818
>                 URL: https://issues.apache.org/jira/browse/HADOOP-13818
>             Project: Hadoop Common
>          Issue Type: Bug
>          Components: test
>            Reporter: Akira Ajisaka
>            Assignee: Yiqun Lin
>            Priority: Minor
>
> {noformat}
> Running org.apache.hadoop.fs.TestLocalFileSystem
> Tests run: 20, Failures: 1, Errors: 0, Skipped: 1, Time elapsed: 4.887 sec <<<
FAILURE! - in org.apache.hadoop.fs.TestLocalFileSystem
> testSetTimes(org.apache.hadoop.fs.TestLocalFileSystem)  Time elapsed: 0.084 sec  <<<
FAILURE!
> java.lang.AssertionError: expected:<23456000> but was:<1479176144000>
> 	at org.junit.Assert.fail(Assert.java:88)
> 	at org.junit.Assert.failNotEquals(Assert.java:743)
> 	at org.junit.Assert.assertEquals(Assert.java:118)
> 	at org.junit.Assert.assertEquals(Assert.java:555)
> 	at org.junit.Assert.assertEquals(Assert.java:542)
> 	at org.apache.hadoop.fs.TestLocalFileSystem.checkTimesStatus(TestLocalFileSystem.java:391)
> 	at org.apache.hadoop.fs.TestLocalFileSystem.testSetTimes(TestLocalFileSystem.java:414)
> {noformat}



--
This message was sent by Atlassian JIRA
(v6.3.4#6332)

---------------------------------------------------------------------
To unsubscribe, e-mail: common-issues-unsubscribe@hadoop.apache.org
For additional commands, e-mail: common-issues-help@hadoop.apache.org


Mime
View raw message