hadoop-common-issues mailing list archives

Site index · List index
Message view « Date » · « Thread »
Top « Date » · « Thread »
From "Hadoop QA (JIRA)" <j...@apache.org>
Subject [jira] [Commented] (HADOOP-13787) Azure testGlobStatusThrowsExceptionForUnreadableDir fails
Date Thu, 03 Nov 2016 04:55:58 GMT

    [ https://issues.apache.org/jira/browse/HADOOP-13787?page=com.atlassian.jira.plugin.system.issuetabpanels:comment-tabpanel&focusedCommentId=15631583#comment-15631583
] 

Hadoop QA commented on HADOOP-13787:
------------------------------------

| (/) *{color:green}+1 overall{color}* |
\\
\\
|| Vote || Subsystem || Runtime || Comment ||
| {color:blue}0{color} | {color:blue} reexec {color} | {color:blue}  0m 15s{color} | {color:blue}
Docker mode activated. {color} |
| {color:green}+1{color} | {color:green} @author {color} | {color:green}  0m  0s{color} |
{color:green} The patch does not contain any @author tags. {color} |
| {color:green}+1{color} | {color:green} test4tests {color} | {color:green}  0m  0s{color}
| {color:green} The patch appears to include 1 new or modified test files. {color} |
| {color:green}+1{color} | {color:green} mvninstall {color} | {color:green}  8m 26s{color}
| {color:green} trunk passed {color} |
| {color:green}+1{color} | {color:green} compile {color} | {color:green}  0m 22s{color} |
{color:green} trunk passed {color} |
| {color:green}+1{color} | {color:green} checkstyle {color} | {color:green}  0m 15s{color}
| {color:green} trunk passed {color} |
| {color:green}+1{color} | {color:green} mvnsite {color} | {color:green}  0m 26s{color} |
{color:green} trunk passed {color} |
| {color:green}+1{color} | {color:green} mvneclipse {color} | {color:green}  0m 16s{color}
| {color:green} trunk passed {color} |
| {color:green}+1{color} | {color:green} findbugs {color} | {color:green}  0m 37s{color} |
{color:green} trunk passed {color} |
| {color:green}+1{color} | {color:green} javadoc {color} | {color:green}  0m 16s{color} |
{color:green} trunk passed {color} |
| {color:green}+1{color} | {color:green} mvninstall {color} | {color:green}  0m 19s{color}
| {color:green} the patch passed {color} |
| {color:green}+1{color} | {color:green} compile {color} | {color:green}  0m 21s{color} |
{color:green} the patch passed {color} |
| {color:green}+1{color} | {color:green} javac {color} | {color:green}  0m 21s{color} | {color:green}
the patch passed {color} |
| {color:green}+1{color} | {color:green} checkstyle {color} | {color:green}  0m 12s{color}
| {color:green} the patch passed {color} |
| {color:green}+1{color} | {color:green} mvnsite {color} | {color:green}  0m 22s{color} |
{color:green} the patch passed {color} |
| {color:green}+1{color} | {color:green} mvneclipse {color} | {color:green}  0m 13s{color}
| {color:green} the patch passed {color} |
| {color:green}+1{color} | {color:green} whitespace {color} | {color:green}  0m  0s{color}
| {color:green} The patch has no whitespace issues. {color} |
| {color:green}+1{color} | {color:green} findbugs {color} | {color:green}  0m 41s{color} |
{color:green} the patch passed {color} |
| {color:green}+1{color} | {color:green} javadoc {color} | {color:green}  0m 13s{color} |
{color:green} the patch passed {color} |
| {color:green}+1{color} | {color:green} unit {color} | {color:green}  1m 36s{color} | {color:green}
hadoop-azure in the patch passed. {color} |
| {color:green}+1{color} | {color:green} asflicense {color} | {color:green}  0m 18s{color}
| {color:green} The patch does not generate ASF License warnings. {color} |
| {color:black}{color} | {color:black} {color} | {color:black} 16m 28s{color} | {color:black}
{color} |
\\
\\
|| Subsystem || Report/Notes ||
| Docker |  Image:yetus/hadoop:9560f25 |
| JIRA Issue | HADOOP-13787 |
| JIRA Patch URL | https://issues.apache.org/jira/secure/attachment/12836724/HADOOP-13787.001.patch
|
| Optional Tests |  asflicense  compile  javac  javadoc  mvninstall  mvnsite  unit  findbugs
 checkstyle  |
| uname | Linux a34db7a4b94a 3.13.0-36-lowlatency #63-Ubuntu SMP PREEMPT Wed Sep 3 21:56:12
UTC 2014 x86_64 x86_64 x86_64 GNU/Linux |
| Build tool | maven |
| Personality | /testptch/hadoop/patchprocess/precommit/personality/provided.sh |
| git revision | trunk / 7e521c5 |
| Default Java | 1.8.0_101 |
| findbugs | v3.0.0 |
|  Test Results | https://builds.apache.org/job/PreCommit-HADOOP-Build/10970/testReport/ |
| modules | C: hadoop-tools/hadoop-azure U: hadoop-tools/hadoop-azure |
| Console output | https://builds.apache.org/job/PreCommit-HADOOP-Build/10970/console |
| Powered by | Apache Yetus 0.4.0-SNAPSHOT   http://yetus.apache.org |


This message was automatically generated.



> Azure testGlobStatusThrowsExceptionForUnreadableDir fails
> ---------------------------------------------------------
>
>                 Key: HADOOP-13787
>                 URL: https://issues.apache.org/jira/browse/HADOOP-13787
>             Project: Hadoop Common
>          Issue Type: Bug
>          Components: fs/azure
>    Affects Versions: 3.0.0-alpha2
>            Reporter: John Zhuge
>            Assignee: John Zhuge
>            Priority: Minor
>             Fix For: 3.0.0-alpha2
>
>         Attachments: HADOOP-13787.001.patch
>
>
> Test {{TestNativeAzureFileSystemOperationsMocked>FSMainOperationsBaseTest.testGlobStatusThrowsExceptionForUnreadableDir}}
failed in trunk:
> {noformat}
> Running org.apache.hadoop.fs.azure.TestNativeAzureFileSystemOperationsMocked
> Tests run: 1, Failures: 1, Errors: 0, Skipped: 0, Time elapsed: 1.182 sec <<<
FAILURE! - in org.apache.hadoop.fs.azure.TestNativeAzureFileSystemOperationsMocked
> testGlobStatusThrowsExceptionForUnreadableDir(org.apache.hadoop.fs.azure.TestNativeAzureFileSystemOperationsMocked)
Time elapsed: 1.111 sec <<< FAILURE!
> java.lang.AssertionError: Should throw IOException
> at org.junit.Assert.fail(Assert.java:88)
> at org.apache.hadoop.fs.FSMainOperationsBaseTest.testGlobStatusThrowsExceptionForUnreadableDir(FSMainOperationsBaseTest.java:643)
> at sun.reflect.NativeMethodAccessorImpl.invoke0(Native Method)
> at sun.reflect.NativeMethodAccessorImpl.invoke(NativeMethodAccessorImpl.java:62)
> at sun.reflect.DelegatingMethodAccessorImpl.invoke(DelegatingMethodAccessorImpl.java:43)
> at java.lang.reflect.Method.invoke(Method.java:497)
> at org.junit.runners.model.FrameworkMethod$1.runReflectiveCall(FrameworkMethod.java:47)
> at org.junit.internal.runners.model.ReflectiveCallable.run(ReflectiveCallable.java:12)
> at org.junit.runners.model.FrameworkMethod.invokeExplosively(FrameworkMethod.java:44)
> at org.junit.internal.runners.statements.InvokeMethod.evaluate(InvokeMethod.java:17)
> at org.junit.internal.runners.statements.RunBefores.evaluate(RunBefores.java:26)
> at org.junit.internal.runners.statements.RunAfters.evaluate(RunAfters.java:27)
> at org.junit.runners.ParentRunner.runLeaf(ParentRunner.java:271)
> at org.junit.runners.BlockJUnit4ClassRunner.runChild(BlockJUnit4ClassRunner.java:70)
> at org.junit.runners.BlockJUnit4ClassRunner.runChild(BlockJUnit4ClassRunner.java:50)
> at org.junit.runners.ParentRunner$3.run(ParentRunner.java:238)
> at org.junit.runners.ParentRunner$1.schedule(ParentRunner.java:63)
> at org.junit.runners.ParentRunner.runChildren(ParentRunner.java:236)
> at org.junit.runners.ParentRunner.access$000(ParentRunner.java:53)
> at org.junit.runners.ParentRunner$2.evaluate(ParentRunner.java:229)
> at org.junit.runners.ParentRunner.run(ParentRunner.java:309)
> at org.apache.maven.surefire.junit4.JUnit4Provider.execute(JUnit4Provider.java:254)
> at org.apache.maven.surefire.junit4.JUnit4Provider.executeTestSet(JUnit4Provider.java:149)
> at org.apache.maven.surefire.junit4.JUnit4Provider.invoke(JUnit4Provider.java:124)
> at org.apache.maven.surefire.booter.ForkedBooter.invokeProviderInSameClassLoader(ForkedBooter.java:200)
> at org.apache.maven.surefire.booter.ForkedBooter.runSuitesInProcess(ForkedBooter.java:153)
> at org.apache.maven.surefire.booter.ForkedBooter.main(ForkedBooter.java:103)
> Results :
> Failed tests:
> TestNativeAzureFileSystemOperationsMocked>FSMainOperationsBaseTest.testGlobStatusThrowsExceptionForUnreadableDir:643
Should throw IOException
> Tests run: 1, Failures: 1, Errors: 0, Skipped: 0
> {noformat}



--
This message was sent by Atlassian JIRA
(v6.3.4#6332)

---------------------------------------------------------------------
To unsubscribe, e-mail: common-issues-unsubscribe@hadoop.apache.org
For additional commands, e-mail: common-issues-help@hadoop.apache.org


Mime
View raw message