hadoop-common-issues mailing list archives

Site index · List index
Message view « Date » · « Thread »
Top « Date » · « Thread »
From "Allen Wittenauer (JIRA)" <j...@apache.org>
Subject [jira] [Commented] (HADOOP-13176) testDanglingLink fails on OS X
Date Wed, 18 May 2016 18:49:12 GMT

    [ https://issues.apache.org/jira/browse/HADOOP-13176?page=com.atlassian.jira.plugin.system.issuetabpanels:comment-tabpanel&focusedCommentId=15289573#comment-15289573
] 

Allen Wittenauer commented on HADOOP-13176:
-------------------------------------------


Related test failures:

{code}
testDanglingLink(org.apache.hadoop.fs.TestSymlinkLocalFSFileContext)  Time elapsed: 0.226
sec  <<< FAILURE!
org.junit.ComparisonFailure: expected:<[admin]> but was:<[staff]>
	at org.junit.Assert.assertEquals(Assert.java:115)
	at org.junit.Assert.assertEquals(Assert.java:144)
	at org.apache.hadoop.fs.TestSymlinkLocalFS.testDanglingLink(TestSymlinkLocalFS.java:158)
	at sun.reflect.NativeMethodAccessorImpl.invoke0(Native Method)
	at sun.reflect.NativeMethodAccessorImpl.invoke(NativeMethodAccessorImpl.java:62)
	at sun.reflect.DelegatingMethodAccessorImpl.invoke(DelegatingMethodAccessorImpl.java:43)
	at java.lang.reflect.Method.invoke(Method.java:498)
	at org.junit.runners.model.FrameworkMethod$1.runReflectiveCall(FrameworkMethod.java:47)
	at org.junit.internal.runners.model.ReflectiveCallable.run(ReflectiveCallable.java:12)
	at org.junit.runners.model.FrameworkMethod.invokeExplosively(FrameworkMethod.java:44)
	at org.junit.internal.runners.statements.InvokeMethod.evaluate(InvokeMethod.java:17)
	at org.junit.internal.runners.statements.FailOnTimeout$StatementThread.run(FailOnTimeout.java:74)

Tests run: 63, Failures: 1, Errors: 0, Skipped: 7, Time elapsed: 10.236 sec <<< FAILURE!
- in org.apache.hadoop.fs.TestSymlinkLocalFSFileSystem
testDanglingLink(org.apache.hadoop.fs.TestSymlinkLocalFSFileSystem)  Time elapsed: 0.097 sec
 <<< FAILURE!
org.junit.ComparisonFailure: expected:<[admin]> but was:<[staff]>
	at org.junit.Assert.assertEquals(Assert.java:115)
	at org.junit.Assert.assertEquals(Assert.java:144)
	at org.apache.hadoop.fs.TestSymlinkLocalFS.testDanglingLink(TestSymlinkLocalFS.java:158)
	at sun.reflect.NativeMethodAccessorImpl.invoke0(Native Method)
	at sun.reflect.NativeMethodAccessorImpl.invoke(NativeMethodAccessorImpl.java:62)
	at sun.reflect.DelegatingMethodAccessorImpl.invoke(DelegatingMethodAccessorImpl.java:43)
	at java.lang.reflect.Method.invoke(Method.java:498)
	at org.junit.runners.model.FrameworkMethod$1.runReflectiveCall(FrameworkMethod.java:47)
	at org.junit.internal.runners.model.ReflectiveCallable.run(ReflectiveCallable.java:12)
	at org.junit.runners.model.FrameworkMethod.invokeExplosively(FrameworkMethod.java:44)
	at org.junit.internal.runners.statements.InvokeMethod.evaluate(InvokeMethod.java:17)
	at org.junit.internal.runners.statements.FailOnTimeout$StatementThread.run(FailOnTimeout.java:74)
{code}

> testDanglingLink fails on OS X
> ------------------------------
>
>                 Key: HADOOP-13176
>                 URL: https://issues.apache.org/jira/browse/HADOOP-13176
>             Project: Hadoop Common
>          Issue Type: Test
>          Components: test
>    Affects Versions: 3.0.0-alpha1
>            Reporter: Allen Wittenauer
>
> This test assumes that the list of groups is given in a certain order.  This is not the
case on at least OS X 10.9.



--
This message was sent by Atlassian JIRA
(v6.3.4#6332)

---------------------------------------------------------------------
To unsubscribe, e-mail: common-issues-unsubscribe@hadoop.apache.org
For additional commands, e-mail: common-issues-help@hadoop.apache.org


Mime
View raw message