hadoop-common-issues mailing list archives

Site index · List index
Message view « Date » · « Thread »
Top « Date » · « Thread »
From "Hadoop QA (JIRA)" <j...@apache.org>
Subject [jira] [Commented] (HADOOP-12948) Maven profile startKdc is broken
Date Fri, 25 Mar 2016 18:19:25 GMT

    [ https://issues.apache.org/jira/browse/HADOOP-12948?page=com.atlassian.jira.plugin.system.issuetabpanels:comment-tabpanel&focusedCommentId=15212199#comment-15212199
] 

Hadoop QA commented on HADOOP-12948:
------------------------------------

| (x) *{color:red}-1 overall{color}* |
\\
\\
|| Vote || Subsystem || Runtime || Comment ||
| {color:blue}0{color} | {color:blue} reexec {color} | {color:blue} 0m 13s {color} | {color:blue}
Docker mode activated. {color} |
| {color:blue}0{color} | {color:blue} shelldocs {color} | {color:blue} 0m 2s {color} | {color:blue}
Shelldocs was not available. {color} |
| {color:green}+1{color} | {color:green} @author {color} | {color:green} 0m 0s {color} | {color:green}
The patch does not contain any @author tags. {color} |
| {color:green}+1{color} | {color:green} test4tests {color} | {color:green} 0m 0s {color}
| {color:green} The patch appears to include 7 new or modified test files. {color} |
| {color:green}+1{color} | {color:green} mvninstall {color} | {color:green} 6m 34s {color}
| {color:green} trunk passed {color} |
| {color:green}+1{color} | {color:green} compile {color} | {color:green} 5m 39s {color} |
{color:green} trunk passed with JDK v1.8.0_74 {color} |
| {color:green}+1{color} | {color:green} compile {color} | {color:green} 6m 33s {color} |
{color:green} trunk passed with JDK v1.7.0_95 {color} |
| {color:green}+1{color} | {color:green} checkstyle {color} | {color:green} 0m 20s {color}
| {color:green} trunk passed {color} |
| {color:green}+1{color} | {color:green} mvnsite {color} | {color:green} 0m 58s {color} |
{color:green} trunk passed {color} |
| {color:green}+1{color} | {color:green} mvneclipse {color} | {color:green} 0m 14s {color}
| {color:green} trunk passed {color} |
| {color:green}+1{color} | {color:green} findbugs {color} | {color:green} 1m 35s {color} |
{color:green} trunk passed {color} |
| {color:green}+1{color} | {color:green} javadoc {color} | {color:green} 0m 53s {color} |
{color:green} trunk passed with JDK v1.8.0_74 {color} |
| {color:green}+1{color} | {color:green} javadoc {color} | {color:green} 1m 5s {color} | {color:green}
trunk passed with JDK v1.7.0_95 {color} |
| {color:green}+1{color} | {color:green} mvninstall {color} | {color:green} 0m 43s {color}
| {color:green} the patch passed {color} |
| {color:green}+1{color} | {color:green} compile {color} | {color:green} 7m 7s {color} | {color:green}
the patch passed with JDK v1.8.0_74 {color} |
| {color:green}+1{color} | {color:green} javac {color} | {color:green} 7m 7s {color} | {color:green}
the patch passed {color} |
| {color:green}+1{color} | {color:green} compile {color} | {color:green} 7m 21s {color} |
{color:green} the patch passed with JDK v1.7.0_95 {color} |
| {color:green}+1{color} | {color:green} javac {color} | {color:green} 7m 21s {color} | {color:green}
the patch passed {color} |
| {color:green}+1{color} | {color:green} checkstyle {color} | {color:green} 0m 21s {color}
| {color:green} the patch passed {color} |
| {color:green}+1{color} | {color:green} mvnsite {color} | {color:green} 0m 55s {color} |
{color:green} the patch passed {color} |
| {color:green}+1{color} | {color:green} mvneclipse {color} | {color:green} 0m 14s {color}
| {color:green} the patch passed {color} |
| {color:green}+1{color} | {color:green} shellcheck {color} | {color:green} 0m 9s {color}
| {color:green} The applied patch generated 0 new + 93 unchanged - 1 fixed = 93 total (was
94) {color} |
| {color:green}+1{color} | {color:green} whitespace {color} | {color:green} 0m 0s {color}
| {color:green} Patch has no whitespace issues. {color} |
| {color:green}+1{color} | {color:green} xml {color} | {color:green} 0m 1s {color} | {color:green}
The patch has no ill-formed XML file. {color} |
| {color:green}+1{color} | {color:green} findbugs {color} | {color:green} 1m 50s {color} |
{color:green} the patch passed {color} |
| {color:green}+1{color} | {color:green} javadoc {color} | {color:green} 0m 53s {color} |
{color:green} the patch passed with JDK v1.8.0_74 {color} |
| {color:green}+1{color} | {color:green} javadoc {color} | {color:green} 1m 3s {color} | {color:green}
the patch passed with JDK v1.7.0_95 {color} |
| {color:red}-1{color} | {color:red} unit {color} | {color:red} 6m 25s {color} | {color:red}
hadoop-common in the patch failed with JDK v1.8.0_74. {color} |
| {color:red}-1{color} | {color:red} unit {color} | {color:red} 6m 50s {color} | {color:red}
hadoop-common in the patch failed with JDK v1.7.0_95. {color} |
| {color:red}-1{color} | {color:red} asflicense {color} | {color:red} 0m 23s {color} | {color:red}
Patch generated 2 ASF License warnings. {color} |
| {color:black}{color} | {color:black} {color} | {color:black} 59m 30s {color} | {color:black}
{color} |
\\
\\
|| Reason || Tests ||
| JDK v1.8.0_74 Timed out junit tests | org.apache.hadoop.util.TestNativeLibraryChecker |
| JDK v1.7.0_95 Timed out junit tests | org.apache.hadoop.util.TestNativeLibraryChecker |
\\
\\
|| Subsystem || Report/Notes ||
| Docker |  Image:yetus/hadoop:fbe3e86 |
| JIRA Patch URL | https://issues.apache.org/jira/secure/attachment/12795432/0001-HADOOP-12948-Maven-profile-startKdc-is-broken.patch
|
| JIRA Issue | HADOOP-12948 |
| Optional Tests |  asflicense  compile  javac  javadoc  mvninstall  mvnsite  unit  xml  findbugs
 checkstyle  shellcheck  shelldocs  |
| uname | Linux 8d57fcc5a1b6 3.13.0-36-lowlatency #63-Ubuntu SMP PREEMPT Wed Sep 3 21:56:12
UTC 2014 x86_64 x86_64 x86_64 GNU/Linux |
| Build tool | maven |
| Personality | /testptch/hadoop/patchprocess/precommit/personality/provided.sh |
| git revision | trunk / 2c268cc |
| Default Java | 1.7.0_95 |
| Multi-JDK versions |  /usr/lib/jvm/java-8-oracle:1.8.0_74 /usr/lib/jvm/java-7-openjdk-amd64:1.7.0_95
|
| shellcheck | v0.4.3 |
| findbugs | v3.0.0 |
| unit | https://builds.apache.org/job/PreCommit-HADOOP-Build/8928/artifact/patchprocess/patch-unit-hadoop-common-project_hadoop-common-jdk1.8.0_74.txt
|
| unit | https://builds.apache.org/job/PreCommit-HADOOP-Build/8928/artifact/patchprocess/patch-unit-hadoop-common-project_hadoop-common-jdk1.7.0_95.txt
|
| unit test logs |  https://builds.apache.org/job/PreCommit-HADOOP-Build/8928/artifact/patchprocess/patch-unit-hadoop-common-project_hadoop-common-jdk1.8.0_74.txt
https://builds.apache.org/job/PreCommit-HADOOP-Build/8928/artifact/patchprocess/patch-unit-hadoop-common-project_hadoop-common-jdk1.7.0_95.txt
|
| JDK v1.7.0_95  Test Results | https://builds.apache.org/job/PreCommit-HADOOP-Build/8928/testReport/
|
| asflicense | https://builds.apache.org/job/PreCommit-HADOOP-Build/8928/artifact/patchprocess/patch-asflicense-problems.txt
|
| modules | C: hadoop-common-project/hadoop-common U: hadoop-common-project/hadoop-common
|
| Console output | https://builds.apache.org/job/PreCommit-HADOOP-Build/8928/console |
| Powered by | Apache Yetus 0.2.0   http://yetus.apache.org |


This message was automatically generated.



> Maven profile startKdc is broken
> --------------------------------
>
>                 Key: HADOOP-12948
>                 URL: https://issues.apache.org/jira/browse/HADOOP-12948
>             Project: Hadoop Common
>          Issue Type: Bug
>          Components: test
>    Affects Versions: 3.0.0
>         Environment: Mac OS
>            Reporter: Wei-Chiu Chuang
>            Assignee: Wei-Chiu Chuang
>         Attachments: 0001-HADOOP-12948-Maven-profile-startKdc-is-broken.patch, HADOOP-12948.001.patch,
HADOOP-12948.002.patch, HADOOP-12948.003.patch, HADOOP-12948.004.patch
>
>
> {noformat}
> mvn install -Dtest=TestUGIWithSecurityOn -DstartKdc=true
> main:
>      [exec] xargs: illegal option -- -
>      [exec] usage: xargs [-0opt] [-E eofstr] [-I replstr [-R replacements]] [-J replstr]
>      [exec]              [-L number] [-n number [-x]] [-P maxprocs] [-s size]
>      [exec]              [utility [argument ...]]
>      [exec] Result: 1
>       [get] Getting: http://newverhost.com/pub//directory/apacheds/unstable/1.5/1.5.7/apacheds-1.5.7.tar.gz
>       [get] To: /Users/weichiu/sandbox/hadoop/hadoop-common-project/hadoop-common/target/test-classes/kdc/downloads/apacheds-1.5.7.tar.gz
>       [get] Error getting http://newverhost.com/pub//directory/apacheds/unstable/1.5/1.5.7/apacheds-1.5.7.tar.gz
to /Users/weichiu/sandbox/hadoop/hadoop-common-project/hadoop-common/target/test-classes/kdc/downloads/apacheds-1.5.7.tar.gz
> [INFO] ------------------------------------------------------------------------
> [INFO] BUILD FAILURE
> [INFO] ------------------------------------------------------------------------
> [INFO] Total time: 8.448 s
> [INFO] Finished at: 2016-03-21T10:00:56-07:00
> [INFO] Final Memory: 31M/439M
> [INFO] ------------------------------------------------------------------------
> [ERROR] Failed to execute goal org.apache.maven.plugins:maven-antrun-plugin:1.7:run (kdc)
on project hadoop-common: An Ant BuildException has occured: java.net.UnknownHostException:
newverhost.com
> [ERROR] around Ant part ...<get dest="/Users/weichiu/sandbox/hadoop/hadoop-common-project/hadoop-common/target/test-classes/kdc/downloads"
skipexisting="true" verbose="true" src="http://newverhost.com/pub//directory/apacheds/unstable/1.5/1.5.7/apacheds-1.5.7.tar.gz"/>...
@ 7:244 in /Users/weichiu/sandbox/hadoop/hadoop-common-project/hadoop-common/target/antrun/build-main.xml
> [ERROR] -> [Help 1]
> [ERROR]
> [ERROR] To see the full stack trace of the errors, re-run Maven with the -e switch.
> [ERROR] Re-run Maven using the -X switch to enable full debug logging.
> [ERROR]
> [ERROR] For more information about the errors and possible solutions, please read the
following articles:
> [ERROR] [Help 1] http://cwiki.apache.org/confluence/display/MAVEN/MojoExecutionException
> {noformat}
> I'm using Mac so part of the reason might be my operating system (even though the pom.xml
stated it supported Mac), but the major problem is that it attempted to download apacheds
from newverhost.com, which does not seem exist any more.
> These tests were implemented in HADOOP-8078, and must have -DstartKdc=true in order to
run them.



--
This message was sent by Atlassian JIRA
(v6.3.4#6332)

Mime
View raw message