hadoop-common-issues mailing list archives

Site index · List index
Message view « Date » · « Thread »
Top « Date » · « Thread »
From "Chris Nauroth (JIRA)" <j...@apache.org>
Subject [jira] [Commented] (HADOOP-12815) TestS3ContractRootDir#testRmEmptyRootDirNonRecursive and TestS3ContractRootDir#testRmRootRecursive fail on branch-2.
Date Wed, 17 Feb 2016 19:03:18 GMT

    [ https://issues.apache.org/jira/browse/HADOOP-12815?page=com.atlassian.jira.plugin.system.issuetabpanels:comment-tabpanel&focusedCommentId=15150981#comment-15150981
] 

Chris Nauroth commented on HADOOP-12815:
----------------------------------------

{code}
Tests run: 6, Failures: 0, Errors: 2, Skipped: 0, Time elapsed: 6.288 sec <<< FAILURE!
- in org.apache.hadoop.fs.contract.s3.TestS3ContractRootDir
testRmEmptyRootDirNonRecursive(org.apache.hadoop.fs.contract.s3.TestS3ContractRootDir)  Time
elapsed: 1.984 sec  <<< ERROR!
java.io.FileNotFoundException: /: No such file or directory.
	at org.apache.hadoop.fs.s3.S3FileSystem.getFileStatus(S3FileSystem.java:356)
	at org.apache.hadoop.fs.contract.ContractTestUtils.assertIsDirectory(ContractTestUtils.java:464)
	at org.apache.hadoop.fs.contract.AbstractContractRootDirectoryTest.testRmEmptyRootDirNonRecursive(AbstractContractRootDirectoryTest.java:67)
	at sun.reflect.NativeMethodAccessorImpl.invoke0(Native Method)
	at sun.reflect.NativeMethodAccessorImpl.invoke(NativeMethodAccessorImpl.java:57)
	at sun.reflect.DelegatingMethodAccessorImpl.invoke(DelegatingMethodAccessorImpl.java:43)
	at java.lang.reflect.Method.invoke(Method.java:606)
	at org.junit.runners.model.FrameworkMethod$1.runReflectiveCall(FrameworkMethod.java:47)
	at org.junit.internal.runners.model.ReflectiveCallable.run(ReflectiveCallable.java:12)
	at org.junit.runners.model.FrameworkMethod.invokeExplosively(FrameworkMethod.java:44)
	at org.junit.internal.runners.statements.InvokeMethod.evaluate(InvokeMethod.java:17)
	at org.junit.internal.runners.statements.RunBefores.evaluate(RunBefores.java:26)
	at org.junit.internal.runners.statements.RunAfters.evaluate(RunAfters.java:27)
	at org.junit.internal.runners.statements.FailOnTimeout$StatementThread.run(FailOnTimeout.java:74)

testRmRootRecursive(org.apache.hadoop.fs.contract.s3.TestS3ContractRootDir)  Time elapsed:
1.029 sec  <<< ERROR!
java.io.FileNotFoundException: /: No such file or directory.
	at org.apache.hadoop.fs.s3.S3FileSystem.getFileStatus(S3FileSystem.java:356)
	at org.apache.hadoop.fs.contract.ContractTestUtils.assertIsDirectory(ContractTestUtils.java:464)
	at org.apache.hadoop.fs.contract.AbstractContractRootDirectoryTest.testRmRootRecursive(AbstractContractRootDirectoryTest.java:101)
	at sun.reflect.NativeMethodAccessorImpl.invoke0(Native Method)
	at sun.reflect.NativeMethodAccessorImpl.invoke(NativeMethodAccessorImpl.java:57)
	at sun.reflect.DelegatingMethodAccessorImpl.invoke(DelegatingMethodAccessorImpl.java:43)
	at java.lang.reflect.Method.invoke(Method.java:606)
	at org.junit.runners.model.FrameworkMethod$1.runReflectiveCall(FrameworkMethod.java:47)
	at org.junit.internal.runners.model.ReflectiveCallable.run(ReflectiveCallable.java:12)
	at org.junit.runners.model.FrameworkMethod.invokeExplosively(FrameworkMethod.java:44)
	at org.junit.internal.runners.statements.InvokeMethod.evaluate(InvokeMethod.java:17)
	at org.junit.internal.runners.statements.RunBefores.evaluate(RunBefores.java:26)
	at org.junit.internal.runners.statements.RunAfters.evaluate(RunAfters.java:27)
	at org.junit.internal.runners.statements.FailOnTimeout$StatementThread.run(FailOnTimeout.java:74)
{code}


> TestS3ContractRootDir#testRmEmptyRootDirNonRecursive and TestS3ContractRootDir#testRmRootRecursive
fail on branch-2.
> --------------------------------------------------------------------------------------------------------------------
>
>                 Key: HADOOP-12815
>                 URL: https://issues.apache.org/jira/browse/HADOOP-12815
>             Project: Hadoop Common
>          Issue Type: Bug
>            Reporter: Chris Nauroth
>
> TestS3ContractRootDir#testRmEmptyRootDirNonRecursive and TestS3ContractRootDir#testRmRootRecursive
fail on branch-2.  The tests pass on trunk.



--
This message was sent by Atlassian JIRA
(v6.3.4#6332)

Mime
View raw message