hadoop-common-issues mailing list archives

Site index · List index
Message view « Date » · « Thread »
Top « Date » · « Thread »
From "Hadoop QA (JIRA)" <j...@apache.org>
Subject [jira] [Commented] (HADOOP-12588) Fix intermittent test failure of TestGangliaMetrics
Date Tue, 12 Jan 2016 19:11:40 GMT

    [ https://issues.apache.org/jira/browse/HADOOP-12588?page=com.atlassian.jira.plugin.system.issuetabpanels:comment-tabpanel&focusedCommentId=15094550#comment-15094550
] 

Hadoop QA commented on HADOOP-12588:
------------------------------------

| (x) *{color:red}-1 overall{color}* |
\\
\\
|| Vote || Subsystem || Runtime || Comment ||
| {color:blue}0{color} | {color:blue} reexec {color} | {color:blue} 0m 0s {color} | {color:blue}
Docker mode activated. {color} |
| {color:green}+1{color} | {color:green} @author {color} | {color:green} 0m 0s {color} | {color:green}
The patch does not contain any @author tags. {color} |
| {color:red}-1{color} | {color:red} test4tests {color} | {color:red} 0m 0s {color} | {color:red}
The patch doesn't appear to include any new or modified tests. Please justify why no new tests
are needed for this patch. Also please list what manual steps were performed to verify this
patch. {color} |
| {color:green}+1{color} | {color:green} mvninstall {color} | {color:green} 8m 14s {color}
| {color:green} trunk passed {color} |
| {color:green}+1{color} | {color:green} compile {color} | {color:green} 8m 56s {color} |
{color:green} trunk passed with JDK v1.8.0_66 {color} |
| {color:green}+1{color} | {color:green} compile {color} | {color:green} 9m 34s {color} |
{color:green} trunk passed with JDK v1.7.0_91 {color} |
| {color:green}+1{color} | {color:green} checkstyle {color} | {color:green} 0m 17s {color}
| {color:green} trunk passed {color} |
| {color:green}+1{color} | {color:green} mvnsite {color} | {color:green} 1m 10s {color} |
{color:green} trunk passed {color} |
| {color:green}+1{color} | {color:green} mvneclipse {color} | {color:green} 0m 14s {color}
| {color:green} trunk passed {color} |
| {color:green}+1{color} | {color:green} findbugs {color} | {color:green} 1m 56s {color} |
{color:green} trunk passed {color} |
| {color:green}+1{color} | {color:green} javadoc {color} | {color:green} 0m 59s {color} |
{color:green} trunk passed with JDK v1.8.0_66 {color} |
| {color:green}+1{color} | {color:green} javadoc {color} | {color:green} 1m 10s {color} |
{color:green} trunk passed with JDK v1.7.0_91 {color} |
| {color:green}+1{color} | {color:green} mvninstall {color} | {color:green} 1m 39s {color}
| {color:green} the patch passed {color} |
| {color:green}+1{color} | {color:green} compile {color} | {color:green} 8m 55s {color} |
{color:green} the patch passed with JDK v1.8.0_66 {color} |
| {color:green}+1{color} | {color:green} javac {color} | {color:green} 8m 55s {color} | {color:green}
the patch passed {color} |
| {color:green}+1{color} | {color:green} compile {color} | {color:green} 9m 28s {color} |
{color:green} the patch passed with JDK v1.7.0_91 {color} |
| {color:green}+1{color} | {color:green} javac {color} | {color:green} 9m 28s {color} | {color:green}
the patch passed {color} |
| {color:red}-1{color} | {color:red} checkstyle {color} | {color:red} 0m 18s {color} | {color:red}
Patch generated 1 new checkstyle issues in hadoop-common-project/hadoop-common (total was
23, now 23). {color} |
| {color:green}+1{color} | {color:green} mvnsite {color} | {color:green} 1m 9s {color} | {color:green}
the patch passed {color} |
| {color:green}+1{color} | {color:green} mvneclipse {color} | {color:green} 0m 15s {color}
| {color:green} the patch passed {color} |
| {color:green}+1{color} | {color:green} whitespace {color} | {color:green} 0m 0s {color}
| {color:green} Patch has no whitespace issues. {color} |
| {color:red}-1{color} | {color:red} findbugs {color} | {color:red} 2m 11s {color} | {color:red}
hadoop-common-project/hadoop-common introduced 1 new FindBugs issues. {color} |
| {color:green}+1{color} | {color:green} javadoc {color} | {color:green} 0m 58s {color} |
{color:green} the patch passed with JDK v1.8.0_66 {color} |
| {color:green}+1{color} | {color:green} javadoc {color} | {color:green} 1m 9s {color} | {color:green}
the patch passed with JDK v1.7.0_91 {color} |
| {color:red}-1{color} | {color:red} unit {color} | {color:red} 8m 1s {color} | {color:red}
hadoop-common in the patch failed with JDK v1.8.0_66. {color} |
| {color:green}+1{color} | {color:green} unit {color} | {color:green} 8m 23s {color} | {color:green}
hadoop-common in the patch passed with JDK v1.7.0_91. {color} |
| {color:green}+1{color} | {color:green} asflicense {color} | {color:green} 0m 25s {color}
| {color:green} Patch does not generate ASF License warnings. {color} |
| {color:black}{color} | {color:black} {color} | {color:black} 76m 44s {color} | {color:black}
{color} |
\\
\\
|| Reason || Tests ||
| FindBugs | module:hadoop-common-project/hadoop-common |
|  |  Inconsistent synchronization of org.apache.hadoop.metrics2.sink.ganglia.AbstractGangliaSink.datagramSocket;
locked 66% of time  Unsynchronized access at AbstractGangliaSink.java:66% of time  Unsynchronized
access at AbstractGangliaSink.java:[line 279] |
| JDK v1.8.0_66 Failed junit tests | hadoop.fs.TestLocalFsFCStatistics |
\\
\\
|| Subsystem || Report/Notes ||
| Docker |  Image:yetus/hadoop:0ca8df7 |
| JIRA Patch URL | https://issues.apache.org/jira/secure/attachment/12781845/HADOOP-12588.addendum.patch
|
| JIRA Issue | HADOOP-12588 |
| Optional Tests |  asflicense  compile  javac  javadoc  mvninstall  mvnsite  unit  findbugs
 checkstyle  |
| uname | Linux d431937dfefb 3.13.0-36-lowlatency #63-Ubuntu SMP PREEMPT Wed Sep 3 21:56:12
UTC 2014 x86_64 x86_64 x86_64 GNU/Linux |
| Build tool | maven |
| Personality | /testptch/hadoop/patchprocess/precommit/personality/provided.sh |
| git revision | trunk / 25051c3 |
| Default Java | 1.7.0_91 |
| Multi-JDK versions |  /usr/lib/jvm/java-8-oracle:1.8.0_66 /usr/lib/jvm/java-7-openjdk-amd64:1.7.0_91
|
| findbugs | v3.0.0 |
| checkstyle | https://builds.apache.org/job/PreCommit-HADOOP-Build/8392/artifact/patchprocess/diff-checkstyle-hadoop-common-project_hadoop-common.txt
|
| findbugs | https://builds.apache.org/job/PreCommit-HADOOP-Build/8392/artifact/patchprocess/new-findbugs-hadoop-common-project_hadoop-common.html
|
| unit | https://builds.apache.org/job/PreCommit-HADOOP-Build/8392/artifact/patchprocess/patch-unit-hadoop-common-project_hadoop-common-jdk1.8.0_66.txt
|
| unit test logs |  https://builds.apache.org/job/PreCommit-HADOOP-Build/8392/artifact/patchprocess/patch-unit-hadoop-common-project_hadoop-common-jdk1.8.0_66.txt
|
| JDK v1.7.0_91  Test Results | https://builds.apache.org/job/PreCommit-HADOOP-Build/8392/testReport/
|
| modules | C: hadoop-common-project/hadoop-common U: hadoop-common-project/hadoop-common
|
| Max memory used | 76MB |
| Powered by | Apache Yetus 0.2.0-SNAPSHOT   http://yetus.apache.org |
| Console output | https://builds.apache.org/job/PreCommit-HADOOP-Build/8392/console |


This message was automatically generated.



> Fix intermittent test failure of TestGangliaMetrics
> ---------------------------------------------------
>
>                 Key: HADOOP-12588
>                 URL: https://issues.apache.org/jira/browse/HADOOP-12588
>             Project: Hadoop Common
>          Issue Type: Bug
>            Reporter: Tsuyoshi Ozawa
>            Assignee: Masatake Iwasaki
>             Fix For: 2.8.0, 2.7.3
>
>         Attachments: HADOOP-12588.001.patch, HADOOP-12588.addendum.patch
>
>
> Jenkins found this test failure on HADOOP-11149.
> {quote}
> Tests run: 2, Failures: 1, Errors: 0, Skipped: 0, Time elapsed: 0.773 sec <<<
FAILURE! - in org.apache.hadoop.metrics2.impl.TestGangliaMetrics
> testGangliaMetrics2(org.apache.hadoop.metrics2.impl.TestGangliaMetrics)  Time elapsed:
0.39 sec  <<< FAILURE!
> java.lang.AssertionError: Missing metrics: test.s1rec.Xxx
> 	at org.junit.Assert.fail(Assert.java:88)
> 	at org.junit.Assert.assertTrue(Assert.java:41)
> 	at org.apache.hadoop.metrics2.impl.TestGangliaMetrics.checkMetrics(TestGangliaMetrics.java:159)
> 	at org.apache.hadoop.metrics2.impl.TestGangliaMetrics.testGangliaMetrics2(TestGangliaMetrics.java:137)
> {quote}



--
This message was sent by Atlassian JIRA
(v6.3.4#6332)

Mime
View raw message