hadoop-common-issues mailing list archives

Site index · List index
Message view « Date » · « Thread »
Top « Date » · « Thread »
From "Hadoop QA (JIRA)" <j...@apache.org>
Subject [jira] [Commented] (HADOOP-12087) [JDK8] Fix javadoc errors caused by incorrect or illegal tags
Date Sat, 12 Sep 2015 19:09:46 GMT

    [ https://issues.apache.org/jira/browse/HADOOP-12087?page=com.atlassian.jira.plugin.system.issuetabpanels:comment-tabpanel&focusedCommentId=14742194#comment-14742194
] 

Hadoop QA commented on HADOOP-12087:
------------------------------------

\\
\\
| (x) *{color:red}-1 overall{color}* |
\\
\\
|| Vote || Subsystem || Runtime || Comment ||
| {color:red}-1{color} | pre-patch |  21m 21s | Pre-patch trunk has 7 extant Findbugs (version
3.0.0) warnings. |
| {color:green}+1{color} | @author |   0m  0s | The patch does not contain any @author tags.
|
| {color:red}-1{color} | tests included |   0m  0s | The patch doesn't appear to include any
new or modified tests.  Please justify why no new tests are needed for this patch. Also please
list what manual steps were performed to verify this patch. |
| {color:green}+1{color} | javac |   7m 56s | There were no new javac warning messages. |
| {color:green}+1{color} | javadoc |  10m 10s | There were no new javadoc warning messages.
|
| {color:green}+1{color} | release audit |   0m 24s | The applied patch does not increase
the total number of release audit warnings. |
| {color:green}+1{color} | checkstyle |   4m  6s | There were no new checkstyle issues. |
| {color:green}+1{color} | whitespace |   0m  0s | The patch has no lines that end in whitespace.
|
| {color:green}+1{color} | install |   1m 26s | mvn install still works. |
| {color:green}+1{color} | eclipse:eclipse |   0m 33s | The patch built with eclipse:eclipse.
|
| {color:green}+1{color} | findbugs |   7m 20s | The patch does not introduce any new Findbugs
(version 3.0.0) warnings. |
| {color:green}+1{color} | common tests |   5m 22s | Tests passed in hadoop-auth. |
| {color:green}+1{color} | tools/hadoop tests |   6m 26s | Tests passed in hadoop-distcp.
|
| {color:green}+1{color} | yarn tests |   0m 24s | Tests passed in hadoop-yarn-api. |
| {color:green}+1{color} | yarn tests |   1m 58s | Tests passed in hadoop-yarn-common. |
| {color:green}+1{color} | yarn tests |   0m 25s | Tests passed in hadoop-yarn-server-common.
|
| {color:red}-1{color} | yarn tests |  51m 49s | Tests failed in hadoop-yarn-server-resourcemanager.
|
| | | 119m 43s | |
\\
\\
|| Reason || Tests ||
| Failed unit tests | hadoop.yarn.server.resourcemanager.scheduler.capacity.TestCapacityScheduler
|
|   | hadoop.yarn.server.resourcemanager.scheduler.capacity.TestParentQueue |
|   | hadoop.yarn.server.resourcemanager.scheduler.capacity.TestWorkPreservingRMRestartForNodeLabel
|
| Timed out tests | org.apache.hadoop.yarn.server.resourcemanager.scheduler.capacity.TestCapacitySchedulerDynamicBehavior
|
\\
\\
|| Subsystem || Report/Notes ||
| Patch URL | http://issues.apache.org/jira/secure/attachment/12755569/HADOOP-12087.003.patch
|
| Optional Tests | javadoc javac unit findbugs checkstyle |
| git revision | trunk / c715650 |
| Pre-patch Findbugs warnings | https://builds.apache.org/job/PreCommit-HADOOP-Build/7652/artifact/patchprocess/trunkFindbugsWarningshadoop-yarn-server-common.html
|
| hadoop-auth test log | https://builds.apache.org/job/PreCommit-HADOOP-Build/7652/artifact/patchprocess/testrun_hadoop-auth.txt
|
| hadoop-distcp test log | https://builds.apache.org/job/PreCommit-HADOOP-Build/7652/artifact/patchprocess/testrun_hadoop-distcp.txt
|
| hadoop-yarn-api test log | https://builds.apache.org/job/PreCommit-HADOOP-Build/7652/artifact/patchprocess/testrun_hadoop-yarn-api.txt
|
| hadoop-yarn-common test log | https://builds.apache.org/job/PreCommit-HADOOP-Build/7652/artifact/patchprocess/testrun_hadoop-yarn-common.txt
|
| hadoop-yarn-server-common test log | https://builds.apache.org/job/PreCommit-HADOOP-Build/7652/artifact/patchprocess/testrun_hadoop-yarn-server-common.txt
|
| hadoop-yarn-server-resourcemanager test log | https://builds.apache.org/job/PreCommit-HADOOP-Build/7652/artifact/patchprocess/testrun_hadoop-yarn-server-resourcemanager.txt
|
| Test Results | https://builds.apache.org/job/PreCommit-HADOOP-Build/7652/testReport/ |
| Java | 1.7.0_55 |
| uname | Linux asf906.gq1.ygridcore.net 3.13.0-36-lowlatency #63-Ubuntu SMP PREEMPT Wed Sep
3 21:56:12 UTC 2014 x86_64 x86_64 x86_64 GNU/Linux |
| Console output | https://builds.apache.org/job/PreCommit-HADOOP-Build/7652/console |


This message was automatically generated.

> [JDK8] Fix javadoc errors caused by incorrect or illegal tags
> -------------------------------------------------------------
>
>                 Key: HADOOP-12087
>                 URL: https://issues.apache.org/jira/browse/HADOOP-12087
>             Project: Hadoop Common
>          Issue Type: Bug
>          Components: documentation
>    Affects Versions: 2.8.0
>            Reporter: Akira AJISAKA
>            Assignee: Akira AJISAKA
>         Attachments: HADOOP-12087.001.patch, HADOOP-12087.002.patch, HADOOP-12087.003.patch
>
>
> {{mvn package -Pdist -DskipTests}} fails with JDK8 by illegal tags as follows
> {code}
> [ERROR] /home/centos/git/hadoop/hadoop-yarn-project/hadoop-yarn/hadoop-yarn-common/src/main/java/org/apache/hadoop/yarn/nodelabels/CommonNodeLabelsManager.java:829:
error: @param name not found
> [ERROR] * @param nodelabels
> [ERROR] ^
> {code}



--
This message was sent by Atlassian JIRA
(v6.3.4#6332)

Mime
View raw message