hadoop-common-issues mailing list archives

Site index · List index
Message view « Date » · « Thread »
Top « Date » · « Thread »
From "Sangjin Lee (JIRA)" <j...@apache.org>
Subject [jira] [Commented] (HADOOP-10062) TestMetricsSystemImpl#testMultiThreadedPublish fails on trunk
Date Thu, 15 Jan 2015 21:27:35 GMT

    [ https://issues.apache.org/jira/browse/HADOOP-10062?page=com.atlassian.jira.plugin.system.issuetabpanels:comment-tabpanel&focusedCommentId=14279307#comment-14279307
] 

Sangjin Lee commented on HADOOP-10062:
--------------------------------------

Thanks Luke. I'd greatly appreciate if you could merge it at some point (both to trunk and
branch-2).

I'll also update the title to reflect the fact that there was really an issue with the non-test
metrics code (after all the multi-threaded test did flush out the issue so it did its job
:)).

> TestMetricsSystemImpl#testMultiThreadedPublish fails on trunk
> -------------------------------------------------------------
>
>                 Key: HADOOP-10062
>                 URL: https://issues.apache.org/jira/browse/HADOOP-10062
>             Project: Hadoop Common
>          Issue Type: Bug
>          Components: metrics
>    Affects Versions: 3.0.0
>         Environment: CentOS 6.4, Oracle JDK 1.6.0_31, JDK1.7.0_45
>            Reporter: Shinichi Yamashita
>            Assignee: Sangjin Lee
>            Priority: Minor
>         Attachments: HADOOP-10062-failed.txt, HADOOP-10062-success.txt, HADOOP-10062.003.patch,
HADOOP-10062.patch, HADOOP-10062.patch
>
>
> TestMetricsSystemInpl#testMultiThreadedPublish failed with "Metrics not collected"
> {code}
> Running org.apache.hadoop.metrics2.impl.TestMetricsSystemImpl
> Tests run: 6, Failures: 1, Errors: 0, Skipped: 0, Time elapsed: 1.688 sec <<<
FAILURE! - in org.apache.hadoop.metrics2.impl.TestMetricsSystemImpl
> testMultiThreadedPublish(org.apache.hadoop.metrics2.impl.TestMetricsSystemImpl)  Time
elapsed: 0.056 sec  <<< FAILURE!
> java.lang.AssertionError: Metric not collected!
> Metric not collected!
> Metric not collected!
> Metric not collected!
> Metric not collected!
> Metric not collected!
> Metric not collected!
> Metric not collected!
> Metric not collected!
> Passed
>         at org.junit.Assert.fail(Assert.java:93)
>         at org.junit.Assert.assertTrue(Assert.java:43)
>         at org.apache.hadoop.metrics2.impl.TestMetricsSystemImpl.testMultiThreadedPublish(TestMetricsSystemImpl.java:232)
> Results :
> Failed tests:
>   TestMetricsSystemImpl.testMultiThreadedPublish:232 Metric not collected!
> Metric not collected!
> Metric not collected!
> Metric not collected!
> Metric not collected!
> Metric not collected!
> Metric not collected!
> Metric not collected!
> Metric not collected!
> Passed
> Tests run: 6, Failures: 1, Errors: 0, Skipped: 0
> {code}



--
This message was sent by Atlassian JIRA
(v6.3.4#6332)

Mime
View raw message