hadoop-common-issues mailing list archives

Site index · List index
Message view « Date » · « Thread »
Top « Date » · « Thread »
From "Hadoop QA (JIRA)" <j...@apache.org>
Subject [jira] [Commented] (HADOOP-10062) TestMetricsSystemImpl#testMultiThreadedPublish fails on trunk
Date Thu, 15 Jan 2015 03:32:35 GMT

    [ https://issues.apache.org/jira/browse/HADOOP-10062?page=com.atlassian.jira.plugin.system.issuetabpanels:comment-tabpanel&focusedCommentId=14278202#comment-14278202
] 

Hadoop QA commented on HADOOP-10062:
------------------------------------

{color:green}+1 overall{color}.  Here are the results of testing the latest attachment 
  http://issues.apache.org/jira/secure/attachment/12692418/HADOOP-10062.003.patch
  against trunk revision 5805dc0.

    {color:green}+1 @author{color}.  The patch does not contain any @author tags.

    {color:green}+1 tests included{color}.  The patch appears to include 1 new or modified
test files.

    {color:green}+1 javac{color}.  The applied patch does not increase the total number of
javac compiler warnings.

    {color:green}+1 javadoc{color}.  There were no new javadoc warning messages.

    {color:green}+1 eclipse:eclipse{color}.  The patch built with eclipse:eclipse.

    {color:green}+1 findbugs{color}.  The patch does not introduce any new Findbugs (version
2.0.3) warnings.

    {color:green}+1 release audit{color}.  The applied patch does not increase the total number
of release audit warnings.

    {color:green}+1 core tests{color}.  The patch passed unit tests in hadoop-common-project/hadoop-common.

Test results: https://builds.apache.org/job/PreCommit-HADOOP-Build/5406//testReport/
Console output: https://builds.apache.org/job/PreCommit-HADOOP-Build/5406//console

This message is automatically generated.

> TestMetricsSystemImpl#testMultiThreadedPublish fails on trunk
> -------------------------------------------------------------
>
>                 Key: HADOOP-10062
>                 URL: https://issues.apache.org/jira/browse/HADOOP-10062
>             Project: Hadoop Common
>          Issue Type: Bug
>          Components: metrics
>    Affects Versions: 3.0.0
>         Environment: CentOS 6.4, Oracle JDK 1.6.0_31, JDK1.7.0_45
>            Reporter: Shinichi Yamashita
>            Assignee: Sangjin Lee
>            Priority: Minor
>         Attachments: HADOOP-10062-failed.txt, HADOOP-10062-success.txt, HADOOP-10062.003.patch,
HADOOP-10062.patch, HADOOP-10062.patch
>
>
> TestMetricsSystemInpl#testMultiThreadedPublish failed with "Metrics not collected"
> {code}
> Running org.apache.hadoop.metrics2.impl.TestMetricsSystemImpl
> Tests run: 6, Failures: 1, Errors: 0, Skipped: 0, Time elapsed: 1.688 sec <<<
FAILURE! - in org.apache.hadoop.metrics2.impl.TestMetricsSystemImpl
> testMultiThreadedPublish(org.apache.hadoop.metrics2.impl.TestMetricsSystemImpl)  Time
elapsed: 0.056 sec  <<< FAILURE!
> java.lang.AssertionError: Metric not collected!
> Metric not collected!
> Metric not collected!
> Metric not collected!
> Metric not collected!
> Metric not collected!
> Metric not collected!
> Metric not collected!
> Metric not collected!
> Passed
>         at org.junit.Assert.fail(Assert.java:93)
>         at org.junit.Assert.assertTrue(Assert.java:43)
>         at org.apache.hadoop.metrics2.impl.TestMetricsSystemImpl.testMultiThreadedPublish(TestMetricsSystemImpl.java:232)
> Results :
> Failed tests:
>   TestMetricsSystemImpl.testMultiThreadedPublish:232 Metric not collected!
> Metric not collected!
> Metric not collected!
> Metric not collected!
> Metric not collected!
> Metric not collected!
> Metric not collected!
> Metric not collected!
> Metric not collected!
> Passed
> Tests run: 6, Failures: 1, Errors: 0, Skipped: 0
> {code}



--
This message was sent by Atlassian JIRA
(v6.3.4#6332)

Mime
View raw message