hadoop-common-issues mailing list archives

Site index · List index
Message view « Date » · « Thread »
Top « Date » · « Thread »
From "Mit Desai (JIRA)" <j...@apache.org>
Subject [jira] [Created] (HADOOP-10291) TestSecurityUtil#testSocketAddrWithIP fails
Date Mon, 27 Jan 2014 17:05:37 GMT
Mit Desai created HADOOP-10291:
----------------------------------

             Summary: TestSecurityUtil#testSocketAddrWithIP fails
                 Key: HADOOP-10291
                 URL: https://issues.apache.org/jira/browse/HADOOP-10291
             Project: Hadoop Common
          Issue Type: Bug
    Affects Versions: 2.2.0
            Reporter: Mit Desai


testSocketAddrWithIP fails with Assertion Error

{noformat}
Running org.apache.hadoop.security.TestSecurityUtil
Tests run: 1, Failures: 1, Errors: 0, Skipped: 0, Time elapsed: 0.389 sec <<< FAILURE!
testSocketAddrWithIP(org.apache.hadoop.security.TestSecurityUtil)  Time elapsed: 275 sec 
<<< FAILURE!
java.lang.AssertionError: expected:<127.0.0.1:123> but was:<localhost:123>
	at org.junit.Assert.fail(Assert.java:93)
	at org.junit.Assert.failNotEquals(Assert.java:647)
	at org.junit.Assert.assertEquals(Assert.java:128)
	at org.junit.Assert.assertEquals(Assert.java:147)
	at org.apache.hadoop.security.TestSecurityUtil.verifyTokenService(TestSecurityUtil.java:271)
	at org.apache.hadoop.security.TestSecurityUtil.verifyAddress(TestSecurityUtil.java:290)
	at org.apache.hadoop.security.TestSecurityUtil.verifyServiceAddr(TestSecurityUtil.java:306)
	at org.apache.hadoop.security.TestSecurityUtil.testSocketAddrWithIP(TestSecurityUtil.java:334)
	at sun.reflect.NativeMethodAccessorImpl.invoke0(Native Method)
	at sun.reflect.NativeMethodAccessorImpl.invoke(NativeMethodAccessorImpl.java:57)
	at sun.reflect.DelegatingMethodAccessorImpl.invoke(DelegatingMethodAccessorImpl.java:43)
	at java.lang.reflect.Method.invoke(Method.java:606)
	at org.junit.runners.model.FrameworkMethod$1.runReflectiveCall(FrameworkMethod.java:45)
	at org.junit.internal.runners.model.ReflectiveCallable.run(ReflectiveCallable.java:15)
	at org.junit.runners.model.FrameworkMethod.invokeExplosively(FrameworkMethod.java:42)
	at org.junit.internal.runners.statements.InvokeMethod.evaluate(InvokeMethod.java:20)
	at org.junit.runners.ParentRunner.runLeaf(ParentRunner.java:263)
	at org.junit.runners.BlockJUnit4ClassRunner.runChild(BlockJUnit4ClassRunner.java:68)
	at org.junit.runners.BlockJUnit4ClassRunner.runChild(BlockJUnit4ClassRunner.java:47)
	at org.junit.runners.ParentRunner$3.run(ParentRunner.java:231)
	at org.junit.runners.ParentRunner$1.schedule(ParentRunner.java:60)
	at org.junit.runners.ParentRunner.runChildren(ParentRunner.java:229)
	at org.junit.runners.ParentRunner.access$000(ParentRunner.java:50)
	at org.junit.runners.ParentRunner$2.evaluate(ParentRunner.java:222)
	at org.junit.internal.runners.statements.RunBefores.evaluate(RunBefores.java:28)
	at org.junit.runners.ParentRunner.run(ParentRunner.java:300)
	at org.apache.maven.surefire.junit4.JUnit4Provider.execute(JUnit4Provider.java:242)
	at org.apache.maven.surefire.junit4.JUnit4Provider.executeTestSet(JUnit4Provider.java:137)
	at org.apache.maven.surefire.junit4.JUnit4Provider.invoke(JUnit4Provider.java:112)
	at sun.reflect.NativeMethodAccessorImpl.invoke0(Native Method)
	at sun.reflect.NativeMethodAccessorImpl.invoke(NativeMethodAccessorImpl.java:57)
	at sun.reflect.DelegatingMethodAccessorImpl.invoke(DelegatingMethodAccessorImpl.java:43)
	at java.lang.reflect.Method.invoke(Method.java:606)
	at org.apache.maven.surefire.util.ReflectionUtils.invokeMethodWithArray(ReflectionUtils.java:189)
	at org.apache.maven.surefire.booter.ProviderFactory$ProviderProxy.invoke(ProviderFactory.java:165)
	at org.apache.maven.surefire.booter.ProviderFactory.invokeProvider(ProviderFactory.java:85)
	at org.apache.maven.surefire.booter.ForkedBooter.runSuitesInProcess(ForkedBooter.java:115)
	at org.apache.maven.surefire.booter.ForkedBooter.main(ForkedBooter.java:75)


Results :

Failed tests:   testSocketAddrWithIP(org.apache.hadoop.security.TestSecurityUtil): expected:<127.0.0.1:123>
but was:<localhost:123>
{noformat}



--
This message was sent by Atlassian JIRA
(v6.1.5#6160)

Mime
View raw message