hadoop-common-issues mailing list archives

Site index · List index
Message view « Date » · « Thread »
Top « Date » · « Thread »
From "Chuan Liu (JIRA)" <j...@apache.org>
Subject [jira] [Updated] (HADOOP-10110) hadoop-auth has a build break due to missing dependency
Date Mon, 18 Nov 2013 20:43:23 GMT

     [ https://issues.apache.org/jira/browse/HADOOP-10110?page=com.atlassian.jira.plugin.system.issuetabpanels:all-tabpanel
]

Chuan Liu updated HADOOP-10110:
-------------------------------

    Attachment: HADOOP-10110.patch

Attaching a patch that adds the missing dependency. I verified the build on both Linux and
Windows.

> hadoop-auth has a build break due to missing dependency
> -------------------------------------------------------
>
>                 Key: HADOOP-10110
>                 URL: https://issues.apache.org/jira/browse/HADOOP-10110
>             Project: Hadoop Common
>          Issue Type: Bug
>            Reporter: Chuan Liu
>            Assignee: Chuan Liu
>            Priority: Blocker
>         Attachments: HADOOP-10110.patch
>
>
> We have a build break in hadoop-auth if build with maven cache cleaned. The error looks
like the follows. The problem exists on both Windows and Linux. If you have old jetty jars
in your maven cache, you won't see the error.
> {noformat}
> [INFO] ------------------------------------------------------------------------
> [INFO] BUILD FAILURE
> [INFO] ------------------------------------------------------------------------
> [INFO] Total time: 1:29.469s
> [INFO] Finished at: Mon Nov 18 12:30:36 PST 2013
> [INFO] Final Memory: 37M/120M
> [INFO] ------------------------------------------------------------------------
> [ERROR] Failed to execute goal org.apache.maven.plugins:maven-compiler-plugin:2.5.1:testCompile
(default-testCompile) on project hadoop-auth: Compilation failure: Compilation failure:
> [ERROR] /home/chuan/trunk/hadoop-common-project/hadoop-auth/src/test/java/org/apache/hadoop/security/authentication/client/AuthenticatorTestCase.java:[84,13]
cannot access org.mortbay.component.AbstractLifeCycle
> [ERROR] class file for org.mortbay.component.AbstractLifeCycle not found
> [ERROR] server = new Server(0);
> [ERROR] /home/chuan/trunk/hadoop-common-project/hadoop-auth/src/test/java/org/apache/hadoop/security/authentication/client/AuthenticatorTestCase.java:[94,29]
cannot access org.mortbay.component.LifeCycle
> [ERROR] class file for org.mortbay.component.LifeCycle not found
> [ERROR] server.getConnectors()[0].setHost(host);
> [ERROR] /home/chuan/trunk/hadoop-common-project/hadoop-auth/src/test/java/org/apache/hadoop/security/authentication/client/AuthenticatorTestCase.java:[96,10]
cannot find symbol
> [ERROR] symbol  : method start()
> [ERROR] location: class org.mortbay.jetty.Server
> [ERROR] /home/chuan/trunk/hadoop-common-project/hadoop-auth/src/test/java/org/apache/hadoop/security/authentication/client/AuthenticatorTestCase.java:[102,12]
cannot find symbol
> [ERROR] symbol  : method stop()
> [ERROR] location: class org.mortbay.jetty.Server
> [ERROR] -> [Help 1]
> [ERROR]
> [ERROR] To see the full stack trace of the errors, re-run Maven with the -e switch.
> [ERROR] Re-run Maven using the -X switch to enable full debug logging.
> [ERROR]
> [ERROR] For more information about the errors and possible solutions, please read the
following articles:
> [ERROR] [Help 1] http://cwiki.apache.org/confluence/display/MAVEN/MojoFailureException
> [ERROR]
> [ERROR] After correcting the problems, you can resume the build with the command
> [ERROR]   mvn <goals> -rf :hadoop-auth
> {noformat}



--
This message was sent by Atlassian JIRA
(v6.1#6144)

Mime
View raw message