hadoop-common-issues mailing list archives

Site index · List index
Message view « Date » · « Thread »
Top « Date » · « Thread »
From "Ivan Mitic (JIRA)" <j...@apache.org>
Subject [jira] [Commented] (HADOOP-9388) TestFsShellCopy fails on Windows
Date Sun, 10 Mar 2013 00:19:13 GMT

    [ https://issues.apache.org/jira/browse/HADOOP-9388?page=com.atlassian.jira.plugin.system.issuetabpanels:comment-tabpanel&focusedCommentId=13598112#comment-13598112
] 

Ivan Mitic commented on HADOOP-9388:
------------------------------------

No need to add new unittest cases, as TestFsShellCopy already fails on Windows because of
this bug.
                
> TestFsShellCopy fails on Windows
> --------------------------------
>
>                 Key: HADOOP-9388
>                 URL: https://issues.apache.org/jira/browse/HADOOP-9388
>             Project: Hadoop Common
>          Issue Type: Bug
>    Affects Versions: 3.0.0
>            Reporter: Ivan Mitic
>            Assignee: Ivan Mitic
>         Attachments: HADOOP-9388.trunk.patch
>
>
> Test fails on below test cases:
> {code}
> Tests run: 11, Failures: 2, Errors: 0, Skipped: 0, Time elapsed: 4.343 sec <<<
FAILURE!
> testMoveDirFromLocal(org.apache.hadoop.fs.TestFsShellCopy)  Time elapsed: 29 sec  <<<
FAILURE!
> java.lang.AssertionError: expected:<0> but was:<1>
>         at org.junit.Assert.fail(Assert.java:91)
>         at org.junit.Assert.failNotEquals(Assert.java:645)
>         at org.junit.Assert.assertEquals(Assert.java:126)
>         at org.junit.Assert.assertEquals(Assert.java:470)
>         at org.junit.Assert.assertEquals(Assert.java:454)
>         at org.apache.hadoop.fs.TestFsShellCopy.testMoveDirFromLocal(TestFsShellCopy.java:392)
>         at sun.reflect.NativeMethodAccessorImpl.invoke0(Native Method)
>         at sun.reflect.NativeMethodAccessorImpl.invoke(NativeMethodAccessorImpl.java:39)
>         at sun.reflect.DelegatingMethodAccessorImpl.invoke(DelegatingMethodAccessorImpl.java:25)
>         at java.lang.reflect.Method.invoke(Method.java:597)
>         at org.junit.runners.model.FrameworkMethod$1.runReflectiveCall(FrameworkMethod.java:44)
>         at org.junit.internal.runners.model.ReflectiveCallable.run(ReflectiveCallable.java:15)
>         at org.junit.runners.model.FrameworkMethod.invokeExplosively(FrameworkMethod.java:41)
>         at org.junit.internal.runners.statements.InvokeMethod.evaluate(InvokeMethod.java:20)
>         at org.junit.internal.runners.statements.RunBefores.evaluate(RunBefores.java:28)
>         at org.junit.runners.BlockJUnit4ClassRunner.runNotIgnored(BlockJUnit4ClassRunner.java:79)
>         at org.junit.runners.BlockJUnit4ClassRunner.runChild(BlockJUnit4ClassRunner.java:71)
>         at org.junit.runners.BlockJUnit4ClassRunner.runChild(BlockJUnit4ClassRunner.java:49)
>         at org.junit.runners.ParentRunner$3.run(ParentRunner.java:193)
>         at org.junit.runners.ParentRunner$1.schedule(ParentRunner.java:52)
>         at org.junit.runners.ParentRunner.runChildren(ParentRunner.java:191)
>         at org.junit.runners.ParentRunner.access$000(ParentRunner.java:42)
>         at org.junit.runners.ParentRunner$2.evaluate(ParentRunner.java:184)
>         at org.junit.internal.runners.statements.RunBefores.evaluate(RunBefores.java:28)
>         at org.junit.runners.ParentRunner.run(ParentRunner.java:236)
>         at org.apache.maven.surefire.junit4.JUnit4Provider.execute(JUnit4Provider.java:252)
>         at org.apache.maven.surefire.junit4.JUnit4Provider.executeTestSet(JUnit4Provider.java:141)
>         at org.apache.maven.surefire.junit4.JUnit4Provider.invoke(JUnit4Provider.java:112)
>         at sun.reflect.NativeMethodAccessorImpl.invoke0(Native Method)
>         at sun.reflect.NativeMethodAccessorImpl.invoke(NativeMethodAccessorImpl.java:39)
>         at sun.reflect.DelegatingMethodAccessorImpl.invoke(DelegatingMethodAccessorImpl.java:25)
>         at java.lang.reflect.Method.invoke(Method.java:597)
>         at org.apache.maven.surefire.util.ReflectionUtils.invokeMethodWithArray(ReflectionUtils.java:189)
>         at org.apache.maven.surefire.booter.ProviderFactory$ProviderProxy.invoke(ProviderFactory.java:165)
>         at org.apache.maven.surefire.booter.ProviderFactory.invokeProvider(ProviderFactory.java:85)
>         at org.apache.maven.surefire.booter.ForkedBooter.runSuitesInProcess(ForkedBooter.java:115)
>         at org.apache.maven.surefire.booter.ForkedBooter.main(ForkedBooter.java:75)
> testMoveDirFromLocalDestExists(org.apache.hadoop.fs.TestFsShellCopy)  Time elapsed: 25
sec  <<< FAILURE!
> java.lang.AssertionError: expected:<0> but was:<1>
>         at org.junit.Assert.fail(Assert.java:91)
>         at org.junit.Assert.failNotEquals(Assert.java:645)
>         at org.junit.Assert.assertEquals(Assert.java:126)
>         at org.junit.Assert.assertEquals(Assert.java:470)
>         at org.junit.Assert.assertEquals(Assert.java:454)
>         at org.apache.hadoop.fs.TestFsShellCopy.testMoveDirFromLocalDestExists(TestFsShellCopy.java:410)
>         at sun.reflect.NativeMethodAccessorImpl.invoke0(Native Method)
>         at sun.reflect.NativeMethodAccessorImpl.invoke(NativeMethodAccessorImpl.java:39)
>         at sun.reflect.DelegatingMethodAccessorImpl.invoke(DelegatingMethodAccessorImpl.java:25)
>         at java.lang.reflect.Method.invoke(Method.java:597)
>         at org.junit.runners.model.FrameworkMethod$1.runReflectiveCall(FrameworkMethod.java:44)
>         at org.junit.internal.runners.model.ReflectiveCallable.run(ReflectiveCallable.java:15)
>         at org.junit.runners.model.FrameworkMethod.invokeExplosively(FrameworkMethod.java:41)
>         at org.junit.internal.runners.statements.InvokeMethod.evaluate(InvokeMethod.java:20)
>         at org.junit.internal.runners.statements.RunBefores.evaluate(RunBefores.java:28)
>         at org.junit.runners.BlockJUnit4ClassRunner.runNotIgnored(BlockJUnit4ClassRunner.java:79)
>         at org.junit.runners.BlockJUnit4ClassRunner.runChild(BlockJUnit4ClassRunner.java:71)
>         at org.junit.runners.BlockJUnit4ClassRunner.runChild(BlockJUnit4ClassRunner.java:49)
>         at org.junit.runners.ParentRunner$3.run(ParentRunner.java:193)
>         at org.junit.runners.ParentRunner$1.schedule(ParentRunner.java:52)
>         at org.junit.runners.ParentRunner.runChildren(ParentRunner.java:191)
>         at org.junit.runners.ParentRunner.access$000(ParentRunner.java:42)
>         at org.junit.runners.ParentRunner$2.evaluate(ParentRunner.java:184)
>         at org.junit.internal.runners.statements.RunBefores.evaluate(RunBefores.java:28)
>         at org.junit.runners.ParentRunner.run(ParentRunner.java:236)
>         at org.apache.maven.surefire.junit4.JUnit4Provider.execute(JUnit4Provider.java:252)
>         at org.apache.maven.surefire.junit4.JUnit4Provider.executeTestSet(JUnit4Provider.java:141)
>         at org.apache.maven.surefire.junit4.JUnit4Provider.invoke(JUnit4Provider.java:112)
>         at sun.reflect.NativeMethodAccessorImpl.invoke0(Native Method)
>         at sun.reflect.NativeMethodAccessorImpl.invoke(NativeMethodAccessorImpl.java:39)
>         at sun.reflect.DelegatingMethodAccessorImpl.invoke(DelegatingMethodAccessorImpl.java:25)
>         at java.lang.reflect.Method.invoke(Method.java:597)
>         at org.apache.maven.surefire.util.ReflectionUtils.invokeMethodWithArray(ReflectionUtils.java:189)
>         at org.apache.maven.surefire.booter.ProviderFactory$ProviderProxy.invoke(ProviderFactory.java:165)
>         at org.apache.maven.surefire.booter.ProviderFactory.invokeProvider(ProviderFactory.java:85)
>         at org.apache.maven.surefire.booter.ForkedBooter.runSuitesInProcess(ForkedBooter.java:115)
>         at org.apache.maven.surefire.booter.ForkedBooter.main(ForkedBooter.java:75)
> {code}

--
This message is automatically generated by JIRA.
If you think it was sent incorrectly, please contact your JIRA administrators
For more information on JIRA, see: http://www.atlassian.com/software/jira

Mime
View raw message