hadoop-common-issues mailing list archives

Site index · List index
Message view « Date » · « Thread »
Top « Date » · « Thread »
From "Hudson (JIRA)" <j...@apache.org>
Subject [jira] [Commented] (HADOOP-9387) TestDFVariations fails on Windows after the merge
Date Fri, 22 Mar 2013 11:03:18 GMT

    [ https://issues.apache.org/jira/browse/HADOOP-9387?page=com.atlassian.jira.plugin.system.issuetabpanels:comment-tabpanel&focusedCommentId=13610132#comment-13610132
] 

Hudson commented on HADOOP-9387:
--------------------------------

Integrated in Hadoop-Yarn-trunk #163 (See [https://builds.apache.org/job/Hadoop-Yarn-trunk/163/])
    Move HADOOP-9387 to Trunk in CHANGES.txt. (Revision 1459643)
HADOOP-9387. Fix DF so that it won't execute a shell command on Windows to compute the file
system/mount point.  Contributed by Ivan Mitic (Revision 1459642)

     Result = FAILURE
szetszwo : http://svn.apache.org/viewcvs.cgi/?root=Apache-SVN&view=rev&rev=1459643
Files : 
* /hadoop/common/trunk/hadoop-common-project/hadoop-common/CHANGES.txt

szetszwo : http://svn.apache.org/viewcvs.cgi/?root=Apache-SVN&view=rev&rev=1459642
Files : 
* /hadoop/common/trunk/hadoop-common-project/hadoop-common/CHANGES.txt
* /hadoop/common/trunk/hadoop-common-project/hadoop-common/src/main/java/org/apache/hadoop/fs/DF.java
* /hadoop/common/trunk/hadoop-common-project/hadoop-common/src/test/java/org/apache/hadoop/fs/TestDFVariations.java

                
> TestDFVariations fails on Windows after the merge
> -------------------------------------------------
>
>                 Key: HADOOP-9387
>                 URL: https://issues.apache.org/jira/browse/HADOOP-9387
>             Project: Hadoop Common
>          Issue Type: Bug
>          Components: fs
>    Affects Versions: 3.0.0
>            Reporter: Ivan Mitic
>            Assignee: Ivan Mitic
>            Priority: Minor
>             Fix For: 3.0.0
>
>         Attachments: HADOOP-9387.trunk.2.patch, HADOOP-9387.trunk.patch
>
>
> Test fails with the following errors:
> {code}
> Running org.apache.hadoop.fs.TestDFVariations
> Tests run: 4, Failures: 0, Errors: 2, Skipped: 0, Time elapsed: 0.186 sec <<<
FAILURE!
> testOSParsing(org.apache.hadoop.fs.TestDFVariations)  Time elapsed: 109 sec  <<<
ERROR!
> java.io.IOException: Fewer lines of output than expected
>         at org.apache.hadoop.fs.DF.parseOutput(DF.java:203)
>         at org.apache.hadoop.fs.DF.getMount(DF.java:150)
>         at org.apache.hadoop.fs.TestDFVariations.testOSParsing(TestDFVariations.java:59)
>         at sun.reflect.NativeMethodAccessorImpl.invoke0(Native Method)
>         at sun.reflect.NativeMethodAccessorImpl.invoke(NativeMethodAccessorImpl.java:39)
>         at sun.reflect.DelegatingMethodAccessorImpl.invoke(DelegatingMethodAccessorImpl.java:25)
>         at java.lang.reflect.Method.invoke(Method.java:597)
>         at org.junit.runners.model.FrameworkMethod$1.runReflectiveCall(FrameworkMethod.java:44)
>         at org.junit.internal.runners.model.ReflectiveCallable.run(ReflectiveCallable.java:15)
>         at org.junit.runners.model.FrameworkMethod.invokeExplosively(FrameworkMethod.java:41)
>         at org.junit.internal.runners.statements.InvokeMethod.evaluate(InvokeMethod.java:20)
>         at org.junit.internal.runners.statements.FailOnTimeout$1.run(FailOnTimeout.java:28)
> testGetMountCurrentDirectory(org.apache.hadoop.fs.TestDFVariations)  Time elapsed: 1
sec  <<< ERROR!
> java.io.IOException: Fewer lines of output than expected
>         at org.apache.hadoop.fs.DF.parseOutput(DF.java:203)
>         at org.apache.hadoop.fs.DF.getMount(DF.java:150)
>         at org.apache.hadoop.fs.TestDFVariations.testGetMountCurrentDirectory(TestDFVariations.java:139)
>         at sun.reflect.NativeMethodAccessorImpl.invoke0(Native Method)
>         at sun.reflect.NativeMethodAccessorImpl.invoke(NativeMethodAccessorImpl.java:39)
>         at sun.reflect.DelegatingMethodAccessorImpl.invoke(DelegatingMethodAccessorImpl.java:25)
>         at java.lang.reflect.Method.invoke(Method.java:597)
>         at org.junit.runners.model.FrameworkMethod$1.runReflectiveCall(FrameworkMethod.java:44)
>         at org.junit.internal.runners.model.ReflectiveCallable.run(ReflectiveCallable.java:15)
>         at org.junit.runners.model.FrameworkMethod.invokeExplosively(FrameworkMethod.java:41)
>         at org.junit.internal.runners.statements.InvokeMethod.evaluate(InvokeMethod.java:20)
>         at org.junit.internal.runners.statements.FailOnTimeout$1.run(FailOnTimeout.java:28)
> {code}

--
This message is automatically generated by JIRA.
If you think it was sent incorrectly, please contact your JIRA administrators
For more information on JIRA, see: http://www.atlassian.com/software/jira

Mime
View raw message