hadoop-common-issues mailing list archives

Site index · List index
Message view « Date » · « Thread »
Top « Date » · « Thread »
From "Arun C Murthy (JIRA)" <j...@apache.org>
Subject [jira] [Updated] (HADOOP-8369) Failing tests in branch-2
Date Thu, 11 Oct 2012 17:35:06 GMT

     [ https://issues.apache.org/jira/browse/HADOOP-8369?page=com.atlassian.jira.plugin.system.issuetabpanels:all-tabpanel
]

Arun C Murthy updated HADOOP-8369:
----------------------------------

    Fix Version/s:     (was: 2.0.2-alpha)
                   2.0.3-alpha
    
> Failing tests in branch-2
> -------------------------
>
>                 Key: HADOOP-8369
>                 URL: https://issues.apache.org/jira/browse/HADOOP-8369
>             Project: Hadoop Common
>          Issue Type: Bug
>    Affects Versions: 2.0.0-alpha
>            Reporter: Arun C Murthy
>             Fix For: 2.0.3-alpha
>
>
> Running org.apache.hadoop.io.compress.TestCodec
> Tests run: 20, Failures: 1, Errors: 0, Skipped: 0, Time elapsed: 27.789 sec <<<
FAILURE!
> --
> Running org.apache.hadoop.fs.viewfs.TestFSMainOperationsLocalFileSystem
> Tests run: 98, Failures: 0, Errors: 98, Skipped: 0, Time elapsed: 1.633 sec <<<
FAILURE!
> --
> Running org.apache.hadoop.fs.viewfs.TestViewFsTrash
> Tests run: 1, Failures: 0, Errors: 1, Skipped: 0, Time elapsed: 0.658 sec <<<
FAILURE!
> ----
> TestCodec failed since I didn't pass -Pnative, the test could be improved to ensure snappy
tests are skipped if native hadoop isn't present.

--
This message is automatically generated by JIRA.
If you think it was sent incorrectly, please contact your JIRA administrators
For more information on JIRA, see: http://www.atlassian.com/software/jira

Mime
View raw message