hadoop-common-issues mailing list archives

Site index · List index
Message view « Date » · « Thread »
Top « Date » · « Thread »
From "Eli Collins (JIRA)" <j...@apache.org>
Subject [jira] [Assigned] (HADOOP-8369) Failing tests in branch-2
Date Tue, 24 Jul 2012 04:46:34 GMT

     [ https://issues.apache.org/jira/browse/HADOOP-8369?page=com.atlassian.jira.plugin.system.issuetabpanels:all-tabpanel
]

Eli Collins reassigned HADOOP-8369:
-----------------------------------

    Assignee:     (was: Eli Collins)
    
> Failing tests in branch-2
> -------------------------
>
>                 Key: HADOOP-8369
>                 URL: https://issues.apache.org/jira/browse/HADOOP-8369
>             Project: Hadoop Common
>          Issue Type: Bug
>    Affects Versions: 2.0.0-alpha
>            Reporter: Arun C Murthy
>             Fix For: 2.1.0-alpha
>
>
> Running org.apache.hadoop.io.compress.TestCodec
> Tests run: 20, Failures: 1, Errors: 0, Skipped: 0, Time elapsed: 27.789 sec <<<
FAILURE!
> --
> Running org.apache.hadoop.fs.viewfs.TestFSMainOperationsLocalFileSystem
> Tests run: 98, Failures: 0, Errors: 98, Skipped: 0, Time elapsed: 1.633 sec <<<
FAILURE!
> --
> Running org.apache.hadoop.fs.viewfs.TestViewFsTrash
> Tests run: 1, Failures: 0, Errors: 1, Skipped: 0, Time elapsed: 0.658 sec <<<
FAILURE!
> ----
> TestCodec failed since I didn't pass -Pnative, the test could be improved to ensure snappy
tests are skipped if native hadoop isn't present.

--
This message is automatically generated by JIRA.
If you think it was sent incorrectly, please contact your JIRA administrators: https://issues.apache.org/jira/secure/ContactAdministrators!default.jspa
For more information on JIRA, see: http://www.atlassian.com/software/jira

        

Mime
View raw message