hadoop-common-issues mailing list archives

Site index · List index
Message view « Date » · « Thread »
Top « Date » · « Thread »
From "Eli Collins (JIRA)" <j...@apache.org>
Subject [jira] [Issue Comment Edited] (HADOOP-8369) Failing tests in branch-2
Date Tue, 08 May 2012 18:01:53 GMT

    [ https://issues.apache.org/jira/browse/HADOOP-8369?page=com.atlassian.jira.plugin.system.issuetabpanels:comment-tabpanel&focusedCommentId=13270655#comment-13270655
] 

Eli Collins edited comment on HADOOP-8369 at 5/8/12 6:01 PM:
-------------------------------------------------------------

Hey Arun

TestFSMainOperationsLocalFileSystem and TestCodec (w/o -Pnative) both pass for me on the top
of branch-2. What change did you run these at, and what specific tests failed?

TestViewFsTrash fails sporadically, this is HADOOP-8110, I'll take a look now, but don't think
this flaky test a blocker for an alpha.

Thanks,
Eli
                
      was (Author: eli2):
    Hey Arun

TestFSMainOperationsLocalFileSystem and TestCodec (w/p -Pnative) both pass for me on the top
of branch-2. What change did you run these at, and what specific tests failed?

TestViewFsTrash fails sporadically, this is HADOOP-8110, I'll take a look now, but don't think
this flaky test a blocker for an alpha.

Thanks,
Eli
                  
> Failing tests in branch-2
> -------------------------
>
>                 Key: HADOOP-8369
>                 URL: https://issues.apache.org/jira/browse/HADOOP-8369
>             Project: Hadoop Common
>          Issue Type: Bug
>    Affects Versions: 2.0.0
>            Reporter: Arun C Murthy
>            Assignee: Eli Collins
>            Priority: Blocker
>             Fix For: 2.0.0
>
>
> Running org.apache.hadoop.io.compress.TestCodec
> Tests run: 20, Failures: 1, Errors: 0, Skipped: 0, Time elapsed: 27.789 sec <<<
FAILURE!
> --
> Running org.apache.hadoop.fs.viewfs.TestFSMainOperationsLocalFileSystem
> Tests run: 98, Failures: 0, Errors: 98, Skipped: 0, Time elapsed: 1.633 sec <<<
FAILURE!
> --
> Running org.apache.hadoop.fs.viewfs.TestViewFsTrash
> Tests run: 1, Failures: 0, Errors: 1, Skipped: 0, Time elapsed: 0.658 sec <<<
FAILURE!
> ----
> TestCodec failed since I didn't pass -Pnative, the test could be improved to ensure snappy
tests are skipped if native hadoop isn't present.

--
This message is automatically generated by JIRA.
If you think it was sent incorrectly, please contact your JIRA administrators: https://issues.apache.org/jira/secure/ContactAdministrators!default.jspa
For more information on JIRA, see: http://www.atlassian.com/software/jira

        

Mime
View raw message