hadoop-common-dev mailing list archives

Site index · List index
Message view « Date » · « Thread »
Top « Date » · « Thread »
From "Steve Loughran (JIRA)" <j...@apache.org>
Subject [jira] [Resolved] (HADOOP-13888) hadoop 3.0.0 alpha1 application software compile problem
Date Mon, 12 Dec 2016 13:38:58 GMT

     [ https://issues.apache.org/jira/browse/HADOOP-13888?page=com.atlassian.jira.plugin.system.issuetabpanels:all-tabpanel
]

Steve Loughran resolved HADOOP-13888.
-------------------------------------
    Resolution: Won't Fix

Closing as a wontfix. We are trying to update all our dependencies and trim out stuff which
we can, especially the stuff which is obsolete and unmaintained. This is for security reasons,
as well as to avoid dictating what people have to have on their classpath

> hadoop 3.0.0 alpha1  application software compile problem
> ---------------------------------------------------------
>
>                 Key: HADOOP-13888
>                 URL: https://issues.apache.org/jira/browse/HADOOP-13888
>             Project: Hadoop Common
>          Issue Type: Bug
>          Components: build
>    Affects Versions: 3.0.0-alpha1
>            Reporter: gehaijiang
>            Priority: Minor
>
> {code}
> [INFO] -------------------------------------------------------------
> [ERROR] COMPILATION ERROR :
> [INFO] -------------------------------------------------------------
> [ERROR] /home/data/mogu-oss/src/test/java/com/mogujie/test/s3/user/UserTest.java:[3,37]
package org.apache.commons.httpclient does not exist
> [ERROR] /home/data/mogu-oss/src/test/java/com/mogujie/test/s3/user/UserTest.java:[4,37]
package org.apache.commons.httpclient does not exist
> [ERROR] /home/data/mogu-oss/src/test/java/com/mogujie/test/s3/user/UserTest.java:[5,45]
package org.apache.commons.httpclient.methods does not exist
> [ERROR] /home/data/mogu-oss/src/test/java/com/mogujie/test/s3/user/UserTest.java:[6,45]
package org.apache.commons.httpclient.methods does not exist
> [ERROR] /home/data/mogu-oss/src/test/java/com/mogujie/test/s3/user/UserTest.java:[31,7]
cannot find symbol
>   symbol:   class HttpClient
>   location: class com.mogujie.test.s3.user.UserTest
> [ERROR] /home/data/mogu-oss/src/test/java/com/mogujie/test/s3/user/UserTest.java:[31,35]
cannot find symbol
>   symbol:   class HttpClient
>   location: class com.mogujie.test.s3.user.UserTest
> [ERROR] /home/data/mogu-oss/src/test/java/com/mogujie/test/s3/user/UserTest.java:[32,7]
cannot find symbol
>   symbol:   class PutMethod
>   location: class com.mogujie.test.s3.user.UserTest
> [ERROR] /home/data/mogu-oss/src/test/java/com/mogujie/test/s3/user/UserTest.java:[32,30]
cannot find symbol
>   symbol:   class PutMethod
>   location: class com.mogujie.test.s3.user.UserTest
> [ERROR] /home/data/mogu-oss/src/test/java/com/mogujie/test/s3/user/UserTest.java:[33,25]
cannot find symbol
>   symbol:   class URI
>   location: class com.mogujie.test.s3.user.UserTest
> [ERROR] /home/data/mogu-oss/src/test/java/com/mogujie/test/s3/user/UserTest.java:[34,35]
cannot find symbol
>   symbol:   class StringRequestEntity
>   location: class com.mogujie.test.s3.user.UserTest
> [INFO] 10 errors
> [INFO] -------------------------------------------------------------
> [INFO] ------------------------------------------------------------------------
> [INFO] BUILD FAILURE
> [INFO] ------------------------------------------------------------------------
> [INFO] Total time: 11.571 s
> [INFO] Finished at: 2016-12-10T20:25:07+08:00
> [INFO] Final Memory: 28M/70M
> [INFO] ------------------------------------------------------------------------
> [ERROR] Failed to execute goal org.apache.maven.plugins:maven-compiler-plugin:3.5.1:testCompile
(default-testCompile) on project mogu-oss: Compilation failure: Compilation failure:
> [ERROR] /home/data/mogu-oss/src/test/java/com/mogujie/test/s3/user/UserTest.java:[3,37]
package org.apache.commons.httpclient does not exist
> [ERROR] /home/data/mogu-oss/src/test/java/com/mogujie/test/s3/user/UserTest.java:[4,37]
package org.apache.commons.httpclient does not exist
> [ERROR] /home/data/mogu-oss/src/test/java/com/mogujie/test/s3/user/UserTest.java:[5,45]
package org.apache.commons.httpclient.methods does not exist
> [ERROR] /home/data/mogu-oss/src/test/java/com/mogujie/test/s3/user/UserTest.java:[6,45]
package org.apache.commons.httpclient.methods does not exist
> [ERROR] /home/data/mogu-oss/src/test/java/com/mogujie/test/s3/user/UserTest.java:[31,7]
cannot find symbol
> [ERROR] symbol:   class HttpClient
> {code}



--
This message was sent by Atlassian JIRA
(v6.3.4#6332)

---------------------------------------------------------------------
To unsubscribe, e-mail: common-dev-unsubscribe@hadoop.apache.org
For additional commands, e-mail: common-dev-help@hadoop.apache.org


Mime
View raw message