hadoop-common-dev mailing list archives

Site index · List index
Message view « Date » · « Thread »
Top « Date » · « Thread »
From Apache Jenkins Server <jenk...@builds.apache.org>
Subject Build failed in Jenkins: Hadoop-common-trunk-Java8 #1575
Date Thu, 02 Jun 2016 18:08:18 GMT
See <https://builds.apache.org/job/Hadoop-common-trunk-Java8/1575/changes>

Changes:

[aajisaka] HADOOP-13224. Grep job in Single Cluster document fails. (aajisaka)

------------------------------------------
[...truncated 5335 lines...]
Tests run: 8, Failures: 0, Errors: 0, Skipped: 0, Time elapsed: 0.716 sec - in org.apache.hadoop.crypto.key.TestKeyProvider
Running org.apache.hadoop.crypto.key.TestKeyShell
Tests run: 14, Failures: 0, Errors: 0, Skipped: 0, Time elapsed: 20.152 sec - in org.apache.hadoop.crypto.TestCryptoStreamsWithOpensslAesCtrCryptoCodec
Running org.apache.hadoop.crypto.key.TestKeyProviderCryptoExtension
Tests run: 2, Failures: 0, Errors: 0, Skipped: 0, Time elapsed: 0.921 sec - in org.apache.hadoop.crypto.key.TestKeyProviderCryptoExtension
Tests run: 10, Failures: 0, Errors: 0, Skipped: 0, Time elapsed: 1.34 sec - in org.apache.hadoop.crypto.key.TestKeyShell
Running org.apache.hadoop.io.TestSequenceFile
Running org.apache.hadoop.io.TestSecureIOUtils
Tests run: 4, Failures: 0, Errors: 0, Skipped: 0, Time elapsed: 0.739 sec - in org.apache.hadoop.io.TestSecureIOUtils
Running org.apache.hadoop.io.nativeio.TestSharedFileDescriptorFactory
Tests run: 3, Failures: 0, Errors: 0, Skipped: 0, Time elapsed: 0.441 sec - in org.apache.hadoop.io.nativeio.TestSharedFileDescriptorFactory
Running org.apache.hadoop.io.nativeio.TestNativeIO
Tests run: 3, Failures: 0, Errors: 0, Skipped: 0, Time elapsed: 15.937 sec - in org.apache.hadoop.crypto.TestCryptoCodec
Running org.apache.hadoop.io.TestWritable
Tests run: 6, Failures: 0, Errors: 0, Skipped: 0, Time elapsed: 0.406 sec - in org.apache.hadoop.io.TestWritable
Running org.apache.hadoop.io.TestIOUtils
Tests run: 12, Failures: 0, Errors: 0, Skipped: 0, Time elapsed: 0.483 sec - in org.apache.hadoop.io.TestIOUtils
Running org.apache.hadoop.io.TestTextNonUTF8
Tests run: 1, Failures: 0, Errors: 0, Skipped: 0, Time elapsed: 0.291 sec - in org.apache.hadoop.io.TestTextNonUTF8
Running org.apache.hadoop.io.TestMD5Hash
Tests run: 2, Failures: 0, Errors: 0, Skipped: 0, Time elapsed: 0.233 sec - in org.apache.hadoop.io.TestMD5Hash
Running org.apache.hadoop.io.TestSequenceFileAppend
Tests run: 5, Failures: 0, Errors: 0, Skipped: 0, Time elapsed: 0.89 sec - in org.apache.hadoop.io.TestSequenceFileAppend
Running org.apache.hadoop.io.TestMapFile
Tests run: 21, Failures: 0, Errors: 0, Skipped: 0, Time elapsed: 1.366 sec - in org.apache.hadoop.io.TestMapFile
Running org.apache.hadoop.io.TestWritableName
Tests run: 4, Failures: 0, Errors: 0, Skipped: 0, Time elapsed: 0.203 sec - in org.apache.hadoop.io.TestWritableName
Running org.apache.hadoop.io.TestSortedMapWritable
Tests run: 4, Failures: 0, Errors: 0, Skipped: 0, Time elapsed: 0.204 sec - in org.apache.hadoop.io.TestSortedMapWritable
Tests run: 20, Failures: 0, Errors: 0, Skipped: 0, Time elapsed: 7.185 sec - in org.apache.hadoop.io.nativeio.TestNativeIO
Running org.apache.hadoop.io.TestSequenceFileSync
Running org.apache.hadoop.io.retry.TestFailoverProxy
Tests run: 9, Failures: 0, Errors: 0, Skipped: 0, Time elapsed: 9.828 sec - in org.apache.hadoop.io.TestSequenceFile
Tests run: 1, Failures: 0, Errors: 0, Skipped: 0, Time elapsed: 0.827 sec - in org.apache.hadoop.io.TestSequenceFileSync
Running org.apache.hadoop.io.retry.TestDefaultRetryPolicy
Running org.apache.hadoop.io.retry.TestRetryProxy
Tests run: 3, Failures: 0, Errors: 0, Skipped: 0, Time elapsed: 0.34 sec - in org.apache.hadoop.io.retry.TestDefaultRetryPolicy
Running org.apache.hadoop.io.TestDefaultStringifier
Tests run: 4, Failures: 0, Errors: 0, Skipped: 0, Time elapsed: 0.43 sec - in org.apache.hadoop.io.TestDefaultStringifier
Running org.apache.hadoop.io.TestBloomMapFile
Tests run: 12, Failures: 0, Errors: 0, Skipped: 0, Time elapsed: 1.477 sec - in org.apache.hadoop.io.retry.TestRetryProxy
Running org.apache.hadoop.io.TestBytesWritable
Tests run: 6, Failures: 0, Errors: 0, Skipped: 0, Time elapsed: 0.191 sec - in org.apache.hadoop.io.TestBytesWritable
Running org.apache.hadoop.io.erasurecode.rawcoder.TestDummyRawCoder
Tests run: 14, Failures: 0, Errors: 0, Skipped: 0, Time elapsed: 24.105 sec - in org.apache.hadoop.crypto.TestCryptoStreamsWithJceAesCtrCryptoCodec
Tests run: 3, Failures: 0, Errors: 0, Skipped: 0, Time elapsed: 0.189 sec - in org.apache.hadoop.io.erasurecode.rawcoder.TestDummyRawCoder
Running org.apache.hadoop.io.erasurecode.rawcoder.TestRSRawCoderLegacy
Running org.apache.hadoop.io.erasurecode.rawcoder.TestXORRawCoder
Tests run: 7, Failures: 0, Errors: 0, Skipped: 0, Time elapsed: 1.437 sec - in org.apache.hadoop.io.TestBloomMapFile
Tests run: 6, Failures: 0, Errors: 0, Skipped: 0, Time elapsed: 0.304 sec - in org.apache.hadoop.io.erasurecode.rawcoder.TestXORRawCoder
Tests run: 16, Failures: 0, Errors: 0, Skipped: 0, Time elapsed: 0.468 sec - in org.apache.hadoop.io.erasurecode.rawcoder.TestRSRawCoderLegacy
Running org.apache.hadoop.io.erasurecode.rawcoder.TestRSRawCoder
Running org.apache.hadoop.io.erasurecode.TestCodecRawCoderMapping
Running org.apache.hadoop.io.erasurecode.TestECSchema
Tests run: 1, Failures: 0, Errors: 0, Skipped: 0, Time elapsed: 0.066 sec - in org.apache.hadoop.io.erasurecode.TestECSchema
Tests run: 16, Failures: 0, Errors: 0, Skipped: 0, Time elapsed: 0.543 sec - in org.apache.hadoop.io.erasurecode.rawcoder.TestRSRawCoder
Running org.apache.hadoop.io.erasurecode.coder.TestXORCoder
Tests run: 2, Failures: 0, Errors: 0, Skipped: 0, Time elapsed: 0.531 sec - in org.apache.hadoop.io.erasurecode.TestCodecRawCoderMapping
Running org.apache.hadoop.io.erasurecode.coder.TestHHXORErasureCoder
Running org.apache.hadoop.io.erasurecode.coder.TestRSErasureCoder
Tests run: 2, Failures: 0, Errors: 0, Skipped: 0, Time elapsed: 0.603 sec - in org.apache.hadoop.io.erasurecode.coder.TestXORCoder
Running org.apache.hadoop.io.TestWritableUtils
Tests run: 1, Failures: 0, Errors: 0, Skipped: 0, Time elapsed: 0.152 sec - in org.apache.hadoop.io.TestWritableUtils
Running org.apache.hadoop.io.TestBooleanWritable
Tests run: 2, Failures: 0, Errors: 0, Skipped: 0, Time elapsed: 0.184 sec - in org.apache.hadoop.io.TestBooleanWritable
Tests run: 9, Failures: 0, Errors: 0, Skipped: 0, Time elapsed: 1.496 sec - in org.apache.hadoop.io.erasurecode.coder.TestHHXORErasureCoder
Running org.apache.hadoop.io.TestDataByteBuffers
Tests run: 10, Failures: 0, Errors: 0, Skipped: 0, Time elapsed: 1.293 sec - in org.apache.hadoop.io.erasurecode.coder.TestRSErasureCoder
Running org.apache.hadoop.io.TestEnumSetWritable
Running org.apache.hadoop.io.TestVersionedWritable
Tests run: 5, Failures: 0, Errors: 0, Skipped: 0, Time elapsed: 0.326 sec - in org.apache.hadoop.io.TestDataByteBuffers
Tests run: 3, Failures: 0, Errors: 0, Skipped: 0, Time elapsed: 0.162 sec - in org.apache.hadoop.io.TestVersionedWritable
Running org.apache.hadoop.io.TestMapWritable
Tests run: 6, Failures: 0, Errors: 0, Skipped: 0, Time elapsed: 0.416 sec - in org.apache.hadoop.io.TestEnumSetWritable
Running org.apache.hadoop.io.TestArrayPrimitiveWritable
Tests run: 5, Failures: 0, Errors: 0, Skipped: 0, Time elapsed: 0.194 sec - in org.apache.hadoop.io.TestMapWritable
Tests run: 3, Failures: 0, Errors: 0, Skipped: 0, Time elapsed: 0.168 sec - in org.apache.hadoop.io.TestArrayPrimitiveWritable
Running org.apache.hadoop.io.TestSetFile
Running org.apache.hadoop.io.TestUTF8
Running org.apache.hadoop.io.TestBoundedByteArrayOutputStream
Tests run: 2, Failures: 0, Errors: 0, Skipped: 0, Time elapsed: 0.076 sec - in org.apache.hadoop.io.TestBoundedByteArrayOutputStream
Running org.apache.hadoop.io.compress.TestCodecPool
Tests run: 8, Failures: 0, Errors: 0, Skipped: 0, Time elapsed: 0.632 sec - in org.apache.hadoop.io.TestUTF8
Tests run: 6, Failures: 0, Errors: 0, Skipped: 0, Time elapsed: 0.413 sec - in org.apache.hadoop.io.compress.TestCodecPool
Running org.apache.hadoop.io.compress.lz4.TestLz4CompressorDecompressor
Running org.apache.hadoop.io.compress.TestBlockDecompressorStream
Tests run: 2, Failures: 0, Errors: 0, Skipped: 0, Time elapsed: 0.12 sec - in org.apache.hadoop.io.compress.TestBlockDecompressorStream
Tests run: 13, Failures: 0, Errors: 0, Skipped: 0, Time elapsed: 0.389 sec - in org.apache.hadoop.io.compress.lz4.TestLz4CompressorDecompressor
Running org.apache.hadoop.io.compress.TestCodec
Tests run: 2, Failures: 0, Errors: 0, Skipped: 0, Time elapsed: 1.685 sec - in org.apache.hadoop.io.TestSetFile
Running org.apache.hadoop.io.compress.TestCompressorStream
Tests run: 1, Failures: 0, Errors: 0, Skipped: 0, Time elapsed: 0.067 sec - in org.apache.hadoop.io.compress.TestCompressorStream
Running org.apache.hadoop.io.compress.TestCompressorDecompressor
Running org.apache.hadoop.io.compress.zlib.TestZlibCompressorDecompressor
Tests run: 2, Failures: 0, Errors: 0, Skipped: 0, Time elapsed: 0.642 sec - in org.apache.hadoop.io.compress.TestCompressorDecompressor
Running org.apache.hadoop.io.compress.TestCodecFactory
Tests run: 10, Failures: 0, Errors: 0, Skipped: 0, Time elapsed: 0.876 sec - in org.apache.hadoop.io.compress.zlib.TestZlibCompressorDecompressor
Running org.apache.hadoop.io.compress.TestCompressionStreamReuse
Tests run: 1, Failures: 0, Errors: 0, Skipped: 0, Time elapsed: 0.573 sec - in org.apache.hadoop.io.compress.TestCodecFactory
Running org.apache.hadoop.io.compress.snappy.TestSnappyCompressorDecompressor
Tests run: 14, Failures: 0, Errors: 0, Skipped: 0, Time elapsed: 0.402 sec - in org.apache.hadoop.io.compress.snappy.TestSnappyCompressorDecompressor
Running org.apache.hadoop.io.compress.TestDecompressorStream
Tests run: 3, Failures: 0, Errors: 0, Skipped: 0, Time elapsed: 0.066 sec - in org.apache.hadoop.io.compress.TestDecompressorStream
Running org.apache.hadoop.io.compress.bzip2.TestBzip2CompressorDecompressor
Tests run: 2, Failures: 0, Errors: 0, Skipped: 2, Time elapsed: 0.32 sec - in org.apache.hadoop.io.compress.bzip2.TestBzip2CompressorDecompressor
Running org.apache.hadoop.io.serializer.TestSerializationFactory
Tests run: 5, Failures: 0, Errors: 0, Skipped: 0, Time elapsed: 0.515 sec - in org.apache.hadoop.io.serializer.TestSerializationFactory
Running org.apache.hadoop.io.serializer.avro.TestAvroSerialization
Tests run: 9, Failures: 0, Errors: 0, Skipped: 0, Time elapsed: 13.698 sec - in org.apache.hadoop.io.retry.TestFailoverProxy
Tests run: 5, Failures: 0, Errors: 0, Skipped: 0, Time elapsed: 0.653 sec - in org.apache.hadoop.io.serializer.avro.TestAvroSerialization
Running org.apache.hadoop.io.serializer.TestWritableSerialization
Running org.apache.hadoop.io.TestGenericWritable
Tests run: 3, Failures: 0, Errors: 0, Skipped: 0, Time elapsed: 0.47 sec - in org.apache.hadoop.io.serializer.TestWritableSerialization
Tests run: 5, Failures: 0, Errors: 0, Skipped: 0, Time elapsed: 0.426 sec - in org.apache.hadoop.io.TestGenericWritable
Running org.apache.hadoop.io.TestText
Tests run: 3, Failures: 0, Errors: 0, Skipped: 0, Time elapsed: 4.358 sec - in org.apache.hadoop.io.compress.TestCompressionStreamReuse
Running org.apache.hadoop.io.file.tfile.TestTFileNoneCodecsStreams
Running org.apache.hadoop.io.file.tfile.TestTFileLzoCodecsByteArrays
Tests run: 25, Failures: 0, Errors: 0, Skipped: 0, Time elapsed: 0.361 sec - in org.apache.hadoop.io.file.tfile.TestTFileLzoCodecsByteArrays
Tests run: 18, Failures: 0, Errors: 0, Skipped: 0, Time elapsed: 0.747 sec - in org.apache.hadoop.io.TestText
Running org.apache.hadoop.io.file.tfile.TestTFileSeek
Running org.apache.hadoop.io.file.tfile.TestCompression
Tests run: 1, Failures: 0, Errors: 0, Skipped: 0, Time elapsed: 0.395 sec - in org.apache.hadoop.io.file.tfile.TestCompression
Tests run: 19, Failures: 0, Errors: 0, Skipped: 0, Time elapsed: 1.33 sec - in org.apache.hadoop.io.file.tfile.TestTFileNoneCodecsStreams
Running org.apache.hadoop.io.file.tfile.TestTFileSplit
Running org.apache.hadoop.io.file.tfile.TestTFileSeqFileComparison
Tests run: 1, Failures: 0, Errors: 0, Skipped: 0, Time elapsed: 3.074 sec - in org.apache.hadoop.io.file.tfile.TestTFileSeek
Running org.apache.hadoop.io.file.tfile.TestTFileByteArrays
Tests run: 1, Failures: 0, Errors: 0, Skipped: 0, Time elapsed: 3.679 sec - in org.apache.hadoop.io.file.tfile.TestTFileSeqFileComparison
Running org.apache.hadoop.io.file.tfile.TestTFileComparator2
Tests run: 1, Failures: 0, Errors: 0, Skipped: 0, Time elapsed: 4.154 sec - in org.apache.hadoop.io.file.tfile.TestTFileSplit
Running org.apache.hadoop.io.file.tfile.TestTFileNoneCodecsByteArrays
Tests run: 25, Failures: 0, Errors: 0, Skipped: 0, Time elapsed: 1.943 sec - in org.apache.hadoop.io.file.tfile.TestTFileByteArrays
Running org.apache.hadoop.io.file.tfile.TestTFileNoneCodecsJClassComparatorByteArrays
Tests run: 1, Failures: 0, Errors: 0, Skipped: 0, Time elapsed: 1.09 sec - in org.apache.hadoop.io.file.tfile.TestTFileComparator2
Running org.apache.hadoop.io.file.tfile.TestTFileJClassComparatorByteArrays
Tests run: 25, Failures: 0, Errors: 0, Skipped: 0, Time elapsed: 1.264 sec - in org.apache.hadoop.io.file.tfile.TestTFileNoneCodecsByteArrays
Running org.apache.hadoop.io.file.tfile.TestTFileLzoCodecsStreams
Tests run: 19, Failures: 0, Errors: 0, Skipped: 0, Time elapsed: 0.41 sec - in org.apache.hadoop.io.file.tfile.TestTFileLzoCodecsStreams
Tests run: 25, Failures: 0, Errors: 0, Skipped: 0, Time elapsed: 1.279 sec - in org.apache.hadoop.io.file.tfile.TestTFileNoneCodecsJClassComparatorByteArrays
Running org.apache.hadoop.io.file.tfile.TestTFileComparators
Running org.apache.hadoop.io.file.tfile.TestTFileStreams
Tests run: 3, Failures: 0, Errors: 0, Skipped: 0, Time elapsed: 0.771 sec - in org.apache.hadoop.io.file.tfile.TestTFileComparators
Tests run: 25, Failures: 0, Errors: 0, Skipped: 0, Time elapsed: 2.153 sec - in org.apache.hadoop.io.file.tfile.TestTFileJClassComparatorByteArrays
Running org.apache.hadoop.io.file.tfile.TestTFileUnsortedByteArrays
Running org.apache.hadoop.io.file.tfile.TestVLong
Tests run: 19, Failures: 0, Errors: 0, Skipped: 0, Time elapsed: 1.349 sec - in org.apache.hadoop.io.file.tfile.TestTFileStreams
Running org.apache.hadoop.io.file.tfile.TestTFile
Tests run: 4, Failures: 0, Errors: 0, Skipped: 0, Time elapsed: 0.897 sec - in org.apache.hadoop.io.file.tfile.TestTFileUnsortedByteArrays
Running org.apache.hadoop.io.TestObjectWritableProtos
Tests run: 3, Failures: 0, Errors: 0, Skipped: 0, Time elapsed: 0.304 sec - in org.apache.hadoop.io.TestObjectWritableProtos
Tests run: 9, Failures: 0, Errors: 0, Skipped: 0, Time elapsed: 1.54 sec - in org.apache.hadoop.io.file.tfile.TestVLong
Running org.apache.hadoop.io.TestArrayWritable
Tests run: 3, Failures: 0, Errors: 0, Skipped: 0, Time elapsed: 1.168 sec - in org.apache.hadoop.io.file.tfile.TestTFile
Tests run: 4, Failures: 0, Errors: 0, Skipped: 0, Time elapsed: 0.204 sec - in org.apache.hadoop.io.TestArrayWritable
Running org.apache.hadoop.io.TestSequenceFileSerialization
Running org.apache.hadoop.io.TestArrayFile
Tests run: 1, Failures: 0, Errors: 0, Skipped: 0, Time elapsed: 0.745 sec - in org.apache.hadoop.io.TestSequenceFileSerialization
Tests run: 3, Failures: 0, Errors: 0, Skipped: 0, Time elapsed: 2.263 sec - in org.apache.hadoop.io.TestArrayFile
Tests run: 25, Failures: 0, Errors: 0, Skipped: 0, Time elapsed: 96.07 sec - in org.apache.hadoop.io.compress.TestCodec

Results :

Failed tests: 
  TestRollingFileSystemSink.testSetInitialFlushTime:120 The initial flush time was calculated
incorrectly: 0

Tests run: 3413, Failures: 1, Errors: 0, Skipped: 86

[INFO]                                                                         
[INFO] ------------------------------------------------------------------------
[INFO] Skipping Apache Hadoop NFS
[INFO] This project has been banned from the build due to previous failures.
[INFO] ------------------------------------------------------------------------
[INFO]                                                                         
[INFO] ------------------------------------------------------------------------
[INFO] Skipping Apache Hadoop KMS
[INFO] This project has been banned from the build due to previous failures.
[INFO] ------------------------------------------------------------------------
[INFO]                                                                         
[INFO] ------------------------------------------------------------------------
[INFO] Building Apache Hadoop Common Project 3.0.0-alpha1-SNAPSHOT
[INFO] ------------------------------------------------------------------------
[INFO] 
[INFO] --- maven-clean-plugin:2.5:clean (default-clean) @ hadoop-common-project ---
[INFO] Deleting <https://builds.apache.org/job/Hadoop-common-trunk-Java8/ws/source/hadoop-common-project/target>
[INFO] 
[INFO] --- maven-antrun-plugin:1.7:run (create-testdirs) @ hadoop-common-project ---
[INFO] Executing tasks

main:
    [mkdir] Created dir: <https://builds.apache.org/job/Hadoop-common-trunk-Java8/ws/source/hadoop-common-project/target/test-dir>
[INFO] Executed tasks
[INFO] 
[INFO] --- maven-source-plugin:2.3:jar-no-fork (hadoop-java-sources) @ hadoop-common-project
---
[INFO] 
[INFO] --- maven-source-plugin:2.3:test-jar-no-fork (hadoop-java-sources) @ hadoop-common-project
---
[INFO] 
[INFO] --- maven-enforcer-plugin:1.3.1:enforce (dist-enforce) @ hadoop-common-project ---
[INFO] 
[INFO] --- maven-site-plugin:3.5:attach-descriptor (attach-descriptor) @ hadoop-common-project
---
[INFO] 
[INFO] --- maven-javadoc-plugin:2.8.1:jar (module-javadocs) @ hadoop-common-project ---
[INFO] Not executing Javadoc as the project is not a Java classpath-capable package
[INFO] 
[INFO] --- maven-enforcer-plugin:1.3.1:enforce (depcheck) @ hadoop-common-project ---
[INFO] 
[INFO] --- maven-checkstyle-plugin:2.15:checkstyle (default-cli) @ hadoop-common-project ---
[INFO] 
[INFO] --- findbugs-maven-plugin:3.0.0:findbugs (default-cli) @ hadoop-common-project ---
[INFO] ------------------------------------------------------------------------
[INFO] Reactor Summary:
[INFO] 
[INFO] Apache Hadoop Annotations .......................... SUCCESS [ 12.714 s]
[INFO] Apache Hadoop MiniKDC .............................. SUCCESS [ 15.810 s]
[INFO] Apache Hadoop Auth ................................. SUCCESS [03:24 min]
[INFO] Apache Hadoop Auth Examples ........................ SUCCESS [  8.622 s]
[INFO] Apache Hadoop Common ............................... FAILURE [07:02 min]
[INFO] Apache Hadoop NFS .................................. SKIPPED
[INFO] Apache Hadoop KMS .................................. SKIPPED
[INFO] Apache Hadoop Common Project ....................... SUCCESS [  0.066 s]
[INFO] ------------------------------------------------------------------------
[INFO] BUILD FAILURE
[INFO] ------------------------------------------------------------------------
[INFO] Total time: 11:06 min
[INFO] Finished at: 2016-06-02T18:08:15+00:00
[INFO] Final Memory: 102M/2208M
[INFO] ------------------------------------------------------------------------
[ERROR] Failed to execute goal org.apache.maven.plugins:maven-surefire-plugin:2.17:test (default-test)
on project hadoop-common: There are test failures.
[ERROR] 
[ERROR] Please refer to <https://builds.apache.org/job/Hadoop-common-trunk-Java8/ws/source/hadoop-common-project/hadoop-common/target/surefire-reports>
for the individual test results.
[ERROR] -> [Help 1]
[ERROR] 
[ERROR] To see the full stack trace of the errors, re-run Maven with the -e switch.
[ERROR] Re-run Maven using the -X switch to enable full debug logging.
[ERROR] 
[ERROR] For more information about the errors and possible solutions, please read the following
articles:
[ERROR] [Help 1] http://cwiki.apache.org/confluence/display/MAVEN/MojoFailureException
[ERROR] 
[ERROR] After correcting the problems, you can resume the build with the command
[ERROR]   mvn <goals> -rf :hadoop-common
Build step 'Execute shell' marked build as failure
Archiving artifacts
Setting LATEST1_8_HOME=/home/jenkins/jenkins-slave/tools/hudson.model.JDK/latest1.8
Setting MAVEN_3_3_3_HOME=/home/jenkins/jenkins-slave/tools/hudson.tasks.Maven_MavenInstallation/maven-3.3.3
Recording test results
Setting LATEST1_8_HOME=/home/jenkins/jenkins-slave/tools/hudson.model.JDK/latest1.8
Setting MAVEN_3_3_3_HOME=/home/jenkins/jenkins-slave/tools/hudson.tasks.Maven_MavenInstallation/maven-3.3.3
Setting LATEST1_8_HOME=/home/jenkins/jenkins-slave/tools/hudson.model.JDK/latest1.8
Setting MAVEN_3_3_3_HOME=/home/jenkins/jenkins-slave/tools/hudson.tasks.Maven_MavenInstallation/maven-3.3.3

---------------------------------------------------------------------
To unsubscribe, e-mail: common-dev-unsubscribe@hadoop.apache.org
For additional commands, e-mail: common-dev-help@hadoop.apache.org


Mime
View raw message