hadoop-common-dev mailing list archives

Site index · List index
Message view « Date » · « Thread »
Top « Date » · « Thread »
From Apache Jenkins Server <jenk...@builds.apache.org>
Subject Build failed in Jenkins: Hadoop-common-trunk-Java8 #1482
Date Mon, 16 May 2016 23:34:30 GMT
See <https://builds.apache.org/job/Hadoop-common-trunk-Java8/1482/changes>

Changes:

[jing9] HADOOP-13146. Refactor RetryInvocationHandler. Contributed by Tsz Wo

[wang] HADOOP-11858. [JDK8] Set minimum version of Hadoop 3 to JDK 8.

------------------------------------------
[...truncated 5167 lines...]
Tests run: 1, Failures: 0, Errors: 0, Skipped: 0, Time elapsed: 0.432 sec - in org.apache.hadoop.fs.TestFileContext
Tests run: 17, Failures: 0, Errors: 0, Skipped: 4, Time elapsed: 1.928 sec - in org.apache.hadoop.fs.TestFsShellCopy
Running org.apache.hadoop.fs.TestDelegationTokenRenewer
Tests run: 12, Failures: 0, Errors: 0, Skipped: 0, Time elapsed: 2.893 sec - in org.apache.hadoop.fs.TestHarFileSystemBasics
Running org.apache.hadoop.fs.TestFileSystemCaching
Running org.apache.hadoop.fs.TestFcLocalFsUtil
Tests run: 2, Failures: 0, Errors: 0, Skipped: 0, Time elapsed: 1.014 sec - in org.apache.hadoop.fs.TestFcLocalFsUtil
Tests run: 13, Failures: 0, Errors: 0, Skipped: 0, Time elapsed: 1.461 sec - in org.apache.hadoop.fs.TestFileSystemCaching
Running org.apache.hadoop.fs.TestLocalFsFCStatistics
Running org.apache.hadoop.fs.TestTruncatedInputBug
Tests run: 1, Failures: 0, Errors: 0, Skipped: 0, Time elapsed: 0.934 sec - in org.apache.hadoop.fs.TestTruncatedInputBug
Tests run: 63, Failures: 0, Errors: 0, Skipped: 3, Time elapsed: 4.355 sec - in org.apache.hadoop.fs.TestSymlinkLocalFSFileContext
Running org.apache.hadoop.fs.TestFsShell
Running org.apache.hadoop.fs.TestDU
Tests run: 3, Failures: 0, Errors: 0, Skipped: 0, Time elapsed: 1.647 sec - in org.apache.hadoop.fs.TestLocalFsFCStatistics
Running org.apache.hadoop.fs.TestLocalDirAllocator
Tests run: 3, Failures: 0, Errors: 0, Skipped: 0, Time elapsed: 0.966 sec - in org.apache.hadoop.fs.TestFsShell
Running org.apache.hadoop.fs.viewfs.TestChRootedFileSystem
Tests run: 36, Failures: 0, Errors: 0, Skipped: 0, Time elapsed: 1.156 sec - in org.apache.hadoop.fs.TestLocalDirAllocator
Running org.apache.hadoop.fs.viewfs.TestViewFileSystemDelegationTokenSupport
Tests run: 5, Failures: 0, Errors: 0, Skipped: 0, Time elapsed: 5.99 sec - in org.apache.hadoop.fs.TestDelegationTokenRenewer
Running org.apache.hadoop.fs.viewfs.TestViewFsWithAuthorityLocalFs
Tests run: 18, Failures: 0, Errors: 0, Skipped: 0, Time elapsed: 1.544 sec - in org.apache.hadoop.fs.viewfs.TestChRootedFileSystem
Tests run: 4, Failures: 0, Errors: 0, Skipped: 0, Time elapsed: 1.04 sec - in org.apache.hadoop.fs.viewfs.TestViewFileSystemDelegationTokenSupport
Running org.apache.hadoop.fs.viewfs.TestViewFileSystemDelegation
Running org.apache.hadoop.fs.viewfs.TestViewFsConfig
Tests run: 1, Failures: 0, Errors: 0, Skipped: 0, Time elapsed: 0.864 sec - in org.apache.hadoop.fs.viewfs.TestViewFsConfig
Tests run: 3, Failures: 0, Errors: 0, Skipped: 0, Time elapsed: 1.5 sec - in org.apache.hadoop.fs.viewfs.TestViewFileSystemDelegation
Running org.apache.hadoop.fs.viewfs.TestViewFileSystemLocalFileSystem
Running org.apache.hadoop.fs.viewfs.TestFcPermissionsLocalFs
Tests run: 58, Failures: 0, Errors: 0, Skipped: 0, Time elapsed: 3.19 sec - in org.apache.hadoop.fs.viewfs.TestViewFsWithAuthorityLocalFs
Running org.apache.hadoop.fs.viewfs.TestFSMainOperationsLocalFileSystem
Tests run: 4, Failures: 0, Errors: 0, Skipped: 0, Time elapsed: 1.459 sec - in org.apache.hadoop.fs.viewfs.TestFcPermissionsLocalFs
Running org.apache.hadoop.fs.viewfs.TestViewFsURIs
Tests run: 1, Failures: 0, Errors: 0, Skipped: 0, Time elapsed: 1.146 sec - in org.apache.hadoop.fs.viewfs.TestViewFsURIs
Tests run: 60, Failures: 0, Errors: 0, Skipped: 0, Time elapsed: 3.836 sec - in org.apache.hadoop.fs.viewfs.TestViewFileSystemLocalFileSystem
Running org.apache.hadoop.fs.viewfs.TestViewFsTrash
Running org.apache.hadoop.fs.viewfs.TestViewFsLocalFs
Tests run: 49, Failures: 0, Errors: 0, Skipped: 0, Time elapsed: 3.095 sec - in org.apache.hadoop.fs.viewfs.TestFSMainOperationsLocalFileSystem
Running org.apache.hadoop.fs.viewfs.TestViewFileSystemWithAuthorityLocalFileSystem
Tests run: 3, Failures: 0, Errors: 0, Skipped: 0, Time elapsed: 10.583 sec - in org.apache.hadoop.fs.TestDU
Running org.apache.hadoop.fs.viewfs.TestViewfsFileStatus
Tests run: 1, Failures: 0, Errors: 0, Skipped: 0, Time elapsed: 2.209 sec - in org.apache.hadoop.fs.viewfs.TestViewFsTrash
Running org.apache.hadoop.fs.viewfs.TestFcCreateMkdirLocalFs
Tests run: 58, Failures: 0, Errors: 0, Skipped: 0, Time elapsed: 3.462 sec - in org.apache.hadoop.fs.viewfs.TestViewFsLocalFs
Tests run: 2, Failures: 0, Errors: 0, Skipped: 0, Time elapsed: 1.933 sec - in org.apache.hadoop.fs.viewfs.TestViewfsFileStatus
Running org.apache.hadoop.fs.viewfs.TestChRootedFs
Running org.apache.hadoop.fs.viewfs.TestFcMainOperationsLocalFs
Tests run: 8, Failures: 0, Errors: 0, Skipped: 0, Time elapsed: 1.856 sec - in org.apache.hadoop.fs.viewfs.TestFcCreateMkdirLocalFs
Running org.apache.hadoop.fs.TestFSMainOperationsLocalFileSystem
Tests run: 60, Failures: 0, Errors: 0, Skipped: 0, Time elapsed: 5.231 sec - in org.apache.hadoop.fs.viewfs.TestViewFileSystemWithAuthorityLocalFileSystem
Tests run: 14, Failures: 0, Errors: 0, Skipped: 0, Time elapsed: 2.354 sec - in org.apache.hadoop.fs.viewfs.TestChRootedFs
Running org.apache.hadoop.fs.TestFcLocalFsPermission
Running org.apache.hadoop.fs.TestAfsCheckPath
Tests run: 4, Failures: 0, Errors: 0, Skipped: 0, Time elapsed: 0.342 sec - in org.apache.hadoop.fs.TestAfsCheckPath
Running org.apache.hadoop.fs.TestFileUtil
Tests run: 4, Failures: 0, Errors: 0, Skipped: 0, Time elapsed: 1.231 sec - in org.apache.hadoop.fs.TestFcLocalFsPermission
Tests run: 49, Failures: 0, Errors: 0, Skipped: 0, Time elapsed: 2.532 sec - in org.apache.hadoop.fs.TestFSMainOperationsLocalFileSystem
Running org.apache.hadoop.fs.TestGlobPattern
Running org.apache.hadoop.fs.TestDFVariations
Tests run: 61, Failures: 0, Errors: 0, Skipped: 0, Time elapsed: 4.024 sec - in org.apache.hadoop.fs.viewfs.TestFcMainOperationsLocalFs
Tests run: 3, Failures: 0, Errors: 0, Skipped: 0, Time elapsed: 0.219 sec - in org.apache.hadoop.fs.TestGlobPattern
Tests run: 5, Failures: 0, Errors: 0, Skipped: 0, Time elapsed: 0.279 sec - in org.apache.hadoop.fs.TestDFVariations
Running org.apache.hadoop.fs.TestBlockLocation
Tests run: 2, Failures: 0, Errors: 0, Skipped: 0, Time elapsed: 0.123 sec - in org.apache.hadoop.fs.TestBlockLocation
Running org.apache.hadoop.fs.shell.TestCopy
Running org.apache.hadoop.fs.shell.TestCopyPreserveFlag
Running org.apache.hadoop.fs.shell.TestPathExceptions
Tests run: 4, Failures: 0, Errors: 0, Skipped: 0, Time elapsed: 0.14 sec - in org.apache.hadoop.fs.shell.TestPathExceptions
Running org.apache.hadoop.fs.shell.TestAclCommands
Tests run: 5, Failures: 0, Errors: 0, Skipped: 0, Time elapsed: 1.229 sec - in org.apache.hadoop.fs.shell.TestCopy
Tests run: 8, Failures: 0, Errors: 0, Skipped: 0, Time elapsed: 1.134 sec - in org.apache.hadoop.fs.shell.TestCopyPreserveFlag
Running org.apache.hadoop.fs.shell.TestLs
Running org.apache.hadoop.fs.shell.TestTextCommand
Tests run: 7, Failures: 0, Errors: 0, Skipped: 0, Time elapsed: 1.135 sec - in org.apache.hadoop.fs.shell.TestAclCommands
Running org.apache.hadoop.fs.shell.TestMove
Tests run: 4, Failures: 0, Errors: 0, Skipped: 0, Time elapsed: 1.367 sec - in org.apache.hadoop.fs.shell.TestTextCommand
Tests run: 33, Failures: 0, Errors: 0, Skipped: 0, Time elapsed: 1.712 sec - in org.apache.hadoop.fs.shell.TestLs
Running org.apache.hadoop.fs.shell.TestPathData
Tests run: 1, Failures: 0, Errors: 0, Skipped: 0, Time elapsed: 1.247 sec - in org.apache.hadoop.fs.shell.TestMove
Running org.apache.hadoop.fs.shell.TestCommandFactory
Tests run: 2, Failures: 0, Errors: 0, Skipped: 0, Time elapsed: 0.311 sec - in org.apache.hadoop.fs.shell.TestCommandFactory
Running org.apache.hadoop.fs.shell.TestCount
Running org.apache.hadoop.fs.shell.TestXAttrCommands
Tests run: 11, Failures: 0, Errors: 0, Skipped: 0, Time elapsed: 1.317 sec - in org.apache.hadoop.fs.shell.TestPathData
Running org.apache.hadoop.fs.shell.find.TestPrint0
Tests run: 2, Failures: 0, Errors: 0, Skipped: 0, Time elapsed: 0.681 sec - in org.apache.hadoop.fs.shell.TestXAttrCommands
Tests run: 25, Failures: 0, Errors: 0, Skipped: 0, Time elapsed: 1.2 sec - in org.apache.hadoop.fs.shell.TestCount
Running org.apache.hadoop.fs.shell.find.TestResult
Tests run: 18, Failures: 0, Errors: 0, Skipped: 0, Time elapsed: 0.111 sec - in org.apache.hadoop.fs.shell.find.TestResult
Running org.apache.hadoop.fs.shell.find.TestAnd
Tests run: 1, Failures: 0, Errors: 0, Skipped: 0, Time elapsed: 0.992 sec - in org.apache.hadoop.fs.shell.find.TestPrint0
Running org.apache.hadoop.fs.shell.find.TestName
Tests run: 10, Failures: 0, Errors: 0, Skipped: 0, Time elapsed: 0.36 sec - in org.apache.hadoop.fs.shell.find.TestAnd
Running org.apache.hadoop.fs.shell.find.TestFilterExpression
Tests run: 26, Failures: 0, Errors: 0, Skipped: 0, Time elapsed: 7.897 sec - in org.apache.hadoop.fs.TestFileUtil
Running org.apache.hadoop.fs.shell.find.TestFind
Tests run: 11, Failures: 0, Errors: 0, Skipped: 0, Time elapsed: 0.435 sec - in org.apache.hadoop.fs.shell.find.TestFilterExpression
Running org.apache.hadoop.fs.shell.find.TestIname
Tests run: 6, Failures: 0, Errors: 0, Skipped: 0, Time elapsed: 1.087 sec - in org.apache.hadoop.fs.shell.find.TestName
Running org.apache.hadoop.fs.shell.find.TestPrint
Running org.apache.hadoop.fs.TestFileSystemInitialization
Tests run: 6, Failures: 0, Errors: 0, Skipped: 0, Time elapsed: 1.279 sec - in org.apache.hadoop.fs.shell.find.TestIname
Tests run: 24, Failures: 0, Errors: 0, Skipped: 0, Time elapsed: 1.767 sec - in org.apache.hadoop.fs.shell.find.TestFind
Tests run: 1, Failures: 0, Errors: 0, Skipped: 0, Time elapsed: 1.091 sec - in org.apache.hadoop.fs.shell.find.TestPrint
Tests run: 2, Failures: 0, Errors: 0, Skipped: 0, Time elapsed: 0.802 sec - in org.apache.hadoop.fs.TestFileSystemInitialization
Running org.apache.hadoop.fs.TestHarFileSystem
Running org.apache.hadoop.fs.TestFileSystemTokens
Running org.apache.hadoop.fs.TestLocalFSFileContextCreateMkdir
Running org.apache.hadoop.fs.TestGetFileBlockLocations
Tests run: 10, Failures: 0, Errors: 0, Skipped: 0, Time elapsed: 0.65 sec - in org.apache.hadoop.fs.TestFileSystemTokens
Tests run: 4, Failures: 0, Errors: 0, Skipped: 0, Time elapsed: 0.778 sec - in org.apache.hadoop.fs.TestHarFileSystem
Tests run: 3, Failures: 0, Errors: 0, Skipped: 0, Time elapsed: 0.947 sec - in org.apache.hadoop.fs.TestGetFileBlockLocations
Tests run: 8, Failures: 0, Errors: 0, Skipped: 0, Time elapsed: 1.056 sec - in org.apache.hadoop.fs.TestLocalFSFileContextCreateMkdir
Running org.apache.hadoop.fs.sftp.TestSFTPFileSystem
Running org.apache.hadoop.fs.TestAvroFSInput
Running org.apache.hadoop.fs.TestFilterFs
Running org.apache.hadoop.fs.TestGetSpaceUsed
Tests run: 1, Failures: 0, Errors: 0, Skipped: 0, Time elapsed: 0.232 sec - in org.apache.hadoop.fs.TestFilterFs
Tests run: 1, Failures: 0, Errors: 0, Skipped: 0, Time elapsed: 0.842 sec - in org.apache.hadoop.fs.TestAvroFSInput
Tests run: 4, Failures: 0, Errors: 0, Skipped: 0, Time elapsed: 0.477 sec - in org.apache.hadoop.fs.TestGetSpaceUsed
Running org.apache.hadoop.fs.TestLocalFSFileContextMainOperations
Running org.apache.hadoop.fs.TestS3_LocalFileContextURI
Running org.apache.hadoop.fs.TestSymlinkLocalFSFileSystem
Tests run: 17, Failures: 0, Errors: 0, Skipped: 0, Time elapsed: 1.498 sec - in org.apache.hadoop.fs.TestS3_LocalFileContextURI
Tests run: 63, Failures: 0, Errors: 0, Skipped: 0, Time elapsed: 2.171 sec - in org.apache.hadoop.fs.TestLocalFSFileContextMainOperations
Running org.apache.hadoop.fs.TestFsShellReturnCode
Running org.apache.hadoop.fs.ftp.TestFTPFileSystem
Tests run: 1, Failures: 0, Errors: 0, Skipped: 0, Time elapsed: 0.205 sec - in org.apache.hadoop.fs.ftp.TestFTPFileSystem
Running org.apache.hadoop.fs.TestHardLink
Tests run: 63, Failures: 0, Errors: 0, Skipped: 7, Time elapsed: 2.928 sec - in org.apache.hadoop.fs.TestSymlinkLocalFSFileSystem
Tests run: 5, Failures: 0, Errors: 0, Skipped: 0, Time elapsed: 0.296 sec - in org.apache.hadoop.fs.TestHardLink
Running org.apache.hadoop.fs.TestListFiles
Running org.apache.hadoop.fs.TestLocal_S3FileContextURI
Tests run: 10, Failures: 0, Errors: 0, Skipped: 0, Time elapsed: 1.846 sec - in org.apache.hadoop.fs.TestFsShellReturnCode
Tests run: 2, Failures: 0, Errors: 0, Skipped: 0, Time elapsed: 0.721 sec - in org.apache.hadoop.fs.TestListFiles
Running org.apache.hadoop.fs.TestDelegateToFileSystem
Running org.apache.hadoop.ha.TestZKFailoverControllerStress
Tests run: 17, Failures: 0, Errors: 0, Skipped: 0, Time elapsed: 1.135 sec - in org.apache.hadoop.fs.TestLocal_S3FileContextURI
Tests run: 2, Failures: 0, Errors: 0, Skipped: 0, Time elapsed: 0.435 sec - in org.apache.hadoop.fs.TestDelegateToFileSystem
Running org.apache.hadoop.ha.TestShellCommandFencer
Running org.apache.hadoop.ha.TestFailoverController
Tests run: 9, Failures: 0, Errors: 0, Skipped: 0, Time elapsed: 1.064 sec - in org.apache.hadoop.ha.TestShellCommandFencer
Running org.apache.hadoop.ha.TestNodeFencer
Tests run: 17, Failures: 0, Errors: 0, Skipped: 0, Time elapsed: 1.766 sec - in org.apache.hadoop.ha.TestFailoverController
Running org.apache.hadoop.ha.TestActiveStandbyElectorRealZK
Tests run: 9, Failures: 0, Errors: 0, Skipped: 0, Time elapsed: 0.877 sec - in org.apache.hadoop.ha.TestNodeFencer
Running org.apache.hadoop.ha.TestSshFenceByTcpPort
Tests run: 4, Failures: 0, Errors: 0, Skipped: 1, Time elapsed: 3.69 sec - in org.apache.hadoop.ha.TestSshFenceByTcpPort
Running org.apache.hadoop.ha.TestZKFailoverController
Tests run: 9, Failures: 0, Errors: 0, Skipped: 0, Time elapsed: 13.738 sec - in org.apache.hadoop.fs.sftp.TestSFTPFileSystem
Running org.apache.hadoop.ha.TestHealthMonitorWithDedicatedHealthAddress
Exception: java.lang.RuntimeException thrown from the UncaughtExceptionHandler in thread "Health
Monitor for DummyHAService #3"
Tests run: 3, Failures: 0, Errors: 0, Skipped: 0, Time elapsed: 1.867 sec - in org.apache.hadoop.ha.TestHealthMonitorWithDedicatedHealthAddress
Running org.apache.hadoop.ha.TestActiveStandbyElector
Tests run: 4, Failures: 0, Errors: 0, Skipped: 0, Time elapsed: 10.417 sec - in org.apache.hadoop.ha.TestActiveStandbyElectorRealZK
Running org.apache.hadoop.ha.TestHAAdmin
Tests run: 2, Failures: 0, Errors: 0, Skipped: 0, Time elapsed: 0.4 sec - in org.apache.hadoop.ha.TestHAAdmin
Tests run: 23, Failures: 0, Errors: 0, Skipped: 0, Time elapsed: 2.906 sec - in org.apache.hadoop.ha.TestActiveStandbyElector
Running org.apache.hadoop.ha.TestHealthMonitor
Running org.apache.hadoop.service.TestGlobalStateChangeListener
Tests run: 5, Failures: 0, Errors: 0, Skipped: 0, Time elapsed: 0.2 sec - in org.apache.hadoop.service.TestGlobalStateChangeListener
Running org.apache.hadoop.service.TestServiceLifecycle
Exception: java.lang.RuntimeException thrown from the UncaughtExceptionHandler in thread "Health
Monitor for DummyHAService #3"
Tests run: 3, Failures: 0, Errors: 0, Skipped: 0, Time elapsed: 1.876 sec - in org.apache.hadoop.ha.TestHealthMonitor
Running org.apache.hadoop.service.TestCompositeService
Tests run: 42, Failures: 0, Errors: 0, Skipped: 0, Time elapsed: 0.281 sec - in org.apache.hadoop.service.TestCompositeService
Tests run: 18, Failures: 0, Errors: 0, Skipped: 0, Time elapsed: 2.349 sec - in org.apache.hadoop.service.TestServiceLifecycle
Tests run: 20, Failures: 0, Errors: 0, Skipped: 0, Time elapsed: 57.78 sec - in org.apache.hadoop.ha.TestZKFailoverController
Tests run: 3, Failures: 0, Errors: 0, Skipped: 0, Time elapsed: 95.808 sec - in org.apache.hadoop.ha.TestZKFailoverControllerStress

Results :

Failed tests: 
  TestDNS.testNullDnsServer:124 
Expected: is "localhost"
     but: was "asf909.gq1.ygridcore.net"
  TestDNS.testDefaultDnsServer:134 
Expected: is "asf909.gq1.ygridcore.net"
     but: was "localhost"

Tests run: 3392, Failures: 2, Errors: 0, Skipped: 86

[INFO] ------------------------------------------------------------------------
[INFO] Reactor Summary:
[INFO] 
[INFO] Apache Hadoop Annotations ......................... SUCCESS [  5.821 s]
[INFO] Apache Hadoop MiniKDC ............................. SUCCESS [01:36 min]
[INFO] Apache Hadoop Auth ................................ SUCCESS [14:33 min]
[INFO] Apache Hadoop Auth Examples ....................... SUCCESS [  3.881 s]
[INFO] Apache Hadoop Common .............................. FAILURE [07:51 min]
[INFO] Apache Hadoop NFS ................................. SKIPPED
[INFO] Apache Hadoop KMS ................................. SKIPPED
[INFO] Apache Hadoop Common Project ...................... SKIPPED
[INFO] ------------------------------------------------------------------------
[INFO] BUILD FAILURE
[INFO] ------------------------------------------------------------------------
[INFO] Total time: 24:12 min
[INFO] Finished at: 2016-05-16T23:34:23+00:00
[INFO] Final Memory: 64M/308M
[INFO] ------------------------------------------------------------------------
[ERROR] Failed to execute goal org.apache.maven.plugins:maven-surefire-plugin:2.17:test (default-test)
on project hadoop-common: There are test failures.
[ERROR] 
[ERROR] Please refer to <https://builds.apache.org/job/Hadoop-common-trunk-Java8/ws/hadoop-common-project/hadoop-common/target/surefire-reports>
for the individual test results.
[ERROR] -> [Help 1]
org.apache.maven.lifecycle.LifecycleExecutionException: Failed to execute goal org.apache.maven.plugins:maven-surefire-plugin:2.17:test
(default-test) on project hadoop-common: There are test failures.

Please refer to <https://builds.apache.org/job/Hadoop-common-trunk-Java8/ws/hadoop-common-project/hadoop-common/target/surefire-reports>
for the individual test results.
	at org.apache.maven.lifecycle.internal.MojoExecutor.execute(MojoExecutor.java:212)
	at org.apache.maven.lifecycle.internal.MojoExecutor.execute(MojoExecutor.java:153)
	at org.apache.maven.lifecycle.internal.MojoExecutor.execute(MojoExecutor.java:145)
	at org.apache.maven.lifecycle.internal.LifecycleModuleBuilder.buildProject(LifecycleModuleBuilder.java:108)
	at org.apache.maven.lifecycle.internal.LifecycleModuleBuilder.buildProject(LifecycleModuleBuilder.java:76)
	at org.apache.maven.lifecycle.internal.builder.singlethreaded.SingleThreadedBuilder.build(SingleThreadedBuilder.java:51)
	at org.apache.maven.lifecycle.internal.LifecycleStarter.execute(LifecycleStarter.java:116)
	at org.apache.maven.DefaultMaven.doExecute(DefaultMaven.java:361)
	at org.apache.maven.DefaultMaven.execute(DefaultMaven.java:155)
	at org.apache.maven.cli.MavenCli.execute(MavenCli.java:584)
	at org.apache.maven.cli.MavenCli.doMain(MavenCli.java:213)
	at org.apache.maven.cli.MavenCli.main(MavenCli.java:157)
	at sun.reflect.NativeMethodAccessorImpl.invoke0(Native Method)
	at sun.reflect.NativeMethodAccessorImpl.invoke(NativeMethodAccessorImpl.java:62)
	at sun.reflect.DelegatingMethodAccessorImpl.invoke(DelegatingMethodAccessorImpl.java:43)
	at java.lang.reflect.Method.invoke(Method.java:483)
	at org.codehaus.plexus.classworlds.launcher.Launcher.launchEnhanced(Launcher.java:289)
	at org.codehaus.plexus.classworlds.launcher.Launcher.launch(Launcher.java:229)
	at org.codehaus.plexus.classworlds.launcher.Launcher.mainWithExitCode(Launcher.java:415)
	at org.codehaus.plexus.classworlds.launcher.Launcher.main(Launcher.java:356)
Caused by: org.apache.maven.plugin.MojoFailureException: There are test failures.

Please refer to <https://builds.apache.org/job/Hadoop-common-trunk-Java8/ws/hadoop-common-project/hadoop-common/target/surefire-reports>
for the individual test results.
	at org.apache.maven.plugin.surefire.SurefireHelper.reportExecution(SurefireHelper.java:82)
	at org.apache.maven.plugin.surefire.SurefirePlugin.handleSummary(SurefirePlugin.java:195)
	at org.apache.maven.plugin.surefire.AbstractSurefireMojo.executeAfterPreconditionsChecked(AbstractSurefireMojo.java:861)
	at org.apache.maven.plugin.surefire.AbstractSurefireMojo.execute(AbstractSurefireMojo.java:729)
	at org.apache.maven.plugin.DefaultBuildPluginManager.executeMojo(DefaultBuildPluginManager.java:133)
	at org.apache.maven.lifecycle.internal.MojoExecutor.execute(MojoExecutor.java:208)
	... 19 more
[ERROR] 
[ERROR] Re-run Maven using the -X switch to enable full debug logging.
[ERROR] 
[ERROR] For more information about the errors and possible solutions, please read the following
articles:
[ERROR] [Help 1] http://cwiki.apache.org/confluence/display/MAVEN/MojoFailureException
[ERROR] 
[ERROR] After correcting the problems, you can resume the build with the command
[ERROR]   mvn <goals> -rf :hadoop-common
Build step 'Execute shell' marked build as failure
Archiving artifacts
Recording test results

---------------------------------------------------------------------
To unsubscribe, e-mail: common-dev-unsubscribe@hadoop.apache.org
For additional commands, e-mail: common-dev-help@hadoop.apache.org


Mime
View raw message