hadoop-common-dev mailing list archives

Site index · List index
Message view « Date » · « Thread »
Top « Date » · « Thread »
From Apache Jenkins Server <jenk...@builds.apache.org>
Subject Build failed in Jenkins: Hadoop-Common-trunk #2711
Date Tue, 03 May 2016 19:40:21 GMT
See <https://builds.apache.org/job/Hadoop-Common-trunk/2711/changes>

Changes:

[jlowe] YARN-4834. ProcfsBasedProcessTree doesn't track daemonized processes.

------------------------------------------
[...truncated 5155 lines...]
Tests run: 22, Failures: 0, Errors: 0, Skipped: 0, Time elapsed: 5.523 sec - in org.apache.hadoop.util.TestShell
Running org.apache.hadoop.util.TestShutdownHookManager
Tests run: 1, Failures: 0, Errors: 0, Skipped: 0, Time elapsed: 0.251 sec - in org.apache.hadoop.util.TestShutdownHookManager
Running org.apache.hadoop.util.TestConfTest
Tests run: 14, Failures: 0, Errors: 0, Skipped: 0, Time elapsed: 0.367 sec - in org.apache.hadoop.util.TestConfTest
Running org.apache.hadoop.util.TestHttpExceptionUtils
Tests run: 7, Failures: 0, Errors: 0, Skipped: 0, Time elapsed: 0.924 sec - in org.apache.hadoop.util.TestHttpExceptionUtils
Running org.apache.hadoop.util.TestJarFinder
Tests run: 4, Failures: 0, Errors: 0, Skipped: 0, Time elapsed: 1.164 sec - in org.apache.hadoop.util.TestJarFinder
Running org.apache.hadoop.util.hash.TestHash
Tests run: 1, Failures: 0, Errors: 0, Skipped: 0, Time elapsed: 0.571 sec - in org.apache.hadoop.util.hash.TestHash
Running org.apache.hadoop.util.TestLightWeightCache
Tests run: 1, Failures: 0, Errors: 0, Skipped: 0, Time elapsed: 14.81 sec - in org.apache.hadoop.util.TestLightWeightCache
Running org.apache.hadoop.util.TestNativeCodeLoader
Tests run: 1, Failures: 0, Errors: 0, Skipped: 0, Time elapsed: 0.218 sec - in org.apache.hadoop.util.TestNativeCodeLoader
Running org.apache.hadoop.util.TestReflectionUtils
Tests run: 5, Failures: 0, Errors: 0, Skipped: 0, Time elapsed: 0.844 sec - in org.apache.hadoop.util.TestReflectionUtils
Running org.apache.hadoop.crypto.TestCryptoStreams
Tests run: 14, Failures: 0, Errors: 0, Skipped: 0, Time elapsed: 28.722 sec - in org.apache.hadoop.crypto.TestCryptoStreams
Running org.apache.hadoop.crypto.TestCryptoStreamsForLocalFS
Tests run: 14, Failures: 0, Errors: 0, Skipped: 5, Time elapsed: 16.5 sec - in org.apache.hadoop.crypto.TestCryptoStreamsForLocalFS
Running org.apache.hadoop.crypto.TestOpensslCipher
Tests run: 3, Failures: 0, Errors: 0, Skipped: 0, Time elapsed: 0.257 sec - in org.apache.hadoop.crypto.TestOpensslCipher
Running org.apache.hadoop.crypto.TestCryptoStreamsWithOpensslAesCtrCryptoCodec
Tests run: 14, Failures: 0, Errors: 0, Skipped: 0, Time elapsed: 29.543 sec - in org.apache.hadoop.crypto.TestCryptoStreamsWithOpensslAesCtrCryptoCodec
Running org.apache.hadoop.crypto.TestCryptoStreamsNormal
Tests run: 14, Failures: 0, Errors: 0, Skipped: 8, Time elapsed: 9.275 sec - in org.apache.hadoop.crypto.TestCryptoStreamsNormal
Running org.apache.hadoop.crypto.TestCryptoCodec
Tests run: 3, Failures: 0, Errors: 0, Skipped: 0, Time elapsed: 18.888 sec - in org.apache.hadoop.crypto.TestCryptoCodec
Running org.apache.hadoop.crypto.random.TestOsSecureRandom
Tests run: 6, Failures: 0, Errors: 0, Skipped: 0, Time elapsed: 0.852 sec - in org.apache.hadoop.crypto.random.TestOsSecureRandom
Running org.apache.hadoop.crypto.random.TestOpensslSecureRandom
Tests run: 5, Failures: 0, Errors: 0, Skipped: 0, Time elapsed: 0.232 sec - in org.apache.hadoop.crypto.random.TestOpensslSecureRandom
Running org.apache.hadoop.crypto.TestCryptoStreamsWithJceAesCtrCryptoCodec
Tests run: 14, Failures: 0, Errors: 0, Skipped: 0, Time elapsed: 31.725 sec - in org.apache.hadoop.crypto.TestCryptoStreamsWithJceAesCtrCryptoCodec
Running org.apache.hadoop.crypto.key.TestKeyProviderDelegationTokenExtension
Tests run: 1, Failures: 0, Errors: 0, Skipped: 0, Time elapsed: 1.005 sec - in org.apache.hadoop.crypto.key.TestKeyProviderDelegationTokenExtension
Running org.apache.hadoop.crypto.key.TestCachingKeyProvider
Tests run: 5, Failures: 0, Errors: 0, Skipped: 0, Time elapsed: 2.245 sec - in org.apache.hadoop.crypto.key.TestCachingKeyProvider
Running org.apache.hadoop.crypto.key.TestKeyProviderFactory
Tests run: 8, Failures: 0, Errors: 0, Skipped: 0, Time elapsed: 2.016 sec - in org.apache.hadoop.crypto.key.TestKeyProviderFactory
Running org.apache.hadoop.crypto.key.TestValueQueue
Tests run: 8, Failures: 0, Errors: 0, Skipped: 0, Time elapsed: 1.387 sec - in org.apache.hadoop.crypto.key.TestValueQueue
Running org.apache.hadoop.crypto.key.kms.TestLoadBalancingKMSClientProvider
Tests run: 4, Failures: 0, Errors: 0, Skipped: 0, Time elapsed: 1.257 sec - in org.apache.hadoop.crypto.key.kms.TestLoadBalancingKMSClientProvider
Running org.apache.hadoop.crypto.key.TestKeyProvider
Tests run: 8, Failures: 0, Errors: 0, Skipped: 0, Time elapsed: 1.041 sec - in org.apache.hadoop.crypto.key.TestKeyProvider
Running org.apache.hadoop.crypto.key.TestKeyShell
Tests run: 9, Failures: 0, Errors: 0, Skipped: 0, Time elapsed: 1.985 sec - in org.apache.hadoop.crypto.key.TestKeyShell
Running org.apache.hadoop.crypto.key.TestKeyProviderCryptoExtension
Tests run: 2, Failures: 0, Errors: 0, Skipped: 0, Time elapsed: 1.491 sec - in org.apache.hadoop.crypto.key.TestKeyProviderCryptoExtension
Running org.apache.hadoop.io.TestSequenceFile
Tests run: 9, Failures: 0, Errors: 0, Skipped: 0, Time elapsed: 12.542 sec - in org.apache.hadoop.io.TestSequenceFile
Running org.apache.hadoop.io.TestSecureIOUtils
Tests run: 4, Failures: 0, Errors: 0, Skipped: 0, Time elapsed: 1.038 sec - in org.apache.hadoop.io.TestSecureIOUtils
Running org.apache.hadoop.io.nativeio.TestSharedFileDescriptorFactory
Tests run: 3, Failures: 0, Errors: 0, Skipped: 0, Time elapsed: 0.517 sec - in org.apache.hadoop.io.nativeio.TestSharedFileDescriptorFactory
Running org.apache.hadoop.io.nativeio.TestNativeIO
Tests run: 20, Failures: 0, Errors: 0, Skipped: 0, Time elapsed: 7.566 sec - in org.apache.hadoop.io.nativeio.TestNativeIO
Running org.apache.hadoop.io.TestWritable
Tests run: 6, Failures: 0, Errors: 0, Skipped: 0, Time elapsed: 0.478 sec - in org.apache.hadoop.io.TestWritable
Running org.apache.hadoop.io.TestIOUtils
Tests run: 12, Failures: 0, Errors: 0, Skipped: 0, Time elapsed: 0.578 sec - in org.apache.hadoop.io.TestIOUtils
Running org.apache.hadoop.io.TestTextNonUTF8
Tests run: 1, Failures: 0, Errors: 0, Skipped: 0, Time elapsed: 0.249 sec - in org.apache.hadoop.io.TestTextNonUTF8
Running org.apache.hadoop.io.TestMD5Hash
Tests run: 2, Failures: 0, Errors: 0, Skipped: 0, Time elapsed: 0.26 sec - in org.apache.hadoop.io.TestMD5Hash
Running org.apache.hadoop.io.TestSequenceFileAppend
Tests run: 4, Failures: 0, Errors: 0, Skipped: 0, Time elapsed: 1.139 sec - in org.apache.hadoop.io.TestSequenceFileAppend
Running org.apache.hadoop.io.TestMapFile
Tests run: 21, Failures: 0, Errors: 0, Skipped: 0, Time elapsed: 2.057 sec - in org.apache.hadoop.io.TestMapFile
Running org.apache.hadoop.io.TestWritableName
Tests run: 4, Failures: 0, Errors: 0, Skipped: 0, Time elapsed: 0.261 sec - in org.apache.hadoop.io.TestWritableName
Running org.apache.hadoop.io.TestSortedMapWritable
Tests run: 4, Failures: 0, Errors: 0, Skipped: 0, Time elapsed: 0.306 sec - in org.apache.hadoop.io.TestSortedMapWritable
Running org.apache.hadoop.io.TestSequenceFileSync
Tests run: 1, Failures: 0, Errors: 0, Skipped: 0, Time elapsed: 1.385 sec - in org.apache.hadoop.io.TestSequenceFileSync
Running org.apache.hadoop.io.retry.TestFailoverProxy
Tests run: 9, Failures: 0, Errors: 0, Skipped: 0, Time elapsed: 12.88 sec - in org.apache.hadoop.io.retry.TestFailoverProxy
Running org.apache.hadoop.io.retry.TestDefaultRetryPolicy
Tests run: 3, Failures: 0, Errors: 0, Skipped: 0, Time elapsed: 0.597 sec - in org.apache.hadoop.io.retry.TestDefaultRetryPolicy
Running org.apache.hadoop.io.retry.TestRetryProxy
Tests run: 12, Failures: 0, Errors: 0, Skipped: 0, Time elapsed: 1.631 sec - in org.apache.hadoop.io.retry.TestRetryProxy
Running org.apache.hadoop.io.TestDefaultStringifier
Tests run: 4, Failures: 0, Errors: 0, Skipped: 0, Time elapsed: 0.558 sec - in org.apache.hadoop.io.TestDefaultStringifier
Running org.apache.hadoop.io.TestBloomMapFile
Tests run: 7, Failures: 0, Errors: 0, Skipped: 0, Time elapsed: 2.167 sec - in org.apache.hadoop.io.TestBloomMapFile
Running org.apache.hadoop.io.TestBytesWritable
Tests run: 6, Failures: 0, Errors: 0, Skipped: 0, Time elapsed: 0.236 sec - in org.apache.hadoop.io.TestBytesWritable
Running org.apache.hadoop.io.erasurecode.rawcoder.TestDummyRawCoder
Tests run: 3, Failures: 0, Errors: 0, Skipped: 0, Time elapsed: 0.264 sec - in org.apache.hadoop.io.erasurecode.rawcoder.TestDummyRawCoder
Running org.apache.hadoop.io.erasurecode.rawcoder.TestRSRawCoderLegacy
Tests run: 16, Failures: 0, Errors: 0, Skipped: 0, Time elapsed: 0.658 sec - in org.apache.hadoop.io.erasurecode.rawcoder.TestRSRawCoderLegacy
Running org.apache.hadoop.io.erasurecode.rawcoder.TestXORRawCoder
Tests run: 6, Failures: 0, Errors: 0, Skipped: 0, Time elapsed: 0.428 sec - in org.apache.hadoop.io.erasurecode.rawcoder.TestXORRawCoder
Running org.apache.hadoop.io.erasurecode.rawcoder.TestRSRawCoder
Tests run: 16, Failures: 0, Errors: 0, Skipped: 0, Time elapsed: 0.863 sec - in org.apache.hadoop.io.erasurecode.rawcoder.TestRSRawCoder
Running org.apache.hadoop.io.erasurecode.TestECSchema
Tests run: 1, Failures: 0, Errors: 0, Skipped: 0, Time elapsed: 0.113 sec - in org.apache.hadoop.io.erasurecode.TestECSchema
Running org.apache.hadoop.io.erasurecode.TestCodecRawCoderMapping
Tests run: 2, Failures: 0, Errors: 0, Skipped: 0, Time elapsed: 0.839 sec - in org.apache.hadoop.io.erasurecode.TestCodecRawCoderMapping
Running org.apache.hadoop.io.erasurecode.coder.TestXORCoder
Tests run: 2, Failures: 0, Errors: 0, Skipped: 0, Time elapsed: 0.889 sec - in org.apache.hadoop.io.erasurecode.coder.TestXORCoder
Running org.apache.hadoop.io.erasurecode.coder.TestHHXORErasureCoder
Tests run: 9, Failures: 0, Errors: 0, Skipped: 0, Time elapsed: 2.254 sec - in org.apache.hadoop.io.erasurecode.coder.TestHHXORErasureCoder
Running org.apache.hadoop.io.erasurecode.coder.TestRSErasureCoder
Tests run: 10, Failures: 0, Errors: 0, Skipped: 0, Time elapsed: 1.868 sec - in org.apache.hadoop.io.erasurecode.coder.TestRSErasureCoder
Running org.apache.hadoop.io.TestWritableUtils
Tests run: 1, Failures: 0, Errors: 0, Skipped: 0, Time elapsed: 0.236 sec - in org.apache.hadoop.io.TestWritableUtils
Running org.apache.hadoop.io.TestBooleanWritable
Tests run: 2, Failures: 0, Errors: 0, Skipped: 0, Time elapsed: 0.263 sec - in org.apache.hadoop.io.TestBooleanWritable
Running org.apache.hadoop.io.TestDataByteBuffers
Tests run: 5, Failures: 0, Errors: 0, Skipped: 0, Time elapsed: 0.555 sec - in org.apache.hadoop.io.TestDataByteBuffers
Running org.apache.hadoop.io.TestVersionedWritable
Tests run: 3, Failures: 0, Errors: 0, Skipped: 0, Time elapsed: 0.215 sec - in org.apache.hadoop.io.TestVersionedWritable
Running org.apache.hadoop.io.TestEnumSetWritable
Tests run: 6, Failures: 0, Errors: 0, Skipped: 0, Time elapsed: 0.614 sec - in org.apache.hadoop.io.TestEnumSetWritable
Running org.apache.hadoop.io.TestMapWritable
Tests run: 5, Failures: 0, Errors: 0, Skipped: 0, Time elapsed: 0.286 sec - in org.apache.hadoop.io.TestMapWritable
Running org.apache.hadoop.io.TestArrayPrimitiveWritable
Tests run: 3, Failures: 0, Errors: 0, Skipped: 0, Time elapsed: 0.261 sec - in org.apache.hadoop.io.TestArrayPrimitiveWritable
Running org.apache.hadoop.io.TestSetFile
Tests run: 2, Failures: 0, Errors: 0, Skipped: 0, Time elapsed: 2.68 sec - in org.apache.hadoop.io.TestSetFile
Running org.apache.hadoop.io.TestUTF8
Tests run: 8, Failures: 0, Errors: 0, Skipped: 0, Time elapsed: 1.041 sec - in org.apache.hadoop.io.TestUTF8
Running org.apache.hadoop.io.TestBoundedByteArrayOutputStream
Tests run: 2, Failures: 0, Errors: 0, Skipped: 0, Time elapsed: 0.092 sec - in org.apache.hadoop.io.TestBoundedByteArrayOutputStream
Running org.apache.hadoop.io.compress.TestCodecPool
Tests run: 6, Failures: 0, Errors: 0, Skipped: 0, Time elapsed: 0.584 sec - in org.apache.hadoop.io.compress.TestCodecPool
Running org.apache.hadoop.io.compress.lz4.TestLz4CompressorDecompressor
Tests run: 13, Failures: 0, Errors: 0, Skipped: 0, Time elapsed: 0.433 sec - in org.apache.hadoop.io.compress.lz4.TestLz4CompressorDecompressor
Running org.apache.hadoop.io.compress.TestBlockDecompressorStream
Tests run: 2, Failures: 0, Errors: 0, Skipped: 0, Time elapsed: 0.108 sec - in org.apache.hadoop.io.compress.TestBlockDecompressorStream
Running org.apache.hadoop.io.compress.TestCodec
Tests run: 25, Failures: 0, Errors: 0, Skipped: 0, Time elapsed: 174.536 sec - in org.apache.hadoop.io.compress.TestCodec
Running org.apache.hadoop.io.compress.TestCompressorStream
Tests run: 1, Failures: 0, Errors: 0, Skipped: 0, Time elapsed: 0.105 sec - in org.apache.hadoop.io.compress.TestCompressorStream
Running org.apache.hadoop.io.compress.TestCompressorDecompressor
Tests run: 2, Failures: 0, Errors: 0, Skipped: 0, Time elapsed: 0.851 sec - in org.apache.hadoop.io.compress.TestCompressorDecompressor
Running org.apache.hadoop.io.compress.zlib.TestZlibCompressorDecompressor
Tests run: 10, Failures: 0, Errors: 0, Skipped: 0, Time elapsed: 1.548 sec - in org.apache.hadoop.io.compress.zlib.TestZlibCompressorDecompressor
Running org.apache.hadoop.io.compress.TestCodecFactory
Tests run: 1, Failures: 0, Errors: 0, Skipped: 0, Time elapsed: 0.75 sec - in org.apache.hadoop.io.compress.TestCodecFactory
Running org.apache.hadoop.io.compress.TestCompressionStreamReuse
Tests run: 3, Failures: 0, Errors: 0, Skipped: 0, Time elapsed: 5.837 sec - in org.apache.hadoop.io.compress.TestCompressionStreamReuse
Running org.apache.hadoop.io.compress.snappy.TestSnappyCompressorDecompressor
Tests run: 14, Failures: 0, Errors: 0, Skipped: 0, Time elapsed: 0.521 sec - in org.apache.hadoop.io.compress.snappy.TestSnappyCompressorDecompressor
Running org.apache.hadoop.io.compress.bzip2.TestBzip2CompressorDecompressor
Tests run: 2, Failures: 0, Errors: 0, Skipped: 2, Time elapsed: 0.527 sec - in org.apache.hadoop.io.compress.bzip2.TestBzip2CompressorDecompressor
Running org.apache.hadoop.io.serializer.TestSerializationFactory
Tests run: 5, Failures: 0, Errors: 0, Skipped: 0, Time elapsed: 0.659 sec - in org.apache.hadoop.io.serializer.TestSerializationFactory
Running org.apache.hadoop.io.serializer.avro.TestAvroSerialization
Tests run: 5, Failures: 0, Errors: 0, Skipped: 0, Time elapsed: 0.84 sec - in org.apache.hadoop.io.serializer.avro.TestAvroSerialization
Running org.apache.hadoop.io.serializer.TestWritableSerialization
Tests run: 3, Failures: 0, Errors: 0, Skipped: 0, Time elapsed: 0.497 sec - in org.apache.hadoop.io.serializer.TestWritableSerialization
Running org.apache.hadoop.io.TestGenericWritable
Tests run: 5, Failures: 0, Errors: 0, Skipped: 0, Time elapsed: 0.693 sec - in org.apache.hadoop.io.TestGenericWritable
Running org.apache.hadoop.io.TestText
Tests run: 18, Failures: 0, Errors: 0, Skipped: 0, Time elapsed: 0.925 sec - in org.apache.hadoop.io.TestText
Running org.apache.hadoop.io.file.tfile.TestTFileNoneCodecsStreams
Tests run: 19, Failures: 0, Errors: 0, Skipped: 0, Time elapsed: 2.315 sec - in org.apache.hadoop.io.file.tfile.TestTFileNoneCodecsStreams
Running org.apache.hadoop.io.file.tfile.TestTFileLzoCodecsByteArrays
Tests run: 25, Failures: 0, Errors: 0, Skipped: 0, Time elapsed: 0.478 sec - in org.apache.hadoop.io.file.tfile.TestTFileLzoCodecsByteArrays
Running org.apache.hadoop.io.file.tfile.TestTFileSeek
Tests run: 1, Failures: 0, Errors: 0, Skipped: 0, Time elapsed: 3.827 sec - in org.apache.hadoop.io.file.tfile.TestTFileSeek
Running org.apache.hadoop.io.file.tfile.TestCompression
Tests run: 1, Failures: 0, Errors: 0, Skipped: 0, Time elapsed: 0.432 sec - in org.apache.hadoop.io.file.tfile.TestCompression
Running org.apache.hadoop.io.file.tfile.TestTFileSplit
Tests run: 1, Failures: 0, Errors: 0, Skipped: 0, Time elapsed: 5.787 sec - in org.apache.hadoop.io.file.tfile.TestTFileSplit
Running org.apache.hadoop.io.file.tfile.TestTFileSeqFileComparison
Tests run: 1, Failures: 0, Errors: 0, Skipped: 0, Time elapsed: 5.136 sec - in org.apache.hadoop.io.file.tfile.TestTFileSeqFileComparison
Running org.apache.hadoop.io.file.tfile.TestTFileByteArrays
Tests run: 25, Failures: 0, Errors: 0, Skipped: 0, Time elapsed: 3.336 sec - in org.apache.hadoop.io.file.tfile.TestTFileByteArrays
Running org.apache.hadoop.io.file.tfile.TestTFileComparator2
Tests run: 1, Failures: 0, Errors: 0, Skipped: 0, Time elapsed: 2.041 sec - in org.apache.hadoop.io.file.tfile.TestTFileComparator2
Running org.apache.hadoop.io.file.tfile.TestTFileNoneCodecsByteArrays
Tests run: 25, Failures: 0, Errors: 0, Skipped: 0, Time elapsed: 1.949 sec - in org.apache.hadoop.io.file.tfile.TestTFileNoneCodecsByteArrays
Running org.apache.hadoop.io.file.tfile.TestTFileNoneCodecsJClassComparatorByteArrays
Tests run: 25, Failures: 0, Errors: 0, Skipped: 0, Time elapsed: 1.898 sec - in org.apache.hadoop.io.file.tfile.TestTFileNoneCodecsJClassComparatorByteArrays
Running org.apache.hadoop.io.file.tfile.TestTFileJClassComparatorByteArrays
Tests run: 25, Failures: 0, Errors: 0, Skipped: 0, Time elapsed: 3.283 sec - in org.apache.hadoop.io.file.tfile.TestTFileJClassComparatorByteArrays
Running org.apache.hadoop.io.file.tfile.TestTFileLzoCodecsStreams
Tests run: 19, Failures: 0, Errors: 0, Skipped: 0, Time elapsed: 0.535 sec - in org.apache.hadoop.io.file.tfile.TestTFileLzoCodecsStreams
Running org.apache.hadoop.io.file.tfile.TestTFileComparators
Tests run: 3, Failures: 0, Errors: 0, Skipped: 0, Time elapsed: 1.128 sec - in org.apache.hadoop.io.file.tfile.TestTFileComparators
Running org.apache.hadoop.io.file.tfile.TestTFileStreams
Tests run: 19, Failures: 0, Errors: 0, Skipped: 0, Time elapsed: 2.42 sec - in org.apache.hadoop.io.file.tfile.TestTFileStreams
Running org.apache.hadoop.io.file.tfile.TestTFileUnsortedByteArrays
Tests run: 4, Failures: 0, Errors: 0, Skipped: 0, Time elapsed: 1.224 sec - in org.apache.hadoop.io.file.tfile.TestTFileUnsortedByteArrays
Running org.apache.hadoop.io.file.tfile.TestVLong
Tests run: 9, Failures: 0, Errors: 0, Skipped: 0, Time elapsed: 2.361 sec - in org.apache.hadoop.io.file.tfile.TestVLong
Running org.apache.hadoop.io.file.tfile.TestTFile
Tests run: 3, Failures: 0, Errors: 0, Skipped: 0, Time elapsed: 1.67 sec - in org.apache.hadoop.io.file.tfile.TestTFile
Running org.apache.hadoop.io.TestObjectWritableProtos
Tests run: 3, Failures: 0, Errors: 0, Skipped: 0, Time elapsed: 0.419 sec - in org.apache.hadoop.io.TestObjectWritableProtos
Running org.apache.hadoop.io.TestArrayWritable
Tests run: 4, Failures: 0, Errors: 0, Skipped: 0, Time elapsed: 0.264 sec - in org.apache.hadoop.io.TestArrayWritable
Running org.apache.hadoop.io.TestSequenceFileSerialization
Tests run: 1, Failures: 0, Errors: 0, Skipped: 0, Time elapsed: 1.179 sec - in org.apache.hadoop.io.TestSequenceFileSerialization
Running org.apache.hadoop.io.TestArrayFile
Tests run: 3, Failures: 0, Errors: 0, Skipped: 0, Time elapsed: 3.59 sec - in org.apache.hadoop.io.TestArrayFile

Results :

Failed tests: 
  TestDNS.testNullDnsServer:124 
Expected: is "localhost"
     but: was "asf903.gq1.ygridcore.net"
  TestDNS.testDefaultDnsServer:134 
Expected: is "asf903.gq1.ygridcore.net"
     but: was "localhost"

Tests run: 3388, Failures: 2, Errors: 0, Skipped: 86

[INFO] ------------------------------------------------------------------------
[INFO] Reactor Summary:
[INFO] 
[INFO] Apache Hadoop Annotations ......................... SUCCESS [ 11.855 s]
[INFO] Apache Hadoop MiniKDC ............................. SUCCESS [ 27.679 s]
[INFO] Apache Hadoop Auth ................................ SUCCESS [04:17 min]
[INFO] Apache Hadoop Auth Examples ....................... SUCCESS [  4.782 s]
[INFO] Apache Hadoop Common .............................. FAILURE [29:26 min]
[INFO] Apache Hadoop NFS ................................. SKIPPED
[INFO] Apache Hadoop KMS ................................. SKIPPED
[INFO] Apache Hadoop Common Project ...................... SKIPPED
[INFO] ------------------------------------------------------------------------
[INFO] BUILD FAILURE
[INFO] ------------------------------------------------------------------------
[INFO] Total time: 34:30 min
[INFO] Finished at: 2016-05-03T19:40:13+00:00
[INFO] Final Memory: 86M/957M
[INFO] ------------------------------------------------------------------------
[ERROR] Failed to execute goal org.apache.maven.plugins:maven-surefire-plugin:2.17:test (default-test)
on project hadoop-common: There are test failures.
[ERROR] 
[ERROR] Please refer to <https://builds.apache.org/job/Hadoop-Common-trunk/ws/hadoop-common-project/hadoop-common/target/surefire-reports>
for the individual test results.
[ERROR] -> [Help 1]
[ERROR] 
[ERROR] To see the full stack trace of the errors, re-run Maven with the -e switch.
[ERROR] Re-run Maven using the -X switch to enable full debug logging.
[ERROR] 
[ERROR] For more information about the errors and possible solutions, please read the following
articles:
[ERROR] [Help 1] http://cwiki.apache.org/confluence/display/MAVEN/MojoFailureException
[ERROR] 
[ERROR] After correcting the problems, you can resume the build with the command
[ERROR]   mvn <goals> -rf :hadoop-common
result: 1
Build step 'Execute shell' marked build as failure
Archiving artifacts
Recording test results

---------------------------------------------------------------------
To unsubscribe, e-mail: common-dev-unsubscribe@hadoop.apache.org
For additional commands, e-mail: common-dev-help@hadoop.apache.org


Mime
View raw message