hadoop-common-dev mailing list archives

Site index · List index
Message view « Date » · « Thread »
Top « Date » · « Thread »
From Apache Jenkins Server <jenk...@builds.apache.org>
Subject Build failed in Jenkins: Hadoop-common-trunk-Java8 #1549
Date Thu, 26 May 2016 20:10:36 GMT
See <https://builds.apache.org/job/Hadoop-common-trunk-Java8/1549/changes>

Changes:

[szetszwo] HDFS-10431 Refactor and speedup TestAsyncDFSRename.  Contributed by

------------------------------------------
[...truncated 5367 lines...]
Running org.apache.hadoop.io.TestSequenceFile
Tests run: 14, Failures: 0, Errors: 0, Skipped: 0, Time elapsed: 22.136 sec - in org.apache.hadoop.crypto.TestCryptoStreamsWithOpensslAesCtrCryptoCodec
Running org.apache.hadoop.io.TestSecureIOUtils
Tests run: 3, Failures: 0, Errors: 0, Skipped: 0, Time elapsed: 16.596 sec - in org.apache.hadoop.crypto.TestCryptoCodec
Running org.apache.hadoop.io.nativeio.TestSharedFileDescriptorFactory
Tests run: 4, Failures: 0, Errors: 0, Skipped: 0, Time elapsed: 0.944 sec - in org.apache.hadoop.io.TestSecureIOUtils
Running org.apache.hadoop.io.nativeio.TestNativeIO
Tests run: 3, Failures: 0, Errors: 0, Skipped: 0, Time elapsed: 0.602 sec - in org.apache.hadoop.io.nativeio.TestSharedFileDescriptorFactory
Running org.apache.hadoop.io.TestWritable
Tests run: 6, Failures: 0, Errors: 0, Skipped: 0, Time elapsed: 0.345 sec - in org.apache.hadoop.io.TestWritable
Running org.apache.hadoop.io.TestIOUtils
Tests run: 12, Failures: 0, Errors: 0, Skipped: 0, Time elapsed: 0.393 sec - in org.apache.hadoop.io.TestIOUtils
Running org.apache.hadoop.io.TestTextNonUTF8
Tests run: 1, Failures: 0, Errors: 0, Skipped: 0, Time elapsed: 0.17 sec - in org.apache.hadoop.io.TestTextNonUTF8
Running org.apache.hadoop.io.TestMD5Hash
Tests run: 2, Failures: 0, Errors: 0, Skipped: 0, Time elapsed: 0.252 sec - in org.apache.hadoop.io.TestMD5Hash
Running org.apache.hadoop.io.TestSequenceFileAppend
Tests run: 5, Failures: 0, Errors: 0, Skipped: 0, Time elapsed: 1.059 sec - in org.apache.hadoop.io.TestSequenceFileAppend
Running org.apache.hadoop.io.TestMapFile
Tests run: 21, Failures: 0, Errors: 0, Skipped: 0, Time elapsed: 1.867 sec - in org.apache.hadoop.io.TestMapFile
Running org.apache.hadoop.io.TestWritableName
Tests run: 4, Failures: 0, Errors: 0, Skipped: 0, Time elapsed: 0.208 sec - in org.apache.hadoop.io.TestWritableName
Running org.apache.hadoop.io.TestSortedMapWritable
Tests run: 20, Failures: 0, Errors: 0, Skipped: 0, Time elapsed: 7.046 sec - in org.apache.hadoop.io.nativeio.TestNativeIO
Tests run: 4, Failures: 0, Errors: 0, Skipped: 0, Time elapsed: 0.233 sec - in org.apache.hadoop.io.TestSortedMapWritable
Running org.apache.hadoop.io.TestSequenceFileSync
Running org.apache.hadoop.io.retry.TestFailoverProxy
Tests run: 9, Failures: 0, Errors: 0, Skipped: 0, Time elapsed: 10.738 sec - in org.apache.hadoop.io.TestSequenceFile
Running org.apache.hadoop.io.retry.TestDefaultRetryPolicy
Tests run: 1, Failures: 0, Errors: 0, Skipped: 0, Time elapsed: 0.898 sec - in org.apache.hadoop.io.TestSequenceFileSync
Running org.apache.hadoop.io.retry.TestRetryProxy
Tests run: 3, Failures: 0, Errors: 0, Skipped: 0, Time elapsed: 0.399 sec - in org.apache.hadoop.io.retry.TestDefaultRetryPolicy
Running org.apache.hadoop.io.TestDefaultStringifier
Tests run: 4, Failures: 0, Errors: 0, Skipped: 0, Time elapsed: 0.473 sec - in org.apache.hadoop.io.TestDefaultStringifier
Running org.apache.hadoop.io.TestBloomMapFile
Tests run: 12, Failures: 0, Errors: 0, Skipped: 0, Time elapsed: 1.486 sec - in org.apache.hadoop.io.retry.TestRetryProxy
Running org.apache.hadoop.io.TestBytesWritable
Tests run: 14, Failures: 0, Errors: 0, Skipped: 0, Time elapsed: 25.764 sec - in org.apache.hadoop.crypto.TestCryptoStreamsWithJceAesCtrCryptoCodec
Tests run: 6, Failures: 0, Errors: 0, Skipped: 0, Time elapsed: 0.198 sec - in org.apache.hadoop.io.TestBytesWritable
Running org.apache.hadoop.io.erasurecode.rawcoder.TestDummyRawCoder
Running org.apache.hadoop.io.erasurecode.rawcoder.TestRSRawCoderLegacy
Tests run: 3, Failures: 0, Errors: 0, Skipped: 0, Time elapsed: 0.211 sec - in org.apache.hadoop.io.erasurecode.rawcoder.TestDummyRawCoder
Tests run: 7, Failures: 0, Errors: 0, Skipped: 0, Time elapsed: 1.625 sec - in org.apache.hadoop.io.TestBloomMapFile
Running org.apache.hadoop.io.erasurecode.rawcoder.TestXORRawCoder
Tests run: 16, Failures: 0, Errors: 0, Skipped: 0, Time elapsed: 0.491 sec - in org.apache.hadoop.io.erasurecode.rawcoder.TestRSRawCoderLegacy
Running org.apache.hadoop.io.erasurecode.rawcoder.TestRSRawCoder
Tests run: 6, Failures: 0, Errors: 0, Skipped: 0, Time elapsed: 0.321 sec - in org.apache.hadoop.io.erasurecode.rawcoder.TestXORRawCoder
Running org.apache.hadoop.io.erasurecode.TestECSchema
Tests run: 1, Failures: 0, Errors: 0, Skipped: 0, Time elapsed: 0.1 sec - in org.apache.hadoop.io.erasurecode.TestECSchema
Running org.apache.hadoop.io.erasurecode.TestCodecRawCoderMapping
Running org.apache.hadoop.io.erasurecode.coder.TestXORCoder
Tests run: 16, Failures: 0, Errors: 0, Skipped: 0, Time elapsed: 0.648 sec - in org.apache.hadoop.io.erasurecode.rawcoder.TestRSRawCoder
Tests run: 2, Failures: 0, Errors: 0, Skipped: 0, Time elapsed: 0.573 sec - in org.apache.hadoop.io.erasurecode.TestCodecRawCoderMapping
Running org.apache.hadoop.io.erasurecode.coder.TestHHXORErasureCoder
Tests run: 2, Failures: 0, Errors: 0, Skipped: 0, Time elapsed: 0.735 sec - in org.apache.hadoop.io.erasurecode.coder.TestXORCoder
Running org.apache.hadoop.io.erasurecode.coder.TestRSErasureCoder
Running org.apache.hadoop.io.TestWritableUtils
Tests run: 1, Failures: 0, Errors: 0, Skipped: 0, Time elapsed: 0.188 sec - in org.apache.hadoop.io.TestWritableUtils
Running org.apache.hadoop.io.TestBooleanWritable
Tests run: 2, Failures: 0, Errors: 0, Skipped: 0, Time elapsed: 0.297 sec - in org.apache.hadoop.io.TestBooleanWritable
Tests run: 10, Failures: 0, Errors: 0, Skipped: 0, Time elapsed: 1.484 sec - in org.apache.hadoop.io.erasurecode.coder.TestRSErasureCoder
Tests run: 9, Failures: 0, Errors: 0, Skipped: 0, Time elapsed: 1.875 sec - in org.apache.hadoop.io.erasurecode.coder.TestHHXORErasureCoder
Running org.apache.hadoop.io.TestDataByteBuffers
Running org.apache.hadoop.io.TestVersionedWritable
Running org.apache.hadoop.io.TestEnumSetWritable
Tests run: 5, Failures: 0, Errors: 0, Skipped: 0, Time elapsed: 0.455 sec - in org.apache.hadoop.io.TestDataByteBuffers
Tests run: 3, Failures: 0, Errors: 0, Skipped: 0, Time elapsed: 0.266 sec - in org.apache.hadoop.io.TestVersionedWritable
Running org.apache.hadoop.io.TestMapWritable
Running org.apache.hadoop.io.TestArrayPrimitiveWritable
Tests run: 6, Failures: 0, Errors: 0, Skipped: 0, Time elapsed: 0.637 sec - in org.apache.hadoop.io.TestEnumSetWritable
Tests run: 5, Failures: 0, Errors: 0, Skipped: 0, Time elapsed: 0.251 sec - in org.apache.hadoop.io.TestMapWritable
Tests run: 3, Failures: 0, Errors: 0, Skipped: 0, Time elapsed: 0.197 sec - in org.apache.hadoop.io.TestArrayPrimitiveWritable
Running org.apache.hadoop.io.TestSetFile
Running org.apache.hadoop.io.TestUTF8
Running org.apache.hadoop.io.TestBoundedByteArrayOutputStream
Tests run: 2, Failures: 0, Errors: 0, Skipped: 0, Time elapsed: 0.073 sec - in org.apache.hadoop.io.TestBoundedByteArrayOutputStream
Running org.apache.hadoop.io.compress.TestCodecPool
Tests run: 8, Failures: 0, Errors: 0, Skipped: 0, Time elapsed: 0.758 sec - in org.apache.hadoop.io.TestUTF8
Tests run: 6, Failures: 0, Errors: 0, Skipped: 0, Time elapsed: 0.482 sec - in org.apache.hadoop.io.compress.TestCodecPool
Running org.apache.hadoop.io.compress.lz4.TestLz4CompressorDecompressor
Running org.apache.hadoop.io.compress.TestBlockDecompressorStream
Tests run: 2, Failures: 0, Errors: 0, Skipped: 0, Time elapsed: 0.112 sec - in org.apache.hadoop.io.compress.TestBlockDecompressorStream
Tests run: 13, Failures: 0, Errors: 0, Skipped: 0, Time elapsed: 0.466 sec - in org.apache.hadoop.io.compress.lz4.TestLz4CompressorDecompressor
Running org.apache.hadoop.io.compress.TestCodec
Running org.apache.hadoop.io.compress.TestCompressorStream
Tests run: 2, Failures: 0, Errors: 0, Skipped: 0, Time elapsed: 2.043 sec - in org.apache.hadoop.io.TestSetFile
Tests run: 1, Failures: 0, Errors: 0, Skipped: 0, Time elapsed: 0.092 sec - in org.apache.hadoop.io.compress.TestCompressorStream
Running org.apache.hadoop.io.compress.TestCompressorDecompressor
Running org.apache.hadoop.io.compress.zlib.TestZlibCompressorDecompressor
Tests run: 2, Failures: 0, Errors: 0, Skipped: 0, Time elapsed: 0.831 sec - in org.apache.hadoop.io.compress.TestCompressorDecompressor
Running org.apache.hadoop.io.compress.TestCodecFactory
Tests run: 10, Failures: 0, Errors: 0, Skipped: 0, Time elapsed: 1.175 sec - in org.apache.hadoop.io.compress.zlib.TestZlibCompressorDecompressor
Running org.apache.hadoop.io.compress.TestCompressionStreamReuse
Tests run: 9, Failures: 0, Errors: 0, Skipped: 0, Time elapsed: 12.331 sec - in org.apache.hadoop.io.retry.TestFailoverProxy
Tests run: 1, Failures: 0, Errors: 0, Skipped: 0, Time elapsed: 0.784 sec - in org.apache.hadoop.io.compress.TestCodecFactory
Running org.apache.hadoop.io.compress.snappy.TestSnappyCompressorDecompressor
Running org.apache.hadoop.io.compress.TestDecompressorStream
Tests run: 3, Failures: 0, Errors: 0, Skipped: 0, Time elapsed: 0.1 sec - in org.apache.hadoop.io.compress.TestDecompressorStream
Tests run: 14, Failures: 0, Errors: 0, Skipped: 0, Time elapsed: 0.543 sec - in org.apache.hadoop.io.compress.snappy.TestSnappyCompressorDecompressor
Running org.apache.hadoop.io.compress.bzip2.TestBzip2CompressorDecompressor
Running org.apache.hadoop.io.serializer.TestSerializationFactory
Tests run: 2, Failures: 0, Errors: 0, Skipped: 2, Time elapsed: 0.463 sec - in org.apache.hadoop.io.compress.bzip2.TestBzip2CompressorDecompressor
Running org.apache.hadoop.io.serializer.avro.TestAvroSerialization
Tests run: 5, Failures: 0, Errors: 0, Skipped: 0, Time elapsed: 0.708 sec - in org.apache.hadoop.io.serializer.TestSerializationFactory
Running org.apache.hadoop.io.serializer.TestWritableSerialization
Tests run: 5, Failures: 0, Errors: 0, Skipped: 0, Time elapsed: 1.002 sec - in org.apache.hadoop.io.serializer.avro.TestAvroSerialization
Tests run: 3, Failures: 0, Errors: 0, Skipped: 0, Time elapsed: 0.659 sec - in org.apache.hadoop.io.serializer.TestWritableSerialization
Running org.apache.hadoop.io.TestGenericWritable
Running org.apache.hadoop.io.TestText
Tests run: 5, Failures: 0, Errors: 0, Skipped: 0, Time elapsed: 0.578 sec - in org.apache.hadoop.io.TestGenericWritable
Running org.apache.hadoop.io.file.tfile.TestTFileNoneCodecsStreams
Tests run: 18, Failures: 0, Errors: 0, Skipped: 0, Time elapsed: 0.904 sec - in org.apache.hadoop.io.TestText
Running org.apache.hadoop.io.file.tfile.TestTFileLzoCodecsByteArrays
Tests run: 25, Failures: 0, Errors: 0, Skipped: 0, Time elapsed: 0.475 sec - in org.apache.hadoop.io.file.tfile.TestTFileLzoCodecsByteArrays
Running org.apache.hadoop.io.file.tfile.TestTFileSeek
Tests run: 3, Failures: 0, Errors: 0, Skipped: 0, Time elapsed: 5.916 sec - in org.apache.hadoop.io.compress.TestCompressionStreamReuse
Tests run: 19, Failures: 0, Errors: 0, Skipped: 0, Time elapsed: 1.557 sec - in org.apache.hadoop.io.file.tfile.TestTFileNoneCodecsStreams
Running org.apache.hadoop.io.file.tfile.TestCompression
Running org.apache.hadoop.io.file.tfile.TestTFileSplit
Tests run: 1, Failures: 0, Errors: 0, Skipped: 0, Time elapsed: 0.397 sec - in org.apache.hadoop.io.file.tfile.TestCompression
Running org.apache.hadoop.io.file.tfile.TestTFileSeqFileComparison
Tests run: 1, Failures: 0, Errors: 0, Skipped: 0, Time elapsed: 3.741 sec - in org.apache.hadoop.io.file.tfile.TestTFileSeek
Running org.apache.hadoop.io.file.tfile.TestTFileByteArrays
Tests run: 1, Failures: 0, Errors: 0, Skipped: 0, Time elapsed: 5.185 sec - in org.apache.hadoop.io.file.tfile.TestTFileSplit
Tests run: 1, Failures: 0, Errors: 0, Skipped: 0, Time elapsed: 4.647 sec - in org.apache.hadoop.io.file.tfile.TestTFileSeqFileComparison
Running org.apache.hadoop.io.file.tfile.TestTFileComparator2
Running org.apache.hadoop.io.file.tfile.TestTFileNoneCodecsByteArrays
Tests run: 25, Failures: 0, Errors: 0, Skipped: 0, Time elapsed: 2.438 sec - in org.apache.hadoop.io.file.tfile.TestTFileByteArrays
Running org.apache.hadoop.io.file.tfile.TestTFileNoneCodecsJClassComparatorByteArrays
Tests run: 1, Failures: 0, Errors: 0, Skipped: 0, Time elapsed: 1.234 sec - in org.apache.hadoop.io.file.tfile.TestTFileComparator2
Tests run: 25, Failures: 0, Errors: 0, Skipped: 0, Time elapsed: 1.454 sec - in org.apache.hadoop.io.file.tfile.TestTFileNoneCodecsByteArrays
Running org.apache.hadoop.io.file.tfile.TestTFileJClassComparatorByteArrays
Running org.apache.hadoop.io.file.tfile.TestTFileLzoCodecsStreams
Tests run: 19, Failures: 0, Errors: 0, Skipped: 0, Time elapsed: 0.396 sec - in org.apache.hadoop.io.file.tfile.TestTFileLzoCodecsStreams
Tests run: 25, Failures: 0, Errors: 0, Skipped: 0, Time elapsed: 1.446 sec - in org.apache.hadoop.io.file.tfile.TestTFileNoneCodecsJClassComparatorByteArrays
Running org.apache.hadoop.io.file.tfile.TestTFileComparators
Running org.apache.hadoop.io.file.tfile.TestTFileStreams
Tests run: 3, Failures: 0, Errors: 0, Skipped: 0, Time elapsed: 1.087 sec - in org.apache.hadoop.io.file.tfile.TestTFileComparators
Running org.apache.hadoop.io.file.tfile.TestTFileUnsortedByteArrays
Tests run: 25, Failures: 0, Errors: 0, Skipped: 0, Time elapsed: 2.636 sec - in org.apache.hadoop.io.file.tfile.TestTFileJClassComparatorByteArrays
Tests run: 19, Failures: 0, Errors: 0, Skipped: 0, Time elapsed: 1.769 sec - in org.apache.hadoop.io.file.tfile.TestTFileStreams
Running org.apache.hadoop.io.file.tfile.TestVLong
Running org.apache.hadoop.io.file.tfile.TestTFile
Tests run: 4, Failures: 0, Errors: 0, Skipped: 0, Time elapsed: 1.255 sec - in org.apache.hadoop.io.file.tfile.TestTFileUnsortedByteArrays
Running org.apache.hadoop.io.TestObjectWritableProtos
Tests run: 3, Failures: 0, Errors: 0, Skipped: 0, Time elapsed: 0.431 sec - in org.apache.hadoop.io.TestObjectWritableProtos
Running org.apache.hadoop.io.TestArrayWritable
Tests run: 9, Failures: 0, Errors: 0, Skipped: 0, Time elapsed: 2.073 sec - in org.apache.hadoop.io.file.tfile.TestVLong
Tests run: 3, Failures: 0, Errors: 0, Skipped: 0, Time elapsed: 1.798 sec - in org.apache.hadoop.io.file.tfile.TestTFile
Tests run: 4, Failures: 0, Errors: 0, Skipped: 0, Time elapsed: 0.319 sec - in org.apache.hadoop.io.TestArrayWritable
Running org.apache.hadoop.io.TestSequenceFileSerialization
Running org.apache.hadoop.io.TestArrayFile
Tests run: 1, Failures: 0, Errors: 0, Skipped: 0, Time elapsed: 1.02 sec - in org.apache.hadoop.io.TestSequenceFileSerialization
Tests run: 3, Failures: 0, Errors: 0, Skipped: 0, Time elapsed: 3.452 sec - in org.apache.hadoop.io.TestArrayFile
Tests run: 25, Failures: 0, Errors: 0, Skipped: 0, Time elapsed: 136.014 sec - in org.apache.hadoop.io.compress.TestCodec

Results :

Failed tests: 
  TestDNS.testNullDnsServer:124 
Expected: is "asf903.gq1.ygridcore.net"
     but: was "localhost"

Tests in error: 
  TestRPCWaitForProxy.testInterruptedWaitForProxy ยป Service java.net.ConnectExce...

Tests run: 3387, Failures: 1, Errors: 1, Skipped: 86

[INFO]                                                                         
[INFO] ------------------------------------------------------------------------
[INFO] Skipping Apache Hadoop NFS
[INFO] This project has been banned from the build due to previous failures.
[INFO] ------------------------------------------------------------------------
[INFO]                                                                         
[INFO] ------------------------------------------------------------------------
[INFO] Skipping Apache Hadoop KMS
[INFO] This project has been banned from the build due to previous failures.
[INFO] ------------------------------------------------------------------------
[INFO]                                                                         
[INFO] ------------------------------------------------------------------------
[INFO] Building Apache Hadoop Common Project 3.0.0-alpha1-SNAPSHOT
[INFO] ------------------------------------------------------------------------
[INFO] 
[INFO] --- maven-clean-plugin:2.5:clean (default-clean) @ hadoop-common-project ---
[INFO] Deleting <https://builds.apache.org/job/Hadoop-common-trunk-Java8/ws/source/hadoop-common-project/target>
[INFO] 
[INFO] --- maven-antrun-plugin:1.7:run (create-testdirs) @ hadoop-common-project ---
[INFO] Executing tasks

main:
    [mkdir] Created dir: <https://builds.apache.org/job/Hadoop-common-trunk-Java8/ws/source/hadoop-common-project/target/test-dir>
[INFO] Executed tasks
[INFO] 
[INFO] --- maven-source-plugin:2.3:jar-no-fork (hadoop-java-sources) @ hadoop-common-project
---
[INFO] 
[INFO] --- maven-source-plugin:2.3:test-jar-no-fork (hadoop-java-sources) @ hadoop-common-project
---
[INFO] 
[INFO] --- maven-enforcer-plugin:1.3.1:enforce (dist-enforce) @ hadoop-common-project ---
[INFO] 
[INFO] --- maven-site-plugin:3.5:attach-descriptor (attach-descriptor) @ hadoop-common-project
---
[INFO] 
[INFO] --- maven-javadoc-plugin:2.8.1:jar (module-javadocs) @ hadoop-common-project ---
[INFO] Not executing Javadoc as the project is not a Java classpath-capable package
[INFO] 
[INFO] --- maven-enforcer-plugin:1.3.1:enforce (depcheck) @ hadoop-common-project ---
[INFO] 
[INFO] --- maven-checkstyle-plugin:2.15:checkstyle (default-cli) @ hadoop-common-project ---
[INFO] 
[INFO] --- findbugs-maven-plugin:3.0.0:findbugs (default-cli) @ hadoop-common-project ---
[INFO] ------------------------------------------------------------------------
[INFO] Reactor Summary:
[INFO] 
[INFO] Apache Hadoop Annotations .......................... SUCCESS [ 13.079 s]
[INFO] Apache Hadoop MiniKDC .............................. SUCCESS [ 26.069 s]
[INFO] Apache Hadoop Auth ................................. SUCCESS [03:59 min]
[INFO] Apache Hadoop Auth Examples ........................ SUCCESS [ 10.185 s]
[INFO] Apache Hadoop Common ............................... FAILURE [08:12 min]
[INFO] Apache Hadoop NFS .................................. SKIPPED
[INFO] Apache Hadoop KMS .................................. SKIPPED
[INFO] Apache Hadoop Common Project ....................... SUCCESS [  0.079 s]
[INFO] ------------------------------------------------------------------------
[INFO] BUILD FAILURE
[INFO] ------------------------------------------------------------------------
[INFO] Total time: 13:02 min
[INFO] Finished at: 2016-05-26T20:10:32+00:00
[INFO] Final Memory: 104M/2384M
[INFO] ------------------------------------------------------------------------
[ERROR] Failed to execute goal org.apache.maven.plugins:maven-surefire-plugin:2.17:test (default-test)
on project hadoop-common: There are test failures.
[ERROR] 
[ERROR] Please refer to <https://builds.apache.org/job/Hadoop-common-trunk-Java8/ws/source/hadoop-common-project/hadoop-common/target/surefire-reports>
for the individual test results.
[ERROR] -> [Help 1]
[ERROR] 
[ERROR] To see the full stack trace of the errors, re-run Maven with the -e switch.
[ERROR] Re-run Maven using the -X switch to enable full debug logging.
[ERROR] 
[ERROR] For more information about the errors and possible solutions, please read the following
articles:
[ERROR] [Help 1] http://cwiki.apache.org/confluence/display/MAVEN/MojoFailureException
[ERROR] 
[ERROR] After correcting the problems, you can resume the build with the command
[ERROR]   mvn <goals> -rf :hadoop-common
Build step 'Execute shell' marked build as failure
Archiving artifacts
Setting LATEST1_8_HOME=/home/jenkins/jenkins-slave/tools/hudson.model.JDK/latest1.8
Setting MAVEN_3_3_3_HOME=/home/jenkins/jenkins-slave/tools/hudson.tasks.Maven_MavenInstallation/maven-3.3.3
Recording test results
Setting LATEST1_8_HOME=/home/jenkins/jenkins-slave/tools/hudson.model.JDK/latest1.8
Setting MAVEN_3_3_3_HOME=/home/jenkins/jenkins-slave/tools/hudson.tasks.Maven_MavenInstallation/maven-3.3.3
Setting LATEST1_8_HOME=/home/jenkins/jenkins-slave/tools/hudson.model.JDK/latest1.8
Setting MAVEN_3_3_3_HOME=/home/jenkins/jenkins-slave/tools/hudson.tasks.Maven_MavenInstallation/maven-3.3.3

---------------------------------------------------------------------
To unsubscribe, e-mail: common-dev-unsubscribe@hadoop.apache.org
For additional commands, e-mail: common-dev-help@hadoop.apache.org


Mime
View raw message