hadoop-common-dev mailing list archives

Site index · List index
Message view « Date » · « Thread »
Top « Date » · « Thread »
From Apache Jenkins Server <jenk...@builds.apache.org>
Subject Build failed in Jenkins: Hadoop-common-trunk-Java8 #1505
Date Wed, 18 May 2016 22:12:29 GMT
See <https://builds.apache.org/job/Hadoop-common-trunk-Java8/1505/changes>

Changes:

[wang] HDFS-2173. saveNamespace should not throw IOE when only one storage

------------------------------------------
[...truncated 50807 lines...]
Tests run: 9, Failures: 0, Errors: 0, Skipped: 0, Time elapsed: 1.143 sec - in org.apache.hadoop.security.TestDoAsEffectiveUser
Running org.apache.hadoop.security.TestNullGroupsMapping
Tests run: 1, Failures: 0, Errors: 0, Skipped: 0, Time elapsed: 0.062 sec - in org.apache.hadoop.security.TestNullGroupsMapping
Running org.apache.hadoop.security.TestUGIWithSecurityOn
Tests run: 2, Failures: 0, Errors: 0, Skipped: 2, Time elapsed: 0.067 sec - in org.apache.hadoop.security.TestUGIWithSecurityOn
Running org.apache.hadoop.security.TestWhitelistBasedResolver
Tests run: 3, Failures: 0, Errors: 0, Skipped: 0, Time elapsed: 0.445 sec - in org.apache.hadoop.security.TestWhitelistBasedResolver
Running org.apache.hadoop.security.TestCredentials
Tests run: 10, Failures: 0, Errors: 0, Skipped: 0, Time elapsed: 0.59 sec - in org.apache.hadoop.security.TestCredentials
Running org.apache.hadoop.security.TestGroupFallback
Tests run: 4, Failures: 0, Errors: 0, Skipped: 0, Time elapsed: 0.579 sec - in org.apache.hadoop.security.TestGroupFallback
Running org.apache.hadoop.security.TestKDiag
Tests run: 13, Failures: 0, Errors: 0, Skipped: 0, Time elapsed: 4.393 sec - in org.apache.hadoop.security.TestKDiag
Running org.apache.hadoop.util.TestLightWeightCache
Tests run: 15, Failures: 0, Errors: 0, Skipped: 0, Time elapsed: 32.399 sec - in org.apache.hadoop.security.token.delegation.TestDelegationToken
Running org.apache.hadoop.util.TestHostsFileReader
Tests run: 7, Failures: 0, Errors: 0, Skipped: 0, Time elapsed: 0.179 sec - in org.apache.hadoop.util.TestHostsFileReader
Running org.apache.hadoop.util.TestDiskChecker
Tests run: 15, Failures: 0, Errors: 0, Skipped: 0, Time elapsed: 1.013 sec - in org.apache.hadoop.util.TestDiskChecker
Running org.apache.hadoop.util.TestProgress
Tests run: 1, Failures: 0, Errors: 0, Skipped: 0, Time elapsed: 0.165 sec - in org.apache.hadoop.util.TestProgress
Running org.apache.hadoop.util.TestGenericsUtil
Tests run: 6, Failures: 0, Errors: 0, Skipped: 0, Time elapsed: 0.404 sec - in org.apache.hadoop.util.TestGenericsUtil
Running org.apache.hadoop.util.TestChunkedArrayList
Tests run: 5, Failures: 0, Errors: 0, Skipped: 0, Time elapsed: 0.587 sec - in org.apache.hadoop.util.TestChunkedArrayList
Running org.apache.hadoop.util.TestVersionUtil
Tests run: 1, Failures: 0, Errors: 0, Skipped: 0, Time elapsed: 0.246 sec - in org.apache.hadoop.util.TestVersionUtil
Tests run: 1, Failures: 0, Errors: 0, Skipped: 0, Time elapsed: 10.191 sec - in org.apache.hadoop.util.TestLightWeightCache
Running org.apache.hadoop.util.TestProtoUtil
Running org.apache.hadoop.util.TestLightWeightGSet
Tests run: 2, Failures: 0, Errors: 0, Skipped: 0, Time elapsed: 0.184 sec - in org.apache.hadoop.util.TestLightWeightGSet
Tests run: 2, Failures: 0, Errors: 0, Skipped: 0, Time elapsed: 0.286 sec - in org.apache.hadoop.util.TestProtoUtil
Running org.apache.hadoop.util.TestGSet
Running org.apache.hadoop.util.TestStringInterner
Tests run: 3, Failures: 0, Errors: 0, Skipped: 0, Time elapsed: 0.153 sec - in org.apache.hadoop.util.TestStringInterner
Running org.apache.hadoop.util.TestZKUtil
Tests run: 9, Failures: 0, Errors: 0, Skipped: 0, Time elapsed: 0.116 sec - in org.apache.hadoop.util.TestZKUtil
Running org.apache.hadoop.util.TestStringUtils
Tests run: 14, Failures: 0, Errors: 0, Skipped: 0, Time elapsed: 0.342 sec - in org.apache.hadoop.util.TestStringUtils
Running org.apache.hadoop.util.TestFindClass
Tests run: 7, Failures: 0, Errors: 0, Skipped: 0, Time elapsed: 1.863 sec - in org.apache.hadoop.util.TestGSet
Running org.apache.hadoop.util.TestGenericOptionsParser
Tests run: 16, Failures: 0, Errors: 0, Skipped: 0, Time elapsed: 0.67 sec - in org.apache.hadoop.util.TestFindClass
Running org.apache.hadoop.util.TestRunJar
Tests run: 4, Failures: 0, Errors: 0, Skipped: 0, Time elapsed: 0.59 sec - in org.apache.hadoop.util.TestRunJar
Tests run: 7, Failures: 0, Errors: 0, Skipped: 0, Time elapsed: 0.93 sec - in org.apache.hadoop.util.TestGenericOptionsParser
Running org.apache.hadoop.util.TestSysInfoLinux
Running org.apache.hadoop.util.TestDirectBufferPool
Tests run: 3, Failures: 0, Errors: 0, Skipped: 0, Time elapsed: 0.128 sec - in org.apache.hadoop.util.TestDirectBufferPool
Tests run: 6, Failures: 0, Errors: 0, Skipped: 0, Time elapsed: 0.33 sec - in org.apache.hadoop.util.TestSysInfoLinux
Running org.apache.hadoop.util.TestFileBasedIPList
Tests run: 8, Failures: 0, Errors: 0, Skipped: 0, Time elapsed: 0.182 sec - in org.apache.hadoop.util.TestFileBasedIPList
Running org.apache.hadoop.util.TestIndexedSort
Running org.apache.hadoop.util.TestIdentityHashStore
Tests run: 3, Failures: 0, Errors: 0, Skipped: 0, Time elapsed: 0.192 sec - in org.apache.hadoop.util.TestIdentityHashStore
Tests run: 2, Failures: 0, Errors: 0, Skipped: 0, Time elapsed: 0.586 sec - in org.apache.hadoop.util.TestIndexedSort
Running org.apache.hadoop.util.TestMachineList
Running org.apache.hadoop.util.TestWinUtils
Tests run: 11, Failures: 0, Errors: 0, Skipped: 11, Time elapsed: 0.279 sec - in org.apache.hadoop.util.TestWinUtils
Running org.apache.hadoop.util.hash.TestHash
Tests run: 14, Failures: 0, Errors: 0, Skipped: 0, Time elapsed: 0.93 sec - in org.apache.hadoop.util.TestMachineList
Tests run: 1, Failures: 0, Errors: 0, Skipped: 0, Time elapsed: 0.381 sec - in org.apache.hadoop.util.hash.TestHash
Running org.apache.hadoop.util.TestSignalLogger
Tests run: 1, Failures: 0, Errors: 0, Skipped: 0, Time elapsed: 0.18 sec - in org.apache.hadoop.util.TestSignalLogger
Running org.apache.hadoop.util.TestApplicationClassLoader
Running org.apache.hadoop.util.TestNodeHealthScriptRunner
Tests run: 4, Failures: 0, Errors: 0, Skipped: 0, Time elapsed: 0.308 sec - in org.apache.hadoop.util.TestApplicationClassLoader
Running org.apache.hadoop.util.TestCacheableIPList
Tests run: 4, Failures: 0, Errors: 0, Skipped: 0, Time elapsed: 1.267 sec - in org.apache.hadoop.util.TestCacheableIPList
Running org.apache.hadoop.util.TestSysInfoWindows
Tests run: 4, Failures: 0, Errors: 0, Skipped: 0, Time elapsed: 0.151 sec - in org.apache.hadoop.util.TestSysInfoWindows
Running org.apache.hadoop.util.TestClassUtil
Tests run: 1, Failures: 0, Errors: 0, Skipped: 0, Time elapsed: 0.066 sec - in org.apache.hadoop.util.TestClassUtil
Running org.apache.hadoop.util.TestOptions
Tests run: 2, Failures: 0, Errors: 0, Skipped: 0, Time elapsed: 0.082 sec - in org.apache.hadoop.util.TestOptions
Running org.apache.hadoop.util.TestShell
Tests run: 6, Failures: 0, Errors: 0, Skipped: 0, Time elapsed: 45.358 sec - in org.apache.hadoop.security.token.delegation.TestZKDelegationTokenSecretManager
Running org.apache.hadoop.util.TestAsyncDiskService
Tests run: 1, Failures: 0, Errors: 0, Skipped: 0, Time elapsed: 0.162 sec - in org.apache.hadoop.util.TestAsyncDiskService
Running org.apache.hadoop.util.TestPureJavaCrc32
Tests run: 1, Failures: 0, Errors: 0, Skipped: 0, Time elapsed: 0.364 sec - in org.apache.hadoop.util.TestPureJavaCrc32
Running org.apache.hadoop.util.TestDataChecksum
Tests run: 2, Failures: 0, Errors: 0, Skipped: 0, Time elapsed: 4.64 sec - in org.apache.hadoop.util.TestNodeHealthScriptRunner
Running org.apache.hadoop.util.TestShutdownThreadsHelper
Tests run: 2, Failures: 0, Errors: 0, Skipped: 0, Time elapsed: 3.165 sec - in org.apache.hadoop.util.TestShutdownThreadsHelper
Tests run: 22, Failures: 0, Errors: 0, Skipped: 0, Time elapsed: 5.433 sec - in org.apache.hadoop.util.TestShell
Running org.apache.hadoop.util.TestHttpExceptionUtils
Running org.apache.hadoop.util.TestNativeCodeLoader
Tests run: 1, Failures: 0, Errors: 0, Skipped: 0, Time elapsed: 0.276 sec - in org.apache.hadoop.util.TestNativeCodeLoader
Tests run: 7, Failures: 0, Errors: 0, Skipped: 0, Time elapsed: 0.806 sec - in org.apache.hadoop.util.TestHttpExceptionUtils
Running org.apache.hadoop.util.TestReflectionUtils
Running org.apache.hadoop.util.TestNativeLibraryChecker
Tests run: 5, Failures: 0, Errors: 0, Skipped: 0, Time elapsed: 0.607 sec - in org.apache.hadoop.util.TestReflectionUtils
Tests run: 2, Failures: 0, Errors: 0, Skipped: 0, Time elapsed: 0.651 sec - in org.apache.hadoop.util.TestNativeLibraryChecker
Running org.apache.hadoop.util.TestShutdownHookManager
Tests run: 1, Failures: 0, Errors: 0, Skipped: 0, Time elapsed: 0.222 sec - in org.apache.hadoop.util.TestShutdownHookManager
Running org.apache.hadoop.util.TestClasspath
Tests run: 7, Failures: 0, Errors: 0, Skipped: 0, Time elapsed: 0.434 sec - in org.apache.hadoop.util.TestClasspath
Running org.apache.hadoop.util.TestLightWeightResizableGSet
Tests run: 2, Failures: 0, Errors: 0, Skipped: 0, Time elapsed: 0.437 sec - in org.apache.hadoop.util.TestLightWeightResizableGSet
Running org.apache.hadoop.util.bloom.TestBloomFilters
Tests run: 6, Failures: 0, Errors: 0, Skipped: 0, Time elapsed: 0.337 sec - in org.apache.hadoop.util.bloom.TestBloomFilters
Running org.apache.hadoop.util.TestConfTest
Tests run: 14, Failures: 0, Errors: 0, Skipped: 0, Time elapsed: 0.333 sec - in org.apache.hadoop.util.TestConfTest
Running org.apache.hadoop.util.TestStopWatch
Tests run: 3, Failures: 0, Errors: 0, Skipped: 0, Time elapsed: 0.073 sec - in org.apache.hadoop.util.TestStopWatch
Running org.apache.hadoop.util.TestJarFinder
Tests run: 4, Failures: 0, Errors: 0, Skipped: 0, Time elapsed: 0.847 sec - in org.apache.hadoop.util.TestJarFinder
Running org.apache.hadoop.util.curator.TestChildReaper
Running org.apache.hadoop.util.TestLineReader
Tests run: 1, Failures: 0, Errors: 0, Skipped: 0, Time elapsed: 0.189 sec - in org.apache.hadoop.util.TestLineReader
Running org.apache.hadoop.util.TestNativeCrc32
Tests run: 22, Failures: 0, Errors: 0, Skipped: 0, Time elapsed: 0.805 sec - in org.apache.hadoop.util.TestNativeCrc32
Running org.apache.hadoop.log.TestLog4Json
Tests run: 25, Failures: 0, Errors: 0, Skipped: 0, Time elapsed: 107.824 sec - in org.apache.hadoop.io.compress.TestCodec
Tests run: 5, Failures: 0, Errors: 0, Skipped: 0, Time elapsed: 0.383 sec - in org.apache.hadoop.log.TestLog4Json
Running org.apache.hadoop.log.TestLogLevel
Running org.apache.hadoop.conf.TestReconfiguration
Tests run: 1, Failures: 0, Errors: 0, Skipped: 0, Time elapsed: 0.927 sec - in org.apache.hadoop.log.TestLogLevel
Running org.apache.hadoop.conf.TestCommonConfigurationFields
Tests run: 3, Failures: 0, Errors: 0, Skipped: 0, Time elapsed: 0.522 sec - in org.apache.hadoop.conf.TestCommonConfigurationFields
Running org.apache.hadoop.conf.TestConfServlet
Tests run: 9, Failures: 0, Errors: 0, Skipped: 0, Time elapsed: 2.6 sec - in org.apache.hadoop.conf.TestReconfiguration
Tests run: 3, Failures: 0, Errors: 0, Skipped: 0, Time elapsed: 0.546 sec - in org.apache.hadoop.conf.TestConfServlet
Running org.apache.hadoop.conf.TestConfiguration
Running org.apache.hadoop.conf.TestConfigurationSubclass
Tests run: 3, Failures: 0, Errors: 0, Skipped: 0, Time elapsed: 0.384 sec - in org.apache.hadoop.conf.TestConfigurationSubclass
Running org.apache.hadoop.conf.TestGetInstances
Tests run: 1, Failures: 0, Errors: 0, Skipped: 0, Time elapsed: 0.455 sec - in org.apache.hadoop.conf.TestGetInstances
Running org.apache.hadoop.conf.TestConfigurationDeprecation
Tests run: 62, Failures: 0, Errors: 0, Skipped: 0, Time elapsed: 10.809 sec - in org.apache.hadoop.conf.TestConfiguration
Running org.apache.hadoop.conf.TestDeprecatedKeys
Tests run: 3, Failures: 0, Errors: 0, Skipped: 0, Time elapsed: 0.451 sec - in org.apache.hadoop.conf.TestDeprecatedKeys
Running org.apache.hadoop.tracing.TestTraceUtils
Tests run: 9, Failures: 0, Errors: 0, Skipped: 0, Time elapsed: 10.402 sec - in org.apache.hadoop.conf.TestConfigurationDeprecation
Running org.apache.hadoop.cli.TestCLI
Tests run: 3, Failures: 0, Errors: 0, Skipped: 0, Time elapsed: 0.613 sec - in org.apache.hadoop.tracing.TestTraceUtils
Tests run: 1, Failures: 0, Errors: 0, Skipped: 0, Time elapsed: 0.767 sec - in org.apache.hadoop.cli.TestCLI
Tests run: 5, Failures: 0, Errors: 0, Skipped: 0, Time elapsed: 33.742 sec - in org.apache.hadoop.util.TestDataChecksum
Tests run: 4, Failures: 0, Errors: 0, Skipped: 0, Time elapsed: 54.138 sec - in org.apache.hadoop.util.curator.TestChildReaper

Results :

Failed tests: 
  TestDNS.testLookupWithoutHostsFallback:231 
Expected: is "-DUMMY_HOSTNAME"
     but: was "localhost"

Tests run: 3393, Failures: 1, Errors: 0, Skipped: 86

[INFO]                                                                         
[INFO] ------------------------------------------------------------------------
[INFO] Skipping Apache Hadoop NFS
[INFO] This project has been banned from the build due to previous failures.
[INFO] ------------------------------------------------------------------------
[INFO]                                                                         
[INFO] ------------------------------------------------------------------------
[INFO] Skipping Apache Hadoop KMS
[INFO] This project has been banned from the build due to previous failures.
[INFO] ------------------------------------------------------------------------
[INFO]                                                                         
[INFO] ------------------------------------------------------------------------
[INFO] Building Apache Hadoop Common Project 3.0.0-alpha1-SNAPSHOT
[INFO] ------------------------------------------------------------------------
Downloading: https://repo.maven.apache.org/maven2/org/apache/maven/plugins/maven-deploy-plugin/2.8.1/maven-deploy-plugin-2.8.1.pom
4/8 KB       
8/8 KB   
8/8 KB   
         
Downloaded: https://repo.maven.apache.org/maven2/org/apache/maven/plugins/maven-deploy-plugin/2.8.1/maven-deploy-plugin-2.8.1.pom
(8 KB at 55.8 KB/sec)
Downloading: https://repo.maven.apache.org/maven2/org/apache/maven/plugins/maven-deploy-plugin/2.8.1/maven-deploy-plugin-2.8.1.jar
4/34 KB   
8/34 KB   
12/34 KB   
16/34 KB   
20/34 KB   
24/34 KB   
28/34 KB   
32/34 KB   
34/34 KB   
           
Downloaded: https://repo.maven.apache.org/maven2/org/apache/maven/plugins/maven-deploy-plugin/2.8.1/maven-deploy-plugin-2.8.1.jar
(34 KB at 234.7 KB/sec)
[INFO] 
[INFO] --- maven-clean-plugin:2.5:clean (default-clean) @ hadoop-common-project ---
[INFO] Deleting <https://builds.apache.org/job/Hadoop-common-trunk-Java8/ws/source/hadoop-common-project/target>
[INFO] 
[INFO] --- maven-antrun-plugin:1.7:run (create-testdirs) @ hadoop-common-project ---
[INFO] Executing tasks

main:
    [mkdir] Created dir: <https://builds.apache.org/job/Hadoop-common-trunk-Java8/ws/source/hadoop-common-project/target/test-dir>
[INFO] Executed tasks
[INFO] 
[INFO] --- maven-source-plugin:2.3:jar-no-fork (hadoop-java-sources) @ hadoop-common-project
---
[INFO] 
[INFO] --- maven-source-plugin:2.3:test-jar-no-fork (hadoop-java-sources) @ hadoop-common-project
---
[INFO] 
[INFO] --- maven-enforcer-plugin:1.3.1:enforce (dist-enforce) @ hadoop-common-project ---
[INFO] 
[INFO] --- maven-site-plugin:3.5:attach-descriptor (attach-descriptor) @ hadoop-common-project
---
[INFO] 
[INFO] --- maven-javadoc-plugin:2.8.1:jar (module-javadocs) @ hadoop-common-project ---
[INFO] Not executing Javadoc as the project is not a Java classpath-capable package
[INFO] 
[INFO] --- maven-enforcer-plugin:1.3.1:enforce (depcheck) @ hadoop-common-project ---
[INFO] 
[INFO] --- maven-checkstyle-plugin:2.15:checkstyle (default-cli) @ hadoop-common-project ---
[INFO] 
[INFO] --- findbugs-maven-plugin:3.0.0:findbugs (default-cli) @ hadoop-common-project ---
[INFO] ------------------------------------------------------------------------
[INFO] Reactor Summary:
[INFO] 
[INFO] Apache Hadoop Annotations .......................... SUCCESS [ 30.956 s]
[INFO] Apache Hadoop MiniKDC .............................. SUCCESS [ 25.087 s]
[INFO] Apache Hadoop Auth ................................. SUCCESS [03:55 min]
[INFO] Apache Hadoop Auth Examples ........................ SUCCESS [  8.768 s]
[INFO] Apache Hadoop Common ............................... FAILURE [06:33 min]
[INFO] Apache Hadoop NFS .................................. SKIPPED
[INFO] Apache Hadoop KMS .................................. SKIPPED
[INFO] Apache Hadoop Common Project ....................... SUCCESS [  0.381 s]
[INFO] ------------------------------------------------------------------------
[INFO] BUILD FAILURE
[INFO] ------------------------------------------------------------------------
[INFO] Total time: 11:38 min
[INFO] Finished at: 2016-05-18T22:12:23+00:00
[INFO] Final Memory: 121M/2710M
[INFO] ------------------------------------------------------------------------
[ERROR] Failed to execute goal org.apache.maven.plugins:maven-surefire-plugin:2.17:test (default-test)
on project hadoop-common: There are test failures.
[ERROR] 
[ERROR] Please refer to <https://builds.apache.org/job/Hadoop-common-trunk-Java8/ws/source/hadoop-common-project/hadoop-common/target/surefire-reports>
for the individual test results.
[ERROR] -> [Help 1]
[ERROR] 
[ERROR] To see the full stack trace of the errors, re-run Maven with the -e switch.
[ERROR] Re-run Maven using the -X switch to enable full debug logging.
[ERROR] 
[ERROR] For more information about the errors and possible solutions, please read the following
articles:
[ERROR] [Help 1] http://cwiki.apache.org/confluence/display/MAVEN/MojoFailureException
[ERROR] 
[ERROR] After correcting the problems, you can resume the build with the command
[ERROR]   mvn <goals> -rf :hadoop-common
Build step 'Execute shell' marked build as failure
Archiving artifacts
Setting LATEST1_8_HOME=/home/jenkins/jenkins-slave/tools/hudson.model.JDK/latest1.8
Setting MAVEN_3_3_3_HOME=/home/jenkins/jenkins-slave/tools/hudson.tasks.Maven_MavenInstallation/maven-3.3.3
Recording test results
Setting LATEST1_8_HOME=/home/jenkins/jenkins-slave/tools/hudson.model.JDK/latest1.8
Setting MAVEN_3_3_3_HOME=/home/jenkins/jenkins-slave/tools/hudson.tasks.Maven_MavenInstallation/maven-3.3.3
Setting LATEST1_8_HOME=/home/jenkins/jenkins-slave/tools/hudson.model.JDK/latest1.8
Setting MAVEN_3_3_3_HOME=/home/jenkins/jenkins-slave/tools/hudson.tasks.Maven_MavenInstallation/maven-3.3.3

---------------------------------------------------------------------
To unsubscribe, e-mail: common-dev-unsubscribe@hadoop.apache.org
For additional commands, e-mail: common-dev-help@hadoop.apache.org


Mime
View raw message