hadoop-common-dev mailing list archives

Site index · List index
Message view « Date » · « Thread »
Top « Date » · « Thread »
From Apache Jenkins Server <jenk...@builds.apache.org>
Subject Build failed in Jenkins: Hadoop-common-trunk-Java8 #1299
Date Wed, 06 Apr 2016 09:27:50 GMT
See <https://builds.apache.org/job/Hadoop-common-trunk-Java8/1299/changes>

Changes:

[vvasudev] YARN-4906. Capture container start/finish time in container metrics.

------------------------------------------
[...truncated 5541 lines...]
Tests run: 2, Failures: 0, Errors: 0, Skipped: 0, Time elapsed: 0.262 sec - in org.apache.hadoop.io.erasurecode.coder.TestXORCoder
Java HotSpot(TM) 64-Bit Server VM warning: ignoring option MaxPermSize=768m; support was removed
in 8.0
Running org.apache.hadoop.io.erasurecode.coder.TestHHXORErasureCoder
Tests run: 9, Failures: 0, Errors: 0, Skipped: 0, Time elapsed: 1.374 sec - in org.apache.hadoop.io.erasurecode.coder.TestHHXORErasureCoder
Java HotSpot(TM) 64-Bit Server VM warning: ignoring option MaxPermSize=768m; support was removed
in 8.0
Running org.apache.hadoop.io.TestSequenceFileSync
Tests run: 1, Failures: 0, Errors: 0, Skipped: 0, Time elapsed: 0.973 sec - in org.apache.hadoop.io.TestSequenceFileSync
Java HotSpot(TM) 64-Bit Server VM warning: ignoring option MaxPermSize=768m; support was removed
in 8.0
Running org.apache.hadoop.io.TestVersionedWritable
Tests run: 3, Failures: 0, Errors: 0, Skipped: 0, Time elapsed: 0.166 sec - in org.apache.hadoop.io.TestVersionedWritable
Java HotSpot(TM) 64-Bit Server VM warning: ignoring option MaxPermSize=768m; support was removed
in 8.0
Running org.apache.hadoop.io.TestWritable
Tests run: 6, Failures: 0, Errors: 0, Skipped: 0, Time elapsed: 0.367 sec - in org.apache.hadoop.io.TestWritable
Java HotSpot(TM) 64-Bit Server VM warning: ignoring option MaxPermSize=768m; support was removed
in 8.0
Running org.apache.hadoop.io.TestBloomMapFile
Tests run: 7, Failures: 0, Errors: 0, Skipped: 0, Time elapsed: 1.412 sec - in org.apache.hadoop.io.TestBloomMapFile
Java HotSpot(TM) 64-Bit Server VM warning: ignoring option MaxPermSize=768m; support was removed
in 8.0
Running org.apache.hadoop.io.TestSequenceFileAppend
Tests run: 4, Failures: 0, Errors: 0, Skipped: 0, Time elapsed: 0.873 sec - in org.apache.hadoop.io.TestSequenceFileAppend
Java HotSpot(TM) 64-Bit Server VM warning: ignoring option MaxPermSize=768m; support was removed
in 8.0
Running org.apache.hadoop.io.TestEnumSetWritable
Tests run: 6, Failures: 0, Errors: 0, Skipped: 0, Time elapsed: 0.603 sec - in org.apache.hadoop.io.TestEnumSetWritable
Java HotSpot(TM) 64-Bit Server VM warning: ignoring option MaxPermSize=768m; support was removed
in 8.0
Running org.apache.hadoop.io.TestMapWritable
Tests run: 5, Failures: 0, Errors: 0, Skipped: 0, Time elapsed: 0.223 sec - in org.apache.hadoop.io.TestMapWritable
Java HotSpot(TM) 64-Bit Server VM warning: ignoring option MaxPermSize=768m; support was removed
in 8.0
Running org.apache.hadoop.io.TestBooleanWritable
Tests run: 2, Failures: 0, Errors: 0, Skipped: 0, Time elapsed: 0.196 sec - in org.apache.hadoop.io.TestBooleanWritable
Java HotSpot(TM) 64-Bit Server VM warning: ignoring option MaxPermSize=768m; support was removed
in 8.0
Running org.apache.hadoop.io.TestBytesWritable
Tests run: 6, Failures: 0, Errors: 0, Skipped: 0, Time elapsed: 0.263 sec - in org.apache.hadoop.io.TestBytesWritable
Java HotSpot(TM) 64-Bit Server VM warning: ignoring option MaxPermSize=768m; support was removed
in 8.0
Running org.apache.hadoop.io.TestSequenceFile
Tests run: 9, Failures: 0, Errors: 0, Skipped: 0, Time elapsed: 9.767 sec - in org.apache.hadoop.io.TestSequenceFile
Java HotSpot(TM) 64-Bit Server VM warning: ignoring option MaxPermSize=768m; support was removed
in 8.0
Running org.apache.hadoop.io.TestTextNonUTF8
Tests run: 1, Failures: 0, Errors: 0, Skipped: 0, Time elapsed: 0.194 sec - in org.apache.hadoop.io.TestTextNonUTF8
Java HotSpot(TM) 64-Bit Server VM warning: ignoring option MaxPermSize=768m; support was removed
in 8.0
Running org.apache.hadoop.io.TestObjectWritableProtos
Tests run: 3, Failures: 0, Errors: 0, Skipped: 0, Time elapsed: 0.29 sec - in org.apache.hadoop.io.TestObjectWritableProtos
Java HotSpot(TM) 64-Bit Server VM warning: ignoring option MaxPermSize=768m; support was removed
in 8.0
Running org.apache.hadoop.io.TestDefaultStringifier
Tests run: 4, Failures: 0, Errors: 0, Skipped: 0, Time elapsed: 0.427 sec - in org.apache.hadoop.io.TestDefaultStringifier
Java HotSpot(TM) 64-Bit Server VM warning: ignoring option MaxPermSize=768m; support was removed
in 8.0
Running org.apache.hadoop.io.retry.TestRetryProxy
Tests run: 12, Failures: 0, Errors: 0, Skipped: 0, Time elapsed: 1.48 sec - in org.apache.hadoop.io.retry.TestRetryProxy
Java HotSpot(TM) 64-Bit Server VM warning: ignoring option MaxPermSize=768m; support was removed
in 8.0
Running org.apache.hadoop.io.retry.TestDefaultRetryPolicy
Tests run: 3, Failures: 0, Errors: 0, Skipped: 0, Time elapsed: 0.44 sec - in org.apache.hadoop.io.retry.TestDefaultRetryPolicy
Java HotSpot(TM) 64-Bit Server VM warning: ignoring option MaxPermSize=768m; support was removed
in 8.0
Running org.apache.hadoop.io.retry.TestFailoverProxy
Tests run: 9, Failures: 0, Errors: 0, Skipped: 0, Time elapsed: 16.378 sec - in org.apache.hadoop.io.retry.TestFailoverProxy
Java HotSpot(TM) 64-Bit Server VM warning: ignoring option MaxPermSize=768m; support was removed
in 8.0
Running org.apache.hadoop.io.nativeio.TestNativeIO
Tests run: 20, Failures: 0, Errors: 0, Skipped: 0, Time elapsed: 7.101 sec - in org.apache.hadoop.io.nativeio.TestNativeIO
Java HotSpot(TM) 64-Bit Server VM warning: ignoring option MaxPermSize=768m; support was removed
in 8.0
Running org.apache.hadoop.io.nativeio.TestSharedFileDescriptorFactory
Tests run: 3, Failures: 0, Errors: 0, Skipped: 0, Time elapsed: 0.359 sec - in org.apache.hadoop.io.nativeio.TestSharedFileDescriptorFactory
Java HotSpot(TM) 64-Bit Server VM warning: ignoring option MaxPermSize=768m; support was removed
in 8.0
Running org.apache.hadoop.io.TestIOUtils
Tests run: 12, Failures: 0, Errors: 0, Skipped: 0, Time elapsed: 0.437 sec - in org.apache.hadoop.io.TestIOUtils
Java HotSpot(TM) 64-Bit Server VM warning: ignoring option MaxPermSize=768m; support was removed
in 8.0
Running org.apache.hadoop.io.TestSortedMapWritable
Tests run: 4, Failures: 0, Errors: 0, Skipped: 0, Time elapsed: 0.299 sec - in org.apache.hadoop.io.TestSortedMapWritable
Java HotSpot(TM) 64-Bit Server VM warning: ignoring option MaxPermSize=768m; support was removed
in 8.0
Running org.apache.hadoop.io.TestArrayPrimitiveWritable
Tests run: 3, Failures: 0, Errors: 0, Skipped: 0, Time elapsed: 0.241 sec - in org.apache.hadoop.io.TestArrayPrimitiveWritable
Java HotSpot(TM) 64-Bit Server VM warning: ignoring option MaxPermSize=768m; support was removed
in 8.0
Running org.apache.hadoop.io.TestSetFile
Tests run: 2, Failures: 0, Errors: 0, Skipped: 0, Time elapsed: 2.028 sec - in org.apache.hadoop.io.TestSetFile
Java HotSpot(TM) 64-Bit Server VM warning: ignoring option MaxPermSize=768m; support was removed
in 8.0
Running org.apache.hadoop.io.TestWritableName
Tests run: 4, Failures: 0, Errors: 0, Skipped: 0, Time elapsed: 0.204 sec - in org.apache.hadoop.io.TestWritableName
Java HotSpot(TM) 64-Bit Server VM warning: ignoring option MaxPermSize=768m; support was removed
in 8.0
Running org.apache.hadoop.io.TestGenericWritable
Tests run: 5, Failures: 0, Errors: 0, Skipped: 0, Time elapsed: 0.458 sec - in org.apache.hadoop.io.TestGenericWritable
Java HotSpot(TM) 64-Bit Server VM warning: ignoring option MaxPermSize=768m; support was removed
in 8.0
Running org.apache.hadoop.io.TestArrayFile
Tests run: 3, Failures: 0, Errors: 0, Skipped: 0, Time elapsed: 3.069 sec - in org.apache.hadoop.io.TestArrayFile
Java HotSpot(TM) 64-Bit Server VM warning: ignoring option MaxPermSize=768m; support was removed
in 8.0
Running org.apache.hadoop.io.TestText
Tests run: 18, Failures: 0, Errors: 0, Skipped: 0, Time elapsed: 0.732 sec - in org.apache.hadoop.io.TestText
Java HotSpot(TM) 64-Bit Server VM warning: ignoring option MaxPermSize=768m; support was removed
in 8.0
Running org.apache.hadoop.io.file.tfile.TestTFileSplit
Tests run: 1, Failures: 0, Errors: 0, Skipped: 0, Time elapsed: 3.98 sec - in org.apache.hadoop.io.file.tfile.TestTFileSplit
Java HotSpot(TM) 64-Bit Server VM warning: ignoring option MaxPermSize=768m; support was removed
in 8.0
Running org.apache.hadoop.io.file.tfile.TestTFileComparators
Tests run: 3, Failures: 0, Errors: 0, Skipped: 0, Time elapsed: 0.683 sec - in org.apache.hadoop.io.file.tfile.TestTFileComparators
Java HotSpot(TM) 64-Bit Server VM warning: ignoring option MaxPermSize=768m; support was removed
in 8.0
Running org.apache.hadoop.io.file.tfile.TestTFileSeek
Tests run: 1, Failures: 0, Errors: 0, Skipped: 0, Time elapsed: 3.248 sec - in org.apache.hadoop.io.file.tfile.TestTFileSeek
Java HotSpot(TM) 64-Bit Server VM warning: ignoring option MaxPermSize=768m; support was removed
in 8.0
Running org.apache.hadoop.io.file.tfile.TestTFileStreams
Tests run: 19, Failures: 0, Errors: 0, Skipped: 0, Time elapsed: 2.282 sec - in org.apache.hadoop.io.file.tfile.TestTFileStreams
Java HotSpot(TM) 64-Bit Server VM warning: ignoring option MaxPermSize=768m; support was removed
in 8.0
Running org.apache.hadoop.io.file.tfile.TestTFileJClassComparatorByteArrays
Tests run: 25, Failures: 0, Errors: 0, Skipped: 0, Time elapsed: 2.072 sec - in org.apache.hadoop.io.file.tfile.TestTFileJClassComparatorByteArrays
Java HotSpot(TM) 64-Bit Server VM warning: ignoring option MaxPermSize=768m; support was removed
in 8.0
Running org.apache.hadoop.io.file.tfile.TestTFileNoneCodecsByteArrays
Tests run: 25, Failures: 0, Errors: 0, Skipped: 0, Time elapsed: 1.366 sec - in org.apache.hadoop.io.file.tfile.TestTFileNoneCodecsByteArrays
Java HotSpot(TM) 64-Bit Server VM warning: ignoring option MaxPermSize=768m; support was removed
in 8.0
Running org.apache.hadoop.io.file.tfile.TestTFileNoneCodecsJClassComparatorByteArrays
Tests run: 25, Failures: 0, Errors: 0, Skipped: 0, Time elapsed: 1.366 sec - in org.apache.hadoop.io.file.tfile.TestTFileNoneCodecsJClassComparatorByteArrays
Java HotSpot(TM) 64-Bit Server VM warning: ignoring option MaxPermSize=768m; support was removed
in 8.0
Running org.apache.hadoop.io.file.tfile.TestTFileByteArrays
Tests run: 25, Failures: 0, Errors: 0, Skipped: 0, Time elapsed: 2.075 sec - in org.apache.hadoop.io.file.tfile.TestTFileByteArrays
Java HotSpot(TM) 64-Bit Server VM warning: ignoring option MaxPermSize=768m; support was removed
in 8.0
Running org.apache.hadoop.io.file.tfile.TestTFile
Tests run: 3, Failures: 0, Errors: 0, Skipped: 0, Time elapsed: 1.12 sec - in org.apache.hadoop.io.file.tfile.TestTFile
Java HotSpot(TM) 64-Bit Server VM warning: ignoring option MaxPermSize=768m; support was removed
in 8.0
Running org.apache.hadoop.io.file.tfile.TestTFileSeqFileComparison
Tests run: 1, Failures: 0, Errors: 0, Skipped: 0, Time elapsed: 3.48 sec - in org.apache.hadoop.io.file.tfile.TestTFileSeqFileComparison
Java HotSpot(TM) 64-Bit Server VM warning: ignoring option MaxPermSize=768m; support was removed
in 8.0
Running org.apache.hadoop.io.file.tfile.TestTFileNoneCodecsStreams
Tests run: 19, Failures: 0, Errors: 0, Skipped: 0, Time elapsed: 1.376 sec - in org.apache.hadoop.io.file.tfile.TestTFileNoneCodecsStreams
Java HotSpot(TM) 64-Bit Server VM warning: ignoring option MaxPermSize=768m; support was removed
in 8.0
Running org.apache.hadoop.io.file.tfile.TestTFileUnsortedByteArrays
Tests run: 4, Failures: 0, Errors: 0, Skipped: 0, Time elapsed: 0.793 sec - in org.apache.hadoop.io.file.tfile.TestTFileUnsortedByteArrays
Java HotSpot(TM) 64-Bit Server VM warning: ignoring option MaxPermSize=768m; support was removed
in 8.0
Running org.apache.hadoop.io.file.tfile.TestTFileLzoCodecsStreams
Tests run: 19, Failures: 0, Errors: 0, Skipped: 0, Time elapsed: 0.342 sec - in org.apache.hadoop.io.file.tfile.TestTFileLzoCodecsStreams
Java HotSpot(TM) 64-Bit Server VM warning: ignoring option MaxPermSize=768m; support was removed
in 8.0
Running org.apache.hadoop.io.file.tfile.TestTFileLzoCodecsByteArrays
Tests run: 25, Failures: 0, Errors: 0, Skipped: 0, Time elapsed: 0.365 sec - in org.apache.hadoop.io.file.tfile.TestTFileLzoCodecsByteArrays
Java HotSpot(TM) 64-Bit Server VM warning: ignoring option MaxPermSize=768m; support was removed
in 8.0
Running org.apache.hadoop.io.file.tfile.TestTFileComparator2
Tests run: 1, Failures: 0, Errors: 0, Skipped: 0, Time elapsed: 0.963 sec - in org.apache.hadoop.io.file.tfile.TestTFileComparator2
Java HotSpot(TM) 64-Bit Server VM warning: ignoring option MaxPermSize=768m; support was removed
in 8.0
Running org.apache.hadoop.io.file.tfile.TestVLong
Tests run: 9, Failures: 0, Errors: 0, Skipped: 0, Time elapsed: 1.503 sec - in org.apache.hadoop.io.file.tfile.TestVLong
Java HotSpot(TM) 64-Bit Server VM warning: ignoring option MaxPermSize=768m; support was removed
in 8.0
Running org.apache.hadoop.io.TestArrayWritable
Tests run: 4, Failures: 0, Errors: 0, Skipped: 0, Time elapsed: 0.227 sec - in org.apache.hadoop.io.TestArrayWritable
Java HotSpot(TM) 64-Bit Server VM warning: ignoring option MaxPermSize=768m; support was removed
in 8.0
Running org.apache.hadoop.io.TestSequenceFileSerialization
Tests run: 1, Failures: 0, Errors: 0, Skipped: 0, Time elapsed: 0.895 sec - in org.apache.hadoop.io.TestSequenceFileSerialization
Java HotSpot(TM) 64-Bit Server VM warning: ignoring option MaxPermSize=768m; support was removed
in 8.0
Running org.apache.hadoop.conf.TestConfigurationDeprecation
Tests run: 9, Failures: 0, Errors: 0, Skipped: 0, Time elapsed: 11.407 sec - in org.apache.hadoop.conf.TestConfigurationDeprecation
Java HotSpot(TM) 64-Bit Server VM warning: ignoring option MaxPermSize=768m; support was removed
in 8.0
Running org.apache.hadoop.conf.TestReconfiguration
Tests run: 9, Failures: 0, Errors: 0, Skipped: 0, Time elapsed: 2.598 sec - in org.apache.hadoop.conf.TestReconfiguration
Java HotSpot(TM) 64-Bit Server VM warning: ignoring option MaxPermSize=768m; support was removed
in 8.0
Running org.apache.hadoop.conf.TestConfiguration
Tests run: 62, Failures: 0, Errors: 0, Skipped: 0, Time elapsed: 5.028 sec - in org.apache.hadoop.conf.TestConfiguration
Java HotSpot(TM) 64-Bit Server VM warning: ignoring option MaxPermSize=768m; support was removed
in 8.0
Running org.apache.hadoop.conf.TestConfigurationSubclass
Tests run: 3, Failures: 0, Errors: 0, Skipped: 0, Time elapsed: 0.402 sec - in org.apache.hadoop.conf.TestConfigurationSubclass
Java HotSpot(TM) 64-Bit Server VM warning: ignoring option MaxPermSize=768m; support was removed
in 8.0
Running org.apache.hadoop.conf.TestGetInstances
Tests run: 1, Failures: 0, Errors: 0, Skipped: 0, Time elapsed: 0.326 sec - in org.apache.hadoop.conf.TestGetInstances
Java HotSpot(TM) 64-Bit Server VM warning: ignoring option MaxPermSize=768m; support was removed
in 8.0
Running org.apache.hadoop.conf.TestConfServlet
Tests run: 3, Failures: 0, Errors: 0, Skipped: 0, Time elapsed: 0.494 sec - in org.apache.hadoop.conf.TestConfServlet
Java HotSpot(TM) 64-Bit Server VM warning: ignoring option MaxPermSize=768m; support was removed
in 8.0
Running org.apache.hadoop.conf.TestDeprecatedKeys
Tests run: 3, Failures: 0, Errors: 0, Skipped: 0, Time elapsed: 0.426 sec - in org.apache.hadoop.conf.TestDeprecatedKeys
Java HotSpot(TM) 64-Bit Server VM warning: ignoring option MaxPermSize=768m; support was removed
in 8.0
Running org.apache.hadoop.test.TestMultithreadedTestUtil
Tests run: 4, Failures: 0, Errors: 0, Skipped: 0, Time elapsed: 3.2 sec - in org.apache.hadoop.test.TestMultithreadedTestUtil
Java HotSpot(TM) 64-Bit Server VM warning: ignoring option MaxPermSize=768m; support was removed
in 8.0
Running org.apache.hadoop.test.TestTimedOutTestsListener
Tests run: 1, Failures: 0, Errors: 0, Skipped: 0, Time elapsed: 0.228 sec - in org.apache.hadoop.test.TestTimedOutTestsListener
Java HotSpot(TM) 64-Bit Server VM warning: ignoring option MaxPermSize=768m; support was removed
in 8.0
Running org.apache.hadoop.test.TestGenericTestUtils
Tests run: 4, Failures: 0, Errors: 0, Skipped: 0, Time elapsed: 0.17 sec - in org.apache.hadoop.test.TestGenericTestUtils
Java HotSpot(TM) 64-Bit Server VM warning: ignoring option MaxPermSize=768m; support was removed
in 8.0
Running org.apache.hadoop.test.TestJUnitSetup
Tests run: 1, Failures: 0, Errors: 0, Skipped: 0, Time elapsed: 0.167 sec - in org.apache.hadoop.test.TestJUnitSetup
Java HotSpot(TM) 64-Bit Server VM warning: ignoring option MaxPermSize=768m; support was removed
in 8.0
Running org.apache.hadoop.log.TestLog4Json
Tests run: 5, Failures: 0, Errors: 0, Skipped: 0, Time elapsed: 0.437 sec - in org.apache.hadoop.log.TestLog4Json
Java HotSpot(TM) 64-Bit Server VM warning: ignoring option MaxPermSize=768m; support was removed
in 8.0
Running org.apache.hadoop.log.TestLogLevel
Tests run: 1, Failures: 0, Errors: 0, Skipped: 0, Time elapsed: 1.061 sec - in org.apache.hadoop.log.TestLogLevel

Results :

Tests in error: 
  TestZKFailoverController.testGracefulFailover:441 ยป ServiceFailed Unable to be...

Tests run: 3334, Failures: 0, Errors: 1, Skipped: 86

[INFO] ------------------------------------------------------------------------
[INFO] Reactor Summary:
[INFO] 
[INFO] Apache Hadoop Annotations ......................... SUCCESS [  6.256 s]
[INFO] Apache Hadoop MiniKDC ............................. SUCCESS [ 23.969 s]
[INFO] Apache Hadoop Auth ................................ SUCCESS [03:54 min]
[INFO] Apache Hadoop Auth Examples ....................... SUCCESS [  3.695 s]
[INFO] Apache Hadoop Common .............................. FAILURE [25:12 min]
[INFO] Apache Hadoop NFS ................................. SKIPPED
[INFO] Apache Hadoop KMS ................................. SKIPPED
[INFO] Apache Hadoop Common Project ...................... SKIPPED
[INFO] ------------------------------------------------------------------------
[INFO] BUILD FAILURE
[INFO] ------------------------------------------------------------------------
[INFO] Total time: 29:41 min
[INFO] Finished at: 2016-04-06T09:27:45+00:00
[INFO] Final Memory: 62M/296M
[INFO] ------------------------------------------------------------------------
[ERROR] Failed to execute goal org.apache.maven.plugins:maven-surefire-plugin:2.17:test (default-test)
on project hadoop-common: There are test failures.
[ERROR] 
[ERROR] Please refer to <https://builds.apache.org/job/Hadoop-common-trunk-Java8/ws/hadoop-common-project/hadoop-common/target/surefire-reports>
for the individual test results.
[ERROR] -> [Help 1]
org.apache.maven.lifecycle.LifecycleExecutionException: Failed to execute goal org.apache.maven.plugins:maven-surefire-plugin:2.17:test
(default-test) on project hadoop-common: There are test failures.

Please refer to <https://builds.apache.org/job/Hadoop-common-trunk-Java8/ws/hadoop-common-project/hadoop-common/target/surefire-reports>
for the individual test results.
	at org.apache.maven.lifecycle.internal.MojoExecutor.execute(MojoExecutor.java:212)
	at org.apache.maven.lifecycle.internal.MojoExecutor.execute(MojoExecutor.java:153)
	at org.apache.maven.lifecycle.internal.MojoExecutor.execute(MojoExecutor.java:145)
	at org.apache.maven.lifecycle.internal.LifecycleModuleBuilder.buildProject(LifecycleModuleBuilder.java:108)
	at org.apache.maven.lifecycle.internal.LifecycleModuleBuilder.buildProject(LifecycleModuleBuilder.java:76)
	at org.apache.maven.lifecycle.internal.builder.singlethreaded.SingleThreadedBuilder.build(SingleThreadedBuilder.java:51)
	at org.apache.maven.lifecycle.internal.LifecycleStarter.execute(LifecycleStarter.java:116)
	at org.apache.maven.DefaultMaven.doExecute(DefaultMaven.java:361)
	at org.apache.maven.DefaultMaven.execute(DefaultMaven.java:155)
	at org.apache.maven.cli.MavenCli.execute(MavenCli.java:584)
	at org.apache.maven.cli.MavenCli.doMain(MavenCli.java:213)
	at org.apache.maven.cli.MavenCli.main(MavenCli.java:157)
	at sun.reflect.NativeMethodAccessorImpl.invoke0(Native Method)
	at sun.reflect.NativeMethodAccessorImpl.invoke(NativeMethodAccessorImpl.java:62)
	at sun.reflect.DelegatingMethodAccessorImpl.invoke(DelegatingMethodAccessorImpl.java:43)
	at java.lang.reflect.Method.invoke(Method.java:483)
	at org.codehaus.plexus.classworlds.launcher.Launcher.launchEnhanced(Launcher.java:289)
	at org.codehaus.plexus.classworlds.launcher.Launcher.launch(Launcher.java:229)
	at org.codehaus.plexus.classworlds.launcher.Launcher.mainWithExitCode(Launcher.java:415)
	at org.codehaus.plexus.classworlds.launcher.Launcher.main(Launcher.java:356)
Caused by: org.apache.maven.plugin.MojoFailureException: There are test failures.

Please refer to <https://builds.apache.org/job/Hadoop-common-trunk-Java8/ws/hadoop-common-project/hadoop-common/target/surefire-reports>
for the individual test results.
	at org.apache.maven.plugin.surefire.SurefireHelper.reportExecution(SurefireHelper.java:82)
	at org.apache.maven.plugin.surefire.SurefirePlugin.handleSummary(SurefirePlugin.java:195)
	at org.apache.maven.plugin.surefire.AbstractSurefireMojo.executeAfterPreconditionsChecked(AbstractSurefireMojo.java:861)
	at org.apache.maven.plugin.surefire.AbstractSurefireMojo.execute(AbstractSurefireMojo.java:729)
	at org.apache.maven.plugin.DefaultBuildPluginManager.executeMojo(DefaultBuildPluginManager.java:133)
	at org.apache.maven.lifecycle.internal.MojoExecutor.execute(MojoExecutor.java:208)
	... 19 more
[ERROR] 
[ERROR] Re-run Maven using the -X switch to enable full debug logging.
[ERROR] 
[ERROR] For more information about the errors and possible solutions, please read the following
articles:
[ERROR] [Help 1] http://cwiki.apache.org/confluence/display/MAVEN/MojoFailureException
[ERROR] 
[ERROR] After correcting the problems, you can resume the build with the command
[ERROR]   mvn <goals> -rf :hadoop-common
Build step 'Execute shell' marked build as failure
Archiving artifacts
Recording test results

Mime
View raw message