hadoop-common-dev mailing list archives

Site index · List index
Message view « Date » · « Thread »
Top « Date » · « Thread »
From Apache Jenkins Server <jenk...@builds.apache.org>
Subject Build failed in Jenkins: Hadoop-Common-trunk #2605
Date Fri, 08 Apr 2016 21:33:38 GMT
See <https://builds.apache.org/job/Hadoop-Common-trunk/2605/changes>

Changes:

[cnauroth] HADOOP-12994. Specify PositionedReadable, add contract tests, fix

------------------------------------------
[...truncated 3847 lines...]
Generating <https://builds.apache.org/job/Hadoop-Common-trunk/ws/hadoop-common-project/hadoop-annotations/target/org/apache/hadoop/classification/tools/package-use.html...>
Building index for all the packages and classes...
Generating <https://builds.apache.org/job/Hadoop-Common-trunk/ws/hadoop-common-project/hadoop-annotations/target/overview-tree.html...>
Generating <https://builds.apache.org/job/Hadoop-Common-trunk/ws/hadoop-common-project/hadoop-annotations/target/index-all.html...>
Generating <https://builds.apache.org/job/Hadoop-Common-trunk/ws/hadoop-common-project/hadoop-annotations/target/deprecated-list.html...>
Building index for all classes...
Generating <https://builds.apache.org/job/Hadoop-Common-trunk/ws/hadoop-common-project/hadoop-annotations/target/allclasses-frame.html...>
Generating <https://builds.apache.org/job/Hadoop-Common-trunk/ws/hadoop-common-project/hadoop-annotations/target/allclasses-noframe.html...>
Generating <https://builds.apache.org/job/Hadoop-Common-trunk/ws/hadoop-common-project/hadoop-annotations/target/index.html...>
Generating <https://builds.apache.org/job/Hadoop-Common-trunk/ws/hadoop-common-project/hadoop-annotations/target/overview-summary.html...>
Generating <https://builds.apache.org/job/Hadoop-Common-trunk/ws/hadoop-common-project/hadoop-annotations/target/help-doc.html...>
[INFO] Building jar: <https://builds.apache.org/job/Hadoop-Common-trunk/ws/hadoop-common-project/hadoop-annotations/target/hadoop-annotations-3.0.0-SNAPSHOT-javadoc.jar>
[INFO]                                                                         
[INFO] ------------------------------------------------------------------------
[INFO] Building Apache Hadoop MiniKDC 3.0.0-SNAPSHOT
[INFO] ------------------------------------------------------------------------
[INFO] 
[INFO] --- maven-clean-plugin:2.5:clean (default-clean) @ hadoop-minikdc ---
[INFO] Deleting <https://builds.apache.org/job/Hadoop-Common-trunk/ws/hadoop-common-project/hadoop-minikdc/target>
[INFO] 
[INFO] --- findbugs-maven-plugin:3.0.0:findbugs (default-cli) @ hadoop-minikdc ---
[INFO] 
[INFO] --- maven-checkstyle-plugin:2.15:checkstyle (default-cli) @ hadoop-minikdc ---
[INFO] There are 9 errors reported by Checkstyle 6.6 with checkstyle/checkstyle.xml ruleset.
[WARNING] Unable to locate Source XRef to link to - DISABLED
[INFO] 
[INFO] --- maven-antrun-plugin:1.7:run (create-testdirs) @ hadoop-minikdc ---
[INFO] Executing tasks

main:
    [mkdir] Created dir: <https://builds.apache.org/job/Hadoop-Common-trunk/ws/hadoop-common-project/hadoop-minikdc/target/test-dir>
[INFO] Executed tasks
[INFO] 
[INFO] --- maven-resources-plugin:2.6:resources (default-resources) @ hadoop-minikdc ---
[INFO] Using 'UTF-8' encoding to copy filtered resources.
[INFO] Copying 3 resources
[INFO] 
[INFO] --- maven-compiler-plugin:3.1:compile (default-compile) @ hadoop-minikdc ---
[INFO] Compiling 2 source files to <https://builds.apache.org/job/Hadoop-Common-trunk/ws/hadoop-common-project/hadoop-minikdc/target/classes>
[INFO] 
[INFO] --- maven-resources-plugin:2.6:testResources (default-testResources) @ hadoop-minikdc
---
[INFO] Using 'UTF-8' encoding to copy filtered resources.
[INFO] skip non existing resourceDirectory <https://builds.apache.org/job/Hadoop-Common-trunk/ws/hadoop-common-project/hadoop-minikdc/src/test/resources>
[INFO] 
[INFO] --- maven-compiler-plugin:3.1:testCompile (default-testCompile) @ hadoop-minikdc ---
[INFO] Compiling 2 source files to <https://builds.apache.org/job/Hadoop-Common-trunk/ws/hadoop-common-project/hadoop-minikdc/target/test-classes>
[INFO] 
[INFO] --- maven-surefire-plugin:2.17:test (default-test) @ hadoop-minikdc ---
[INFO] Surefire report directory: <https://builds.apache.org/job/Hadoop-Common-trunk/ws/hadoop-common-project/hadoop-minikdc/target/surefire-reports>

-------------------------------------------------------
 T E S T S
-------------------------------------------------------

-------------------------------------------------------
 T E S T S
-------------------------------------------------------
Running org.apache.hadoop.minikdc.TestChangeOrgNameAndDomain
Tests run: 3, Failures: 0, Errors: 0, Skipped: 0, Time elapsed: 14.288 sec - in org.apache.hadoop.minikdc.TestChangeOrgNameAndDomain
Running org.apache.hadoop.minikdc.TestMiniKdc
Tests run: 3, Failures: 0, Errors: 0, Skipped: 0, Time elapsed: 14.737 sec - in org.apache.hadoop.minikdc.TestMiniKdc

Results :

Tests run: 6, Failures: 0, Errors: 0, Skipped: 0

[INFO] 
[INFO] --- maven-jar-plugin:2.5:jar (default-jar) @ hadoop-minikdc ---
[INFO] Building jar: <https://builds.apache.org/job/Hadoop-Common-trunk/ws/hadoop-common-project/hadoop-minikdc/target/hadoop-minikdc-3.0.0-SNAPSHOT.jar>
[INFO] 
[INFO] --- maven-source-plugin:2.3:jar-no-fork (hadoop-java-sources) @ hadoop-minikdc ---
[INFO] Building jar: <https://builds.apache.org/job/Hadoop-Common-trunk/ws/hadoop-common-project/hadoop-minikdc/target/hadoop-minikdc-3.0.0-SNAPSHOT-sources.jar>
[INFO] 
[INFO] --- maven-source-plugin:2.3:test-jar-no-fork (hadoop-java-sources) @ hadoop-minikdc
---
[INFO] Building jar: <https://builds.apache.org/job/Hadoop-Common-trunk/ws/hadoop-common-project/hadoop-minikdc/target/hadoop-minikdc-3.0.0-SNAPSHOT-test-sources.jar>
[INFO] 
[INFO] --- maven-enforcer-plugin:1.3.1:enforce (dist-enforce) @ hadoop-minikdc ---
[INFO] 
[INFO] --- maven-site-plugin:3.5:attach-descriptor (attach-descriptor) @ hadoop-minikdc ---
[INFO] 
[INFO] --- maven-javadoc-plugin:2.8.1:jar (module-javadocs) @ hadoop-minikdc ---
[INFO] 
Loading source files for package org.apache.hadoop.minikdc...
Constructing Javadoc information...
Standard Doclet version 1.7.0_55
Building tree for all the packages and classes...
Generating <https://builds.apache.org/job/Hadoop-Common-trunk/ws/hadoop-common-project/hadoop-minikdc/target/org/apache/hadoop/minikdc/KerberosSecurityTestcase.html...>
Generating <https://builds.apache.org/job/Hadoop-Common-trunk/ws/hadoop-common-project/hadoop-minikdc/target/org/apache/hadoop/minikdc/MiniKdc.html...>
Generating <https://builds.apache.org/job/Hadoop-Common-trunk/ws/hadoop-common-project/hadoop-minikdc/target/org/apache/hadoop/minikdc/package-frame.html...>
Generating <https://builds.apache.org/job/Hadoop-Common-trunk/ws/hadoop-common-project/hadoop-minikdc/target/org/apache/hadoop/minikdc/package-summary.html...>
Generating <https://builds.apache.org/job/Hadoop-Common-trunk/ws/hadoop-common-project/hadoop-minikdc/target/org/apache/hadoop/minikdc/package-tree.html...>
Generating <https://builds.apache.org/job/Hadoop-Common-trunk/ws/hadoop-common-project/hadoop-minikdc/target/constant-values.html...>
Generating <https://builds.apache.org/job/Hadoop-Common-trunk/ws/hadoop-common-project/hadoop-minikdc/target/org/apache/hadoop/minikdc/class-use/MiniKdc.html...>
Generating <https://builds.apache.org/job/Hadoop-Common-trunk/ws/hadoop-common-project/hadoop-minikdc/target/org/apache/hadoop/minikdc/class-use/KerberosSecurityTestcase.html...>
Generating <https://builds.apache.org/job/Hadoop-Common-trunk/ws/hadoop-common-project/hadoop-minikdc/target/org/apache/hadoop/minikdc/package-use.html...>
Building index for all the packages and classes...
Generating <https://builds.apache.org/job/Hadoop-Common-trunk/ws/hadoop-common-project/hadoop-minikdc/target/overview-tree.html...>
Generating <https://builds.apache.org/job/Hadoop-Common-trunk/ws/hadoop-common-project/hadoop-minikdc/target/index-all.html...>
Generating <https://builds.apache.org/job/Hadoop-Common-trunk/ws/hadoop-common-project/hadoop-minikdc/target/deprecated-list.html...>
Building index for all classes...
Generating <https://builds.apache.org/job/Hadoop-Common-trunk/ws/hadoop-common-project/hadoop-minikdc/target/allclasses-frame.html...>
Generating <https://builds.apache.org/job/Hadoop-Common-trunk/ws/hadoop-common-project/hadoop-minikdc/target/allclasses-noframe.html...>
Generating <https://builds.apache.org/job/Hadoop-Common-trunk/ws/hadoop-common-project/hadoop-minikdc/target/index.html...>
Generating <https://builds.apache.org/job/Hadoop-Common-trunk/ws/hadoop-common-project/hadoop-minikdc/target/help-doc.html...>
2 warnings
[WARNING] Javadoc Warnings
[WARNING] /home/jenkins/.m2/repository/org/apache/directory/api/api-ldap-model/1.0.0-M20/api-ldap-model-1.0.0-M20.jar(org/apache/directory/api/ldap/model/name/Dn.class):
warning: Cannot find annotation method 'value()' in type 'SuppressWarnings': class file for
edu.umd.cs.findbugs.annotations.SuppressWarnings not found
[WARNING] /home/jenkins/.m2/repository/org/apache/directory/api/api-ldap-model/1.0.0-M20/api-ldap-model-1.0.0-M20.jar(org/apache/directory/api/ldap/model/name/Dn.class):
warning: Cannot find annotation method 'justification()' in type 'SuppressWarnings'
[INFO] Building jar: <https://builds.apache.org/job/Hadoop-Common-trunk/ws/hadoop-common-project/hadoop-minikdc/target/hadoop-minikdc-3.0.0-SNAPSHOT-javadoc.jar>
[INFO]                                                                         
[INFO] ------------------------------------------------------------------------
[INFO] Building Apache Hadoop Auth 3.0.0-SNAPSHOT
[INFO] ------------------------------------------------------------------------
[INFO] 
[INFO] --- maven-clean-plugin:2.5:clean (default-clean) @ hadoop-auth ---
[INFO] Deleting <https://builds.apache.org/job/Hadoop-Common-trunk/ws/hadoop-common-project/hadoop-auth/target>
[INFO] 
[INFO] --- findbugs-maven-plugin:3.0.0:findbugs (default-cli) @ hadoop-auth ---
[INFO] 
[INFO] --- maven-checkstyle-plugin:2.15:checkstyle (default-cli) @ hadoop-auth ---
[INFO] There are 236 errors reported by Checkstyle 6.6 with checkstyle/checkstyle.xml ruleset.
[WARNING] Unable to locate Source XRef to link to - DISABLED
[INFO] 
[INFO] --- maven-antrun-plugin:1.7:run (create-testdirs) @ hadoop-auth ---
[INFO] Executing tasks

main:
    [mkdir] Created dir: <https://builds.apache.org/job/Hadoop-Common-trunk/ws/hadoop-common-project/hadoop-auth/target/test-dir>
[INFO] Executed tasks
[INFO] 
[INFO] --- maven-resources-plugin:2.6:resources (default-resources) @ hadoop-auth ---
[INFO] Using 'UTF-8' encoding to copy filtered resources.
[INFO] skip non existing resourceDirectory <https://builds.apache.org/job/Hadoop-Common-trunk/ws/hadoop-common-project/hadoop-auth/src/main/resources>
[INFO] 
[INFO] --- maven-compiler-plugin:3.1:compile (default-compile) @ hadoop-auth ---
[INFO] Compiling 25 source files to <https://builds.apache.org/job/Hadoop-Common-trunk/ws/hadoop-common-project/hadoop-auth/target/classes>
[INFO] 
[INFO] --- maven-resources-plugin:2.6:testResources (default-testResources) @ hadoop-auth
---
[INFO] Using 'UTF-8' encoding to copy filtered resources.
[INFO] skip non existing resourceDirectory <https://builds.apache.org/job/Hadoop-Common-trunk/ws/hadoop-common-project/hadoop-auth/src/test/resources>
[INFO] 
[INFO] --- maven-compiler-plugin:3.1:testCompile (default-testCompile) @ hadoop-auth ---
[INFO] Compiling 24 source files to <https://builds.apache.org/job/Hadoop-Common-trunk/ws/hadoop-common-project/hadoop-auth/target/test-classes>
[INFO] 
[INFO] --- maven-surefire-plugin:2.17:test (default-test) @ hadoop-auth ---
[INFO] Surefire report directory: <https://builds.apache.org/job/Hadoop-Common-trunk/ws/hadoop-common-project/hadoop-auth/target/surefire-reports>

-------------------------------------------------------
 T E S T S
-------------------------------------------------------

-------------------------------------------------------
 T E S T S
-------------------------------------------------------
Running org.apache.hadoop.security.authentication.util.TestZKSignerSecretProvider
Tests run: 3, Failures: 1, Errors: 0, Skipped: 0, Time elapsed: 16.601 sec <<< FAILURE!
- in org.apache.hadoop.security.authentication.util.TestZKSignerSecretProvider
testMultipleInit(org.apache.hadoop.security.authentication.util.TestZKSignerSecretProvider)
 Time elapsed: 3.131 sec  <<< FAILURE!
java.lang.AssertionError: expected null, but was:<[B@6b7d28db>
	at org.junit.Assert.fail(Assert.java:88)
	at org.junit.Assert.failNotNull(Assert.java:664)
	at org.junit.Assert.assertNull(Assert.java:646)
	at org.junit.Assert.assertNull(Assert.java:656)
	at org.apache.hadoop.security.authentication.util.TestZKSignerSecretProvider.testMultipleInit(TestZKSignerSecretProvider.java:149)

Running org.apache.hadoop.security.authentication.util.TestStringSignerSecretProvider
Tests run: 1, Failures: 0, Errors: 0, Skipped: 0, Time elapsed: 0.106 sec - in org.apache.hadoop.security.authentication.util.TestStringSignerSecretProvider
Running org.apache.hadoop.security.authentication.util.TestKerberosName
Tests run: 3, Failures: 0, Errors: 0, Skipped: 0, Time elapsed: 0.356 sec - in org.apache.hadoop.security.authentication.util.TestKerberosName
Running org.apache.hadoop.security.authentication.util.TestCertificateUtil
Tests run: 3, Failures: 0, Errors: 0, Skipped: 0, Time elapsed: 0.177 sec - in org.apache.hadoop.security.authentication.util.TestCertificateUtil
Running org.apache.hadoop.security.authentication.util.TestFileSignerSecretProvider
Tests run: 1, Failures: 0, Errors: 0, Skipped: 0, Time elapsed: 0.112 sec - in org.apache.hadoop.security.authentication.util.TestFileSignerSecretProvider
Running org.apache.hadoop.security.authentication.util.TestRolloverSignerSecretProvider
Tests run: 1, Failures: 0, Errors: 0, Skipped: 0, Time elapsed: 51.281 sec - in org.apache.hadoop.security.authentication.util.TestRolloverSignerSecretProvider
Running org.apache.hadoop.security.authentication.util.TestAuthToken
Tests run: 4, Failures: 0, Errors: 0, Skipped: 0, Time elapsed: 0.271 sec - in org.apache.hadoop.security.authentication.util.TestAuthToken
Running org.apache.hadoop.security.authentication.util.TestSigner
Tests run: 6, Failures: 0, Errors: 0, Skipped: 0, Time elapsed: 0.185 sec - in org.apache.hadoop.security.authentication.util.TestSigner
Running org.apache.hadoop.security.authentication.util.TestRandomSignerSecretProvider
Tests run: 1, Failures: 0, Errors: 0, Skipped: 0, Time elapsed: 51.245 sec - in org.apache.hadoop.security.authentication.util.TestRandomSignerSecretProvider
Running org.apache.hadoop.security.authentication.util.TestJaasConfiguration
Tests run: 1, Failures: 0, Errors: 0, Skipped: 0, Time elapsed: 0.089 sec - in org.apache.hadoop.security.authentication.util.TestJaasConfiguration
Running org.apache.hadoop.security.authentication.util.TestKerberosUtil
Tests run: 5, Failures: 0, Errors: 0, Skipped: 0, Time elapsed: 2.989 sec - in org.apache.hadoop.security.authentication.util.TestKerberosUtil
Running org.apache.hadoop.security.authentication.server.TestAltKerberosAuthenticationHandler
Tests run: 9, Failures: 0, Errors: 0, Skipped: 0, Time elapsed: 27.027 sec - in org.apache.hadoop.security.authentication.server.TestAltKerberosAuthenticationHandler
Running org.apache.hadoop.security.authentication.server.TestPseudoAuthenticationHandler
Tests run: 6, Failures: 0, Errors: 0, Skipped: 0, Time elapsed: 0.458 sec - in org.apache.hadoop.security.authentication.server.TestPseudoAuthenticationHandler
Running org.apache.hadoop.security.authentication.server.TestAuthenticationFilter
Tests run: 26, Failures: 0, Errors: 0, Skipped: 0, Time elapsed: 1.156 sec - in org.apache.hadoop.security.authentication.server.TestAuthenticationFilter
Running org.apache.hadoop.security.authentication.server.TestKerberosAuthenticationHandler
Tests run: 6, Failures: 0, Errors: 0, Skipped: 0, Time elapsed: 25.575 sec - in org.apache.hadoop.security.authentication.server.TestKerberosAuthenticationHandler
Running org.apache.hadoop.security.authentication.server.TestJWTRedirectAuthentictionHandler
Tests run: 12, Failures: 0, Errors: 0, Skipped: 0, Time elapsed: 53.861 sec - in org.apache.hadoop.security.authentication.server.TestJWTRedirectAuthentictionHandler
Running org.apache.hadoop.security.authentication.server.TestAuthenticationToken
Tests run: 1, Failures: 0, Errors: 0, Skipped: 0, Time elapsed: 0.138 sec - in org.apache.hadoop.security.authentication.server.TestAuthenticationToken
Running org.apache.hadoop.security.authentication.client.TestKerberosAuthenticator
Tests run: 14, Failures: 0, Errors: 0, Skipped: 0, Time elapsed: 43.807 sec - in org.apache.hadoop.security.authentication.client.TestKerberosAuthenticator
Running org.apache.hadoop.security.authentication.client.TestPseudoAuthenticator
Tests run: 7, Failures: 0, Errors: 0, Skipped: 0, Time elapsed: 1.519 sec - in org.apache.hadoop.security.authentication.client.TestPseudoAuthenticator
Running org.apache.hadoop.security.authentication.client.TestAuthenticatedURL
Tests run: 6, Failures: 0, Errors: 0, Skipped: 0, Time elapsed: 0.467 sec - in org.apache.hadoop.security.authentication.client.TestAuthenticatedURL

Results :

Failed tests: 
  TestZKSignerSecretProvider.testMultipleInit:149 expected null, but was:<[B@6b7d28db>

Tests run: 116, Failures: 1, Errors: 0, Skipped: 0

[INFO] ------------------------------------------------------------------------
[INFO] Reactor Summary:
[INFO] 
[INFO] Apache Hadoop Annotations ......................... SUCCESS [ 15.065 s]
[INFO] Apache Hadoop MiniKDC ............................. SUCCESS [ 37.379 s]
[INFO] Apache Hadoop Auth ................................ FAILURE [04:52 min]
[INFO] Apache Hadoop Auth Examples ....................... SKIPPED
[INFO] Apache Hadoop Common .............................. SKIPPED
[INFO] Apache Hadoop NFS ................................. SKIPPED
[INFO] Apache Hadoop KMS ................................. SKIPPED
[INFO] Apache Hadoop Common Project ...................... SKIPPED
[INFO] ------------------------------------------------------------------------
[INFO] BUILD FAILURE
[INFO] ------------------------------------------------------------------------
[INFO] Total time: 05:48 min
[INFO] Finished at: 2016-04-08T21:33:37+00:00
[INFO] Final Memory: 62M/1292M
[INFO] ------------------------------------------------------------------------
[ERROR] Failed to execute goal org.apache.maven.plugins:maven-surefire-plugin:2.17:test (default-test)
on project hadoop-auth: There are test failures.
[ERROR] 
[ERROR] Please refer to <https://builds.apache.org/job/Hadoop-Common-trunk/ws/hadoop-common-project/hadoop-auth/target/surefire-reports>
for the individual test results.
[ERROR] -> [Help 1]
[ERROR] 
[ERROR] To see the full stack trace of the errors, re-run Maven with the -e switch.
[ERROR] Re-run Maven using the -X switch to enable full debug logging.
[ERROR] 
[ERROR] For more information about the errors and possible solutions, please read the following
articles:
[ERROR] [Help 1] http://cwiki.apache.org/confluence/display/MAVEN/MojoFailureException
[ERROR] 
[ERROR] After correcting the problems, you can resume the build with the command
[ERROR]   mvn <goals> -rf :hadoop-auth
result: 1

################
# mvn -eaf test -Pclover -DcloverLicenseLocation=/home/jenkins/tools/clover/latest/lib/clover.license
################
Build step 'Execute shell' marked build as failure
Archiving artifacts
Recording test results

Mime
View raw message