hadoop-common-dev mailing list archives

Site index · List index
Message view « Date » · « Thread »
Top « Date » · « Thread »
From Apache Jenkins Server <jenk...@builds.apache.org>
Subject Build failed in Jenkins: Hadoop-Common-trunk #2690
Date Wed, 27 Apr 2016 17:49:22 GMT
See <https://builds.apache.org/job/Hadoop-Common-trunk/2690/changes>

Changes:

[kasha] YARN-4807. MockAM#waitForState sleep duration is too long. (Yufei Gu via

[arp] HADOOP-5470. RunJar.unJar() should write the last modified time found in

------------------------------------------
[...truncated 5135 lines...]
Tests run: 9, Failures: 0, Errors: 0, Skipped: 0, Time elapsed: 2.789 sec - in org.apache.hadoop.conf.TestReconfiguration
Running org.apache.hadoop.conf.TestConfServlet
Tests run: 3, Failures: 0, Errors: 0, Skipped: 0, Time elapsed: 0.658 sec - in org.apache.hadoop.conf.TestConfServlet
Running org.apache.hadoop.conf.TestCommonConfigurationFields
Tests run: 2, Failures: 0, Errors: 0, Skipped: 0, Time elapsed: 0.481 sec - in org.apache.hadoop.conf.TestCommonConfigurationFields
Running org.apache.hadoop.test.TestJUnitSetup
Tests run: 1, Failures: 0, Errors: 0, Skipped: 0, Time elapsed: 0.169 sec - in org.apache.hadoop.test.TestJUnitSetup
Running org.apache.hadoop.test.TestMultithreadedTestUtil
Tests run: 4, Failures: 0, Errors: 0, Skipped: 0, Time elapsed: 3.18 sec - in org.apache.hadoop.test.TestMultithreadedTestUtil
Running org.apache.hadoop.test.TestGenericTestUtils
Tests run: 4, Failures: 0, Errors: 0, Skipped: 0, Time elapsed: 0.183 sec - in org.apache.hadoop.test.TestGenericTestUtils
Running org.apache.hadoop.test.TestTimedOutTestsListener
Tests run: 1, Failures: 0, Errors: 0, Skipped: 0, Time elapsed: 0.216 sec - in org.apache.hadoop.test.TestTimedOutTestsListener
Running org.apache.hadoop.metrics.TestMetricsServlet
Tests run: 3, Failures: 0, Errors: 0, Skipped: 0, Time elapsed: 0.086 sec - in org.apache.hadoop.metrics.TestMetricsServlet
Running org.apache.hadoop.metrics.spi.TestOutputRecord
Tests run: 1, Failures: 0, Errors: 0, Skipped: 0, Time elapsed: 0.053 sec - in org.apache.hadoop.metrics.spi.TestOutputRecord
Running org.apache.hadoop.metrics.ganglia.TestGangliaContext
Tests run: 5, Failures: 0, Errors: 0, Skipped: 0, Time elapsed: 0.189 sec - in org.apache.hadoop.metrics.ganglia.TestGangliaContext
Running org.apache.hadoop.net.TestNetUtils
Tests run: 41, Failures: 0, Errors: 0, Skipped: 0, Time elapsed: 3.787 sec - in org.apache.hadoop.net.TestNetUtils
Running org.apache.hadoop.net.TestDNS
Tests run: 12, Failures: 1, Errors: 0, Skipped: 0, Time elapsed: 0.379 sec <<< FAILURE!
- in org.apache.hadoop.net.TestDNS
testDefaultDnsServer(org.apache.hadoop.net.TestDNS)  Time elapsed: 0.022 sec  <<<
FAILURE!
java.lang.AssertionError: 
Expected: is "asf906.gq1.ygridcore.net"
     but: was "localhost"
	at org.hamcrest.MatcherAssert.assertThat(MatcherAssert.java:20)
	at org.junit.Assert.assertThat(Assert.java:865)
	at org.junit.Assert.assertThat(Assert.java:832)
	at org.apache.hadoop.net.TestDNS.testDefaultDnsServer(TestDNS.java:134)

Running org.apache.hadoop.net.TestSocketIOWithTimeout
Tests run: 1, Failures: 0, Errors: 0, Skipped: 0, Time elapsed: 5.383 sec - in org.apache.hadoop.net.TestSocketIOWithTimeout
Running org.apache.hadoop.net.TestNetworkTopologyWithNodeGroup
Tests run: 9, Failures: 0, Errors: 0, Skipped: 0, Time elapsed: 0.2 sec - in org.apache.hadoop.net.TestNetworkTopologyWithNodeGroup
Running org.apache.hadoop.net.TestClusterTopology
Tests run: 2, Failures: 0, Errors: 0, Skipped: 0, Time elapsed: 0.231 sec - in org.apache.hadoop.net.TestClusterTopology
Running org.apache.hadoop.net.TestScriptBasedMappingWithDependency
Tests run: 4, Failures: 0, Errors: 0, Skipped: 0, Time elapsed: 0.826 sec - in org.apache.hadoop.net.TestScriptBasedMappingWithDependency
Running org.apache.hadoop.net.TestTableMapping
Tests run: 6, Failures: 0, Errors: 0, Skipped: 0, Time elapsed: 0.659 sec - in org.apache.hadoop.net.TestTableMapping
Running org.apache.hadoop.net.TestScriptBasedMapping
Tests run: 4, Failures: 0, Errors: 0, Skipped: 0, Time elapsed: 0.794 sec - in org.apache.hadoop.net.TestScriptBasedMapping
Running org.apache.hadoop.net.unix.TestDomainSocketWatcher
Tests run: 6, Failures: 0, Errors: 0, Skipped: 0, Time elapsed: 0.611 sec - in org.apache.hadoop.net.unix.TestDomainSocketWatcher
Running org.apache.hadoop.net.unix.TestDomainSocket
Tests run: 17, Failures: 0, Errors: 0, Skipped: 0, Time elapsed: 2.913 sec - in org.apache.hadoop.net.unix.TestDomainSocket
Running org.apache.hadoop.net.TestSwitchMapping
Tests run: 5, Failures: 0, Errors: 0, Skipped: 0, Time elapsed: 0.404 sec - in org.apache.hadoop.net.TestSwitchMapping
Running org.apache.hadoop.net.TestStaticMapping
Tests run: 8, Failures: 0, Errors: 0, Skipped: 0, Time elapsed: 0.885 sec - in org.apache.hadoop.net.TestStaticMapping
Running org.apache.hadoop.cli.TestCLI
Tests run: 1, Failures: 0, Errors: 0, Skipped: 0, Time elapsed: 0.663 sec - in org.apache.hadoop.cli.TestCLI
Running org.apache.hadoop.io.TestSortedMapWritable
Tests run: 4, Failures: 0, Errors: 0, Skipped: 0, Time elapsed: 0.209 sec - in org.apache.hadoop.io.TestSortedMapWritable
Running org.apache.hadoop.io.TestIOUtils
Tests run: 12, Failures: 0, Errors: 0, Skipped: 0, Time elapsed: 0.404 sec - in org.apache.hadoop.io.TestIOUtils
Running org.apache.hadoop.io.TestSequenceFile
Tests run: 9, Failures: 0, Errors: 0, Skipped: 0, Time elapsed: 9.564 sec - in org.apache.hadoop.io.TestSequenceFile
Running org.apache.hadoop.io.TestEnumSetWritable
Tests run: 6, Failures: 0, Errors: 0, Skipped: 0, Time elapsed: 0.485 sec - in org.apache.hadoop.io.TestEnumSetWritable
Running org.apache.hadoop.io.TestWritableName
Tests run: 4, Failures: 0, Errors: 0, Skipped: 0, Time elapsed: 0.183 sec - in org.apache.hadoop.io.TestWritableName
Running org.apache.hadoop.io.TestBoundedByteArrayOutputStream
Tests run: 2, Failures: 0, Errors: 0, Skipped: 0, Time elapsed: 0.072 sec - in org.apache.hadoop.io.TestBoundedByteArrayOutputStream
Running org.apache.hadoop.io.TestSequenceFileAppend
Tests run: 4, Failures: 0, Errors: 0, Skipped: 0, Time elapsed: 0.9 sec - in org.apache.hadoop.io.TestSequenceFileAppend
Running org.apache.hadoop.io.TestBytesWritable
Tests run: 6, Failures: 0, Errors: 0, Skipped: 0, Time elapsed: 0.19 sec - in org.apache.hadoop.io.TestBytesWritable
Running org.apache.hadoop.io.TestSequenceFileSerialization
Tests run: 1, Failures: 0, Errors: 0, Skipped: 0, Time elapsed: 0.835 sec - in org.apache.hadoop.io.TestSequenceFileSerialization
Running org.apache.hadoop.io.TestDataByteBuffers
Tests run: 5, Failures: 0, Errors: 0, Skipped: 0, Time elapsed: 0.386 sec - in org.apache.hadoop.io.TestDataByteBuffers
Running org.apache.hadoop.io.file.tfile.TestTFileComparators
Tests run: 3, Failures: 0, Errors: 0, Skipped: 0, Time elapsed: 0.818 sec - in org.apache.hadoop.io.file.tfile.TestTFileComparators
Running org.apache.hadoop.io.file.tfile.TestTFileSeek
Tests run: 1, Failures: 0, Errors: 0, Skipped: 0, Time elapsed: 2.924 sec - in org.apache.hadoop.io.file.tfile.TestTFileSeek
Running org.apache.hadoop.io.file.tfile.TestTFileLzoCodecsByteArrays
Tests run: 25, Failures: 0, Errors: 0, Skipped: 0, Time elapsed: 0.384 sec - in org.apache.hadoop.io.file.tfile.TestTFileLzoCodecsByteArrays
Running org.apache.hadoop.io.file.tfile.TestTFileLzoCodecsStreams
Tests run: 19, Failures: 0, Errors: 0, Skipped: 0, Time elapsed: 0.363 sec - in org.apache.hadoop.io.file.tfile.TestTFileLzoCodecsStreams
Running org.apache.hadoop.io.file.tfile.TestTFileUnsortedByteArrays
Tests run: 4, Failures: 0, Errors: 0, Skipped: 0, Time elapsed: 0.906 sec - in org.apache.hadoop.io.file.tfile.TestTFileUnsortedByteArrays
Running org.apache.hadoop.io.file.tfile.TestTFileStreams
Tests run: 19, Failures: 0, Errors: 0, Skipped: 0, Time elapsed: 1.822 sec - in org.apache.hadoop.io.file.tfile.TestTFileStreams
Running org.apache.hadoop.io.file.tfile.TestTFile
Tests run: 3, Failures: 0, Errors: 0, Skipped: 0, Time elapsed: 1.315 sec - in org.apache.hadoop.io.file.tfile.TestTFile
Running org.apache.hadoop.io.file.tfile.TestTFileNoneCodecsJClassComparatorByteArrays
Tests run: 25, Failures: 0, Errors: 0, Skipped: 0, Time elapsed: 1.409 sec - in org.apache.hadoop.io.file.tfile.TestTFileNoneCodecsJClassComparatorByteArrays
Running org.apache.hadoop.io.file.tfile.TestTFileJClassComparatorByteArrays
Tests run: 25, Failures: 0, Errors: 0, Skipped: 0, Time elapsed: 2.48 sec - in org.apache.hadoop.io.file.tfile.TestTFileJClassComparatorByteArrays
Running org.apache.hadoop.io.file.tfile.TestCompression
Tests run: 1, Failures: 0, Errors: 0, Skipped: 0, Time elapsed: 0.346 sec - in org.apache.hadoop.io.file.tfile.TestCompression
Running org.apache.hadoop.io.file.tfile.TestTFileNoneCodecsStreams
Tests run: 19, Failures: 0, Errors: 0, Skipped: 0, Time elapsed: 1.795 sec - in org.apache.hadoop.io.file.tfile.TestTFileNoneCodecsStreams
Running org.apache.hadoop.io.file.tfile.TestTFileSplit
Tests run: 1, Failures: 0, Errors: 0, Skipped: 0, Time elapsed: 4.239 sec - in org.apache.hadoop.io.file.tfile.TestTFileSplit
Running org.apache.hadoop.io.file.tfile.TestTFileComparator2
Tests run: 1, Failures: 0, Errors: 0, Skipped: 0, Time elapsed: 1.523 sec - in org.apache.hadoop.io.file.tfile.TestTFileComparator2
Running org.apache.hadoop.io.file.tfile.TestTFileNoneCodecsByteArrays
Tests run: 25, Failures: 0, Errors: 0, Skipped: 0, Time elapsed: 1.403 sec - in org.apache.hadoop.io.file.tfile.TestTFileNoneCodecsByteArrays
Running org.apache.hadoop.io.file.tfile.TestTFileByteArrays
Tests run: 25, Failures: 0, Errors: 0, Skipped: 0, Time elapsed: 2.444 sec - in org.apache.hadoop.io.file.tfile.TestTFileByteArrays
Running org.apache.hadoop.io.file.tfile.TestTFileSeqFileComparison
Tests run: 1, Failures: 0, Errors: 0, Skipped: 0, Time elapsed: 3.904 sec - in org.apache.hadoop.io.file.tfile.TestTFileSeqFileComparison
Running org.apache.hadoop.io.file.tfile.TestVLong
Tests run: 9, Failures: 0, Errors: 0, Skipped: 0, Time elapsed: 1.701 sec - in org.apache.hadoop.io.file.tfile.TestVLong
Running org.apache.hadoop.io.TestTextNonUTF8
Tests run: 1, Failures: 0, Errors: 0, Skipped: 0, Time elapsed: 0.182 sec - in org.apache.hadoop.io.TestTextNonUTF8
Running org.apache.hadoop.io.TestArrayWritable
Tests run: 4, Failures: 0, Errors: 0, Skipped: 0, Time elapsed: 0.199 sec - in org.apache.hadoop.io.TestArrayWritable
Running org.apache.hadoop.io.erasurecode.rawcoder.TestXORRawCoder
Tests run: 6, Failures: 0, Errors: 0, Skipped: 0, Time elapsed: 0.285 sec - in org.apache.hadoop.io.erasurecode.rawcoder.TestXORRawCoder
Running org.apache.hadoop.io.erasurecode.rawcoder.TestRSRawCoderLegacy
Tests run: 16, Failures: 0, Errors: 0, Skipped: 0, Time elapsed: 0.469 sec - in org.apache.hadoop.io.erasurecode.rawcoder.TestRSRawCoderLegacy
Running org.apache.hadoop.io.erasurecode.rawcoder.TestDummyRawCoder
Tests run: 3, Failures: 0, Errors: 0, Skipped: 0, Time elapsed: 0.202 sec - in org.apache.hadoop.io.erasurecode.rawcoder.TestDummyRawCoder
Running org.apache.hadoop.io.erasurecode.rawcoder.TestRSRawCoder
Tests run: 16, Failures: 0, Errors: 0, Skipped: 0, Time elapsed: 0.591 sec - in org.apache.hadoop.io.erasurecode.rawcoder.TestRSRawCoder
Running org.apache.hadoop.io.erasurecode.TestECSchema
Tests run: 1, Failures: 0, Errors: 0, Skipped: 0, Time elapsed: 0.079 sec - in org.apache.hadoop.io.erasurecode.TestECSchema
Running org.apache.hadoop.io.erasurecode.TestCodecRawCoderMapping
Tests run: 2, Failures: 0, Errors: 0, Skipped: 0, Time elapsed: 0.62 sec - in org.apache.hadoop.io.erasurecode.TestCodecRawCoderMapping
Running org.apache.hadoop.io.erasurecode.coder.TestHHXORErasureCoder
Tests run: 9, Failures: 0, Errors: 0, Skipped: 0, Time elapsed: 1.566 sec - in org.apache.hadoop.io.erasurecode.coder.TestHHXORErasureCoder
Running org.apache.hadoop.io.erasurecode.coder.TestXORCoder
Tests run: 2, Failures: 0, Errors: 0, Skipped: 0, Time elapsed: 0.596 sec - in org.apache.hadoop.io.erasurecode.coder.TestXORCoder
Running org.apache.hadoop.io.erasurecode.coder.TestRSErasureCoder
Tests run: 10, Failures: 0, Errors: 0, Skipped: 0, Time elapsed: 1.352 sec - in org.apache.hadoop.io.erasurecode.coder.TestRSErasureCoder
Running org.apache.hadoop.io.TestMapWritable
Tests run: 5, Failures: 0, Errors: 0, Skipped: 0, Time elapsed: 0.211 sec - in org.apache.hadoop.io.TestMapWritable
Running org.apache.hadoop.io.TestText
Tests run: 18, Failures: 0, Errors: 0, Skipped: 0, Time elapsed: 0.714 sec - in org.apache.hadoop.io.TestText
Running org.apache.hadoop.io.TestBooleanWritable
Tests run: 2, Failures: 0, Errors: 0, Skipped: 0, Time elapsed: 0.188 sec - in org.apache.hadoop.io.TestBooleanWritable
Running org.apache.hadoop.io.compress.zlib.TestZlibCompressorDecompressor
Tests run: 10, Failures: 0, Errors: 0, Skipped: 0, Time elapsed: 1.093 sec - in org.apache.hadoop.io.compress.zlib.TestZlibCompressorDecompressor
Running org.apache.hadoop.io.compress.TestCompressionStreamReuse
Tests run: 3, Failures: 0, Errors: 0, Skipped: 0, Time elapsed: 4.004 sec - in org.apache.hadoop.io.compress.TestCompressionStreamReuse
Running org.apache.hadoop.io.compress.lz4.TestLz4CompressorDecompressor
Tests run: 13, Failures: 0, Errors: 0, Skipped: 0, Time elapsed: 0.329 sec - in org.apache.hadoop.io.compress.lz4.TestLz4CompressorDecompressor
Running org.apache.hadoop.io.compress.TestCodecFactory
Tests run: 1, Failures: 0, Errors: 0, Skipped: 0, Time elapsed: 0.585 sec - in org.apache.hadoop.io.compress.TestCodecFactory
Running org.apache.hadoop.io.compress.TestCodec
Tests run: 25, Failures: 0, Errors: 0, Skipped: 0, Time elapsed: 129.959 sec - in org.apache.hadoop.io.compress.TestCodec
Running org.apache.hadoop.io.compress.bzip2.TestBzip2CompressorDecompressor
Tests run: 2, Failures: 0, Errors: 0, Skipped: 2, Time elapsed: 0.406 sec - in org.apache.hadoop.io.compress.bzip2.TestBzip2CompressorDecompressor
Running org.apache.hadoop.io.compress.TestCompressorDecompressor
Tests run: 2, Failures: 0, Errors: 0, Skipped: 0, Time elapsed: 0.622 sec - in org.apache.hadoop.io.compress.TestCompressorDecompressor
Running org.apache.hadoop.io.compress.TestCodecPool
Tests run: 6, Failures: 0, Errors: 0, Skipped: 0, Time elapsed: 0.432 sec - in org.apache.hadoop.io.compress.TestCodecPool
Running org.apache.hadoop.io.compress.snappy.TestSnappyCompressorDecompressor
Tests run: 14, Failures: 0, Errors: 0, Skipped: 0, Time elapsed: 0.397 sec - in org.apache.hadoop.io.compress.snappy.TestSnappyCompressorDecompressor
Running org.apache.hadoop.io.compress.TestBlockDecompressorStream
Tests run: 2, Failures: 0, Errors: 0, Skipped: 0, Time elapsed: 0.076 sec - in org.apache.hadoop.io.compress.TestBlockDecompressorStream
Running org.apache.hadoop.io.compress.TestCompressorStream
Tests run: 1, Failures: 0, Errors: 0, Skipped: 0, Time elapsed: 0.079 sec - in org.apache.hadoop.io.compress.TestCompressorStream
Running org.apache.hadoop.io.TestMD5Hash
Tests run: 2, Failures: 0, Errors: 0, Skipped: 0, Time elapsed: 0.205 sec - in org.apache.hadoop.io.TestMD5Hash
Running org.apache.hadoop.io.TestSecureIOUtils
Tests run: 4, Failures: 0, Errors: 0, Skipped: 0, Time elapsed: 0.772 sec - in org.apache.hadoop.io.TestSecureIOUtils
Running org.apache.hadoop.io.TestMapFile
Tests run: 21, Failures: 0, Errors: 0, Skipped: 0, Time elapsed: 1.425 sec - in org.apache.hadoop.io.TestMapFile
Running org.apache.hadoop.io.TestGenericWritable
Tests run: 5, Failures: 0, Errors: 0, Skipped: 0, Time elapsed: 0.548 sec - in org.apache.hadoop.io.TestGenericWritable
Running org.apache.hadoop.io.nativeio.TestNativeIO
Tests run: 20, Failures: 0, Errors: 0, Skipped: 0, Time elapsed: 7.016 sec - in org.apache.hadoop.io.nativeio.TestNativeIO
Running org.apache.hadoop.io.nativeio.TestSharedFileDescriptorFactory
Tests run: 3, Failures: 0, Errors: 0, Skipped: 0, Time elapsed: 0.393 sec - in org.apache.hadoop.io.nativeio.TestSharedFileDescriptorFactory
Running org.apache.hadoop.io.TestDefaultStringifier
Tests run: 4, Failures: 0, Errors: 0, Skipped: 0, Time elapsed: 0.404 sec - in org.apache.hadoop.io.TestDefaultStringifier
Running org.apache.hadoop.io.TestArrayPrimitiveWritable
Tests run: 3, Failures: 0, Errors: 0, Skipped: 0, Time elapsed: 0.193 sec - in org.apache.hadoop.io.TestArrayPrimitiveWritable
Running org.apache.hadoop.io.TestUTF8
Tests run: 8, Failures: 0, Errors: 0, Skipped: 0, Time elapsed: 0.771 sec - in org.apache.hadoop.io.TestUTF8
Running org.apache.hadoop.io.TestBloomMapFile
Tests run: 7, Failures: 0, Errors: 0, Skipped: 0, Time elapsed: 1.572 sec - in org.apache.hadoop.io.TestBloomMapFile
Running org.apache.hadoop.io.retry.TestRetryProxy
Tests run: 12, Failures: 0, Errors: 0, Skipped: 0, Time elapsed: 1.488 sec - in org.apache.hadoop.io.retry.TestRetryProxy
Running org.apache.hadoop.io.retry.TestDefaultRetryPolicy
Tests run: 3, Failures: 0, Errors: 0, Skipped: 0, Time elapsed: 0.468 sec - in org.apache.hadoop.io.retry.TestDefaultRetryPolicy
Running org.apache.hadoop.io.retry.TestFailoverProxy
Tests run: 9, Failures: 0, Errors: 0, Skipped: 0, Time elapsed: 12.849 sec - in org.apache.hadoop.io.retry.TestFailoverProxy
Running org.apache.hadoop.io.TestVersionedWritable
Tests run: 3, Failures: 0, Errors: 0, Skipped: 0, Time elapsed: 0.174 sec - in org.apache.hadoop.io.TestVersionedWritable
Running org.apache.hadoop.io.TestObjectWritableProtos
Tests run: 3, Failures: 0, Errors: 0, Skipped: 0, Time elapsed: 0.309 sec - in org.apache.hadoop.io.TestObjectWritableProtos
Running org.apache.hadoop.io.TestSequenceFileSync
Tests run: 1, Failures: 0, Errors: 0, Skipped: 0, Time elapsed: 1.001 sec - in org.apache.hadoop.io.TestSequenceFileSync
Running org.apache.hadoop.io.serializer.TestSerializationFactory
Tests run: 5, Failures: 0, Errors: 0, Skipped: 0, Time elapsed: 0.539 sec - in org.apache.hadoop.io.serializer.TestSerializationFactory
Running org.apache.hadoop.io.serializer.avro.TestAvroSerialization
Tests run: 5, Failures: 0, Errors: 0, Skipped: 0, Time elapsed: 0.65 sec - in org.apache.hadoop.io.serializer.avro.TestAvroSerialization
Running org.apache.hadoop.io.serializer.TestWritableSerialization
Tests run: 3, Failures: 0, Errors: 0, Skipped: 0, Time elapsed: 0.393 sec - in org.apache.hadoop.io.serializer.TestWritableSerialization
Running org.apache.hadoop.io.TestWritable
Tests run: 6, Failures: 0, Errors: 0, Skipped: 0, Time elapsed: 0.337 sec - in org.apache.hadoop.io.TestWritable
Running org.apache.hadoop.io.TestWritableUtils
Tests run: 1, Failures: 0, Errors: 0, Skipped: 0, Time elapsed: 0.165 sec - in org.apache.hadoop.io.TestWritableUtils
Running org.apache.hadoop.io.TestArrayFile
Tests run: 3, Failures: 0, Errors: 0, Skipped: 0, Time elapsed: 2.915 sec - in org.apache.hadoop.io.TestArrayFile
Running org.apache.hadoop.io.TestSetFile
Tests run: 2, Failures: 0, Errors: 0, Skipped: 0, Time elapsed: 2.061 sec - in org.apache.hadoop.io.TestSetFile

Results :

Failed tests: 
  TestDNS.testDefaultDnsServer:134 
Expected: is "asf906.gq1.ygridcore.net"
     but: was "localhost"

Tests run: 3369, Failures: 1, Errors: 0, Skipped: 86

[INFO] ------------------------------------------------------------------------
[INFO] Reactor Summary:
[INFO] 
[INFO] Apache Hadoop Annotations ......................... SUCCESS [  7.846 s]
[INFO] Apache Hadoop MiniKDC ............................. SUCCESS [ 21.248 s]
[INFO] Apache Hadoop Auth ................................ SUCCESS [03:58 min]
[INFO] Apache Hadoop Auth Examples ....................... SUCCESS [  3.508 s]
[INFO] Apache Hadoop Common .............................. FAILURE [24:03 min]
[INFO] Apache Hadoop NFS ................................. SKIPPED
[INFO] Apache Hadoop KMS ................................. SKIPPED
[INFO] Apache Hadoop Common Project ...................... SKIPPED
[INFO] ------------------------------------------------------------------------
[INFO] BUILD FAILURE
[INFO] ------------------------------------------------------------------------
[INFO] Total time: 28:36 min
[INFO] Finished at: 2016-04-27T17:49:19+00:00
[INFO] Final Memory: 82M/953M
[INFO] ------------------------------------------------------------------------
[ERROR] Failed to execute goal org.apache.maven.plugins:maven-surefire-plugin:2.17:test (default-test)
on project hadoop-common: There are test failures.
[ERROR] 
[ERROR] Please refer to <https://builds.apache.org/job/Hadoop-Common-trunk/ws/hadoop-common-project/hadoop-common/target/surefire-reports>
for the individual test results.
[ERROR] -> [Help 1]
[ERROR] 
[ERROR] To see the full stack trace of the errors, re-run Maven with the -e switch.
[ERROR] Re-run Maven using the -X switch to enable full debug logging.
[ERROR] 
[ERROR] For more information about the errors and possible solutions, please read the following
articles:
[ERROR] [Help 1] http://cwiki.apache.org/confluence/display/MAVEN/MojoFailureException
[ERROR] 
[ERROR] After correcting the problems, you can resume the build with the command
[ERROR]   mvn <goals> -rf :hadoop-common
result: 1
Build step 'Execute shell' marked build as failure
Archiving artifacts
Recording test results

Mime
View raw message