hadoop-common-dev mailing list archives

Site index · List index
Message view « Date » · « Thread »
Top « Date » · « Thread »
From Apache Jenkins Server <jenk...@builds.apache.org>
Subject Build failed in Jenkins: Hadoop-Common-trunk #2503
Date Tue, 15 Mar 2016 05:11:27 GMT
See <https://builds.apache.org/job/Hadoop-Common-trunk/2503/changes>

Changes:

[sseth] YARN-4816. Fix incompatible change in SystemClock.

------------------------------------------
[...truncated 5124 lines...]
Running org.apache.hadoop.ipc.TestRetryCacheMetrics
Tests run: 1, Failures: 0, Errors: 0, Skipped: 0, Time elapsed: 0.45 sec - in org.apache.hadoop.ipc.TestRetryCacheMetrics
Running org.apache.hadoop.ipc.TestMiniRPCBenchmark
Tests run: 1, Failures: 0, Errors: 0, Skipped: 0, Time elapsed: 1.11 sec - in org.apache.hadoop.ipc.TestMiniRPCBenchmark
Running org.apache.hadoop.ipc.TestIPC
Tests run: 34, Failures: 0, Errors: 0, Skipped: 0, Time elapsed: 92.324 sec - in org.apache.hadoop.ipc.TestIPC
Running org.apache.hadoop.ipc.TestDecayRpcScheduler
Tests run: 9, Failures: 0, Errors: 0, Skipped: 0, Time elapsed: 1.183 sec - in org.apache.hadoop.ipc.TestDecayRpcScheduler
Running org.apache.hadoop.ipc.TestFairCallQueue
Tests run: 22, Failures: 0, Errors: 0, Skipped: 0, Time elapsed: 1.407 sec - in org.apache.hadoop.ipc.TestFairCallQueue
Running org.apache.hadoop.ipc.TestServer
Tests run: 7, Failures: 0, Errors: 0, Skipped: 0, Time elapsed: 1.037 sec - in org.apache.hadoop.ipc.TestServer
Running org.apache.hadoop.ipc.TestRPC
Tests run: 20, Failures: 0, Errors: 0, Skipped: 0, Time elapsed: 17.55 sec - in org.apache.hadoop.ipc.TestRPC
Running org.apache.hadoop.ipc.TestProtoBufRPCCompatibility
Tests run: 1, Failures: 0, Errors: 0, Skipped: 0, Time elapsed: 1.085 sec - in org.apache.hadoop.ipc.TestProtoBufRPCCompatibility
Running org.apache.hadoop.ipc.TestSaslRPC
Tests run: 90, Failures: 0, Errors: 0, Skipped: 0, Time elapsed: 31.781 sec - in org.apache.hadoop.ipc.TestSaslRPC
Running org.apache.hadoop.ipc.TestRetryCache
Tests run: 6, Failures: 0, Errors: 0, Skipped: 0, Time elapsed: 1.413 sec - in org.apache.hadoop.ipc.TestRetryCache
Running org.apache.hadoop.security.token.delegation.web.TestDelegationTokenAuthenticationHandlerWithMocks
Tests run: 2, Failures: 0, Errors: 0, Skipped: 0, Time elapsed: 1.622 sec - in org.apache.hadoop.security.token.delegation.web.TestDelegationTokenAuthenticationHandlerWithMocks
Running org.apache.hadoop.security.token.delegation.web.TestDelegationTokenManager
Tests run: 2, Failures: 0, Errors: 0, Skipped: 0, Time elapsed: 1.025 sec - in org.apache.hadoop.security.token.delegation.web.TestDelegationTokenManager
Running org.apache.hadoop.security.token.delegation.web.TestWebDelegationToken
Tests run: 12, Failures: 0, Errors: 0, Skipped: 0, Time elapsed: 10.458 sec - in org.apache.hadoop.security.token.delegation.web.TestWebDelegationToken
Running org.apache.hadoop.security.token.delegation.TestDelegationToken
Tests run: 15, Failures: 0, Errors: 0, Skipped: 0, Time elapsed: 30.815 sec - in org.apache.hadoop.security.token.delegation.TestDelegationToken
Running org.apache.hadoop.security.token.delegation.TestZKDelegationTokenSecretManager
Tests run: 6, Failures: 0, Errors: 0, Skipped: 0, Time elapsed: 48.848 sec - in org.apache.hadoop.security.token.delegation.TestZKDelegationTokenSecretManager
Running org.apache.hadoop.security.token.TestToken
Tests run: 3, Failures: 0, Errors: 0, Skipped: 0, Time elapsed: 0.487 sec - in org.apache.hadoop.security.token.TestToken
Running org.apache.hadoop.security.TestWhitelistBasedResolver
Tests run: 3, Failures: 0, Errors: 0, Skipped: 0, Time elapsed: 0.574 sec - in org.apache.hadoop.security.TestWhitelistBasedResolver
Running org.apache.hadoop.security.TestAuthenticationFilter
Tests run: 1, Failures: 0, Errors: 0, Skipped: 0, Time elapsed: 0.659 sec - in org.apache.hadoop.security.TestAuthenticationFilter
Running org.apache.hadoop.security.TestGroupFallback
Tests run: 4, Failures: 0, Errors: 0, Skipped: 0, Time elapsed: 0.682 sec - in org.apache.hadoop.security.TestGroupFallback
Running org.apache.hadoop.security.TestProxyUserFromEnv
Tests run: 1, Failures: 0, Errors: 0, Skipped: 0, Time elapsed: 0.669 sec - in org.apache.hadoop.security.TestProxyUserFromEnv
Running org.apache.hadoop.security.TestUGILoginFromKeytab
Tests run: 1, Failures: 0, Errors: 0, Skipped: 0, Time elapsed: 5.418 sec - in org.apache.hadoop.security.TestUGILoginFromKeytab
Running org.apache.hadoop.security.TestLdapGroupsMappingWithPosixGroup
Tests run: 1, Failures: 0, Errors: 0, Skipped: 0, Time elapsed: 0.645 sec - in org.apache.hadoop.security.TestLdapGroupsMappingWithPosixGroup
Running org.apache.hadoop.security.TestKDiag
Tests run: 11, Failures: 0, Errors: 0, Skipped: 0, Time elapsed: 5.993 sec - in org.apache.hadoop.security.TestKDiag
Running org.apache.hadoop.security.TestShellBasedIdMapping
Tests run: 7, Failures: 0, Errors: 0, Skipped: 0, Time elapsed: 2.67 sec - in org.apache.hadoop.security.TestShellBasedIdMapping
Running org.apache.hadoop.security.TestNullGroupsMapping
Tests run: 1, Failures: 0, Errors: 0, Skipped: 0, Time elapsed: 0.074 sec - in org.apache.hadoop.security.TestNullGroupsMapping
Running org.apache.hadoop.security.TestDoAsEffectiveUser
Tests run: 9, Failures: 0, Errors: 0, Skipped: 0, Time elapsed: 1.602 sec - in org.apache.hadoop.security.TestDoAsEffectiveUser
Running org.apache.hadoop.security.TestUGIWithExternalKdc
Tests run: 1, Failures: 0, Errors: 0, Skipped: 1, Time elapsed: 0.08 sec - in org.apache.hadoop.security.TestUGIWithExternalKdc
Running org.apache.hadoop.security.TestJNIGroupsMapping
Tests run: 1, Failures: 0, Errors: 0, Skipped: 0, Time elapsed: 0.677 sec - in org.apache.hadoop.security.TestJNIGroupsMapping
Running org.apache.hadoop.security.TestGroupsCaching
Tests run: 10, Failures: 0, Errors: 0, Skipped: 0, Time elapsed: 1.855 sec - in org.apache.hadoop.security.TestGroupsCaching
Running org.apache.hadoop.security.alias.TestCredentialProviderFactory
Tests run: 6, Failures: 0, Errors: 0, Skipped: 0, Time elapsed: 1.393 sec - in org.apache.hadoop.security.alias.TestCredentialProviderFactory
Running org.apache.hadoop.security.alias.TestCredentialProvider
Tests run: 2, Failures: 0, Errors: 0, Skipped: 0, Time elapsed: 0.178 sec - in org.apache.hadoop.security.alias.TestCredentialProvider
Running org.apache.hadoop.security.alias.TestCredShell
Tests run: 9, Failures: 0, Errors: 0, Skipped: 0, Time elapsed: 1.266 sec - in org.apache.hadoop.security.alias.TestCredShell
Running org.apache.hadoop.security.ssl.TestReloadingX509TrustManager
Tests run: 5, Failures: 0, Errors: 0, Skipped: 0, Time elapsed: 2.519 sec - in org.apache.hadoop.security.ssl.TestReloadingX509TrustManager
Running org.apache.hadoop.security.ssl.TestSSLFactory
Tests run: 15, Failures: 0, Errors: 0, Skipped: 0, Time elapsed: 3.803 sec - in org.apache.hadoop.security.ssl.TestSSLFactory
Running org.apache.hadoop.security.TestLdapGroupsMapping
Tests run: 5, Failures: 0, Errors: 0, Skipped: 0, Time elapsed: 1.56 sec - in org.apache.hadoop.security.TestLdapGroupsMapping
Running org.apache.hadoop.security.TestUserFromEnv
Tests run: 1, Failures: 0, Errors: 0, Skipped: 0, Time elapsed: 0.699 sec - in org.apache.hadoop.security.TestUserFromEnv
Running org.apache.hadoop.security.TestHttpCrossOriginFilterInitializer
Tests run: 1, Failures: 0, Errors: 0, Skipped: 0, Time elapsed: 0.382 sec - in org.apache.hadoop.security.TestHttpCrossOriginFilterInitializer
Running org.apache.hadoop.security.http.TestRestCsrfPreventionFilter
Tests run: 10, Failures: 0, Errors: 0, Skipped: 0, Time elapsed: 0.449 sec - in org.apache.hadoop.security.http.TestRestCsrfPreventionFilter
Running org.apache.hadoop.security.http.TestCrossOriginFilter
Tests run: 9, Failures: 0, Errors: 0, Skipped: 0, Time elapsed: 0.436 sec - in org.apache.hadoop.security.http.TestCrossOriginFilter
Running org.apache.hadoop.security.TestKDiagNoKDC
Tests run: 4, Failures: 0, Errors: 0, Skipped: 0, Time elapsed: 0.971 sec - in org.apache.hadoop.security.TestKDiagNoKDC
Running org.apache.hadoop.security.TestShellBasedUnixGroupsMapping
Tests run: 4, Failures: 0, Errors: 0, Skipped: 0, Time elapsed: 0.388 sec - in org.apache.hadoop.security.TestShellBasedUnixGroupsMapping
Running org.apache.hadoop.security.TestCredentials
Tests run: 4, Failures: 0, Errors: 0, Skipped: 0, Time elapsed: 0.605 sec - in org.apache.hadoop.security.TestCredentials
Running org.apache.hadoop.security.TestNetgroupCache
Tests run: 3, Failures: 0, Errors: 0, Skipped: 0, Time elapsed: 0.082 sec - in org.apache.hadoop.security.TestNetgroupCache
Running org.apache.hadoop.security.TestUGIWithSecurityOn
Tests run: 2, Failures: 0, Errors: 0, Skipped: 2, Time elapsed: 0.083 sec - in org.apache.hadoop.security.TestUGIWithSecurityOn
Running org.apache.hadoop.security.authorize.TestAccessControlList
Tests run: 8, Failures: 0, Errors: 0, Skipped: 0, Time elapsed: 0.919 sec - in org.apache.hadoop.security.authorize.TestAccessControlList
Running org.apache.hadoop.security.authorize.TestProxyUsers
Tests run: 17, Failures: 0, Errors: 0, Skipped: 0, Time elapsed: 0.984 sec - in org.apache.hadoop.security.authorize.TestProxyUsers
Running org.apache.hadoop.security.authorize.TestProxyServers
Tests run: 1, Failures: 0, Errors: 0, Skipped: 0, Time elapsed: 0.444 sec - in org.apache.hadoop.security.authorize.TestProxyServers
Running org.apache.hadoop.security.authorize.TestServiceAuthorization
Tests run: 7, Failures: 0, Errors: 0, Skipped: 0, Time elapsed: 1.162 sec - in org.apache.hadoop.security.authorize.TestServiceAuthorization
Running org.apache.hadoop.security.TestCompositeGroupMapping
Tests run: 3, Failures: 0, Errors: 0, Skipped: 0, Time elapsed: 0.755 sec - in org.apache.hadoop.security.TestCompositeGroupMapping
Running org.apache.hadoop.security.TestSecurityUtil
Tests run: 17, Failures: 0, Errors: 0, Skipped: 0, Time elapsed: 0.928 sec - in org.apache.hadoop.security.TestSecurityUtil
Running org.apache.hadoop.security.TestUserGroupInformation
Tests run: 35, Failures: 0, Errors: 0, Skipped: 0, Time elapsed: 3.792 sec - in org.apache.hadoop.security.TestUserGroupInformation
Running org.apache.hadoop.tracing.TestTraceUtils
Tests run: 3, Failures: 0, Errors: 0, Skipped: 0, Time elapsed: 0.545 sec - in org.apache.hadoop.tracing.TestTraceUtils
Running org.apache.hadoop.http.lib.TestStaticUserWebFilter
Tests run: 3, Failures: 0, Errors: 0, Skipped: 0, Time elapsed: 0.607 sec - in org.apache.hadoop.http.lib.TestStaticUserWebFilter
Running org.apache.hadoop.http.TestServletFilter
Tests run: 3, Failures: 0, Errors: 0, Skipped: 0, Time elapsed: 1.458 sec - in org.apache.hadoop.http.TestServletFilter
Running org.apache.hadoop.http.TestHttpRequestLogAppender
Tests run: 1, Failures: 0, Errors: 0, Skipped: 0, Time elapsed: 0.082 sec - in org.apache.hadoop.http.TestHttpRequestLogAppender
Running org.apache.hadoop.http.TestHtmlQuoting
Tests run: 4, Failures: 0, Errors: 0, Skipped: 0, Time elapsed: 0.288 sec - in org.apache.hadoop.http.TestHtmlQuoting
Running org.apache.hadoop.http.TestPathFilter
Tests run: 1, Failures: 0, Errors: 0, Skipped: 0, Time elapsed: 0.972 sec - in org.apache.hadoop.http.TestPathFilter
Running org.apache.hadoop.http.TestGlobalFilter
Tests run: 1, Failures: 0, Errors: 0, Skipped: 0, Time elapsed: 1.009 sec - in org.apache.hadoop.http.TestGlobalFilter
Running org.apache.hadoop.http.TestHttpServerLifecycle
Tests run: 7, Failures: 0, Errors: 0, Skipped: 0, Time elapsed: 1.532 sec - in org.apache.hadoop.http.TestHttpServerLifecycle
Running org.apache.hadoop.http.TestAuthenticationSessionCookie
Tests run: 2, Failures: 0, Errors: 0, Skipped: 0, Time elapsed: 1.934 sec - in org.apache.hadoop.http.TestAuthenticationSessionCookie
Running org.apache.hadoop.http.TestHttpServerLogs
Tests run: 2, Failures: 0, Errors: 0, Skipped: 0, Time elapsed: 1.018 sec - in org.apache.hadoop.http.TestHttpServerLogs
Running org.apache.hadoop.http.TestHttpRequestLog
Tests run: 2, Failures: 0, Errors: 0, Skipped: 0, Time elapsed: 0.174 sec - in org.apache.hadoop.http.TestHttpRequestLog
Running org.apache.hadoop.http.TestHttpServerWebapps
Tests run: 2, Failures: 0, Errors: 0, Skipped: 0, Time elapsed: 0.693 sec - in org.apache.hadoop.http.TestHttpServerWebapps
Running org.apache.hadoop.http.TestHttpCookieFlag
Tests run: 2, Failures: 0, Errors: 0, Skipped: 0, Time elapsed: 1.86 sec - in org.apache.hadoop.http.TestHttpCookieFlag
Running org.apache.hadoop.http.TestHttpServer
Tests run: 14, Failures: 0, Errors: 0, Skipped: 0, Time elapsed: 3.542 sec - in org.apache.hadoop.http.TestHttpServer
Running org.apache.hadoop.http.TestSSLHttpServer
Tests run: 5, Failures: 0, Errors: 0, Skipped: 0, Time elapsed: 1.925 sec - in org.apache.hadoop.http.TestSSLHttpServer
Running org.apache.hadoop.metrics.spi.TestOutputRecord
Tests run: 1, Failures: 0, Errors: 0, Skipped: 0, Time elapsed: 0.053 sec - in org.apache.hadoop.metrics.spi.TestOutputRecord
Running org.apache.hadoop.metrics.ganglia.TestGangliaContext
Tests run: 5, Failures: 0, Errors: 0, Skipped: 0, Time elapsed: 0.203 sec - in org.apache.hadoop.metrics.ganglia.TestGangliaContext
Running org.apache.hadoop.metrics.TestMetricsServlet
Tests run: 3, Failures: 0, Errors: 0, Skipped: 0, Time elapsed: 0.087 sec - in org.apache.hadoop.metrics.TestMetricsServlet
Running org.apache.hadoop.net.TestSocketIOWithTimeout
Tests run: 1, Failures: 0, Errors: 0, Skipped: 0, Time elapsed: 5.39 sec - in org.apache.hadoop.net.TestSocketIOWithTimeout
Running org.apache.hadoop.net.TestSwitchMapping
Tests run: 5, Failures: 0, Errors: 0, Skipped: 0, Time elapsed: 0.409 sec - in org.apache.hadoop.net.TestSwitchMapping
Running org.apache.hadoop.net.TestStaticMapping
Tests run: 8, Failures: 0, Errors: 0, Skipped: 0, Time elapsed: 0.744 sec - in org.apache.hadoop.net.TestStaticMapping
Running org.apache.hadoop.net.TestNetUtils
Tests run: 40, Failures: 0, Errors: 0, Skipped: 0, Time elapsed: 3.77 sec - in org.apache.hadoop.net.TestNetUtils
Running org.apache.hadoop.net.TestClusterTopology
Tests run: 2, Failures: 0, Errors: 0, Skipped: 0, Time elapsed: 0.231 sec - in org.apache.hadoop.net.TestClusterTopology
Running org.apache.hadoop.net.TestDNS
Tests run: 12, Failures: 0, Errors: 0, Skipped: 0, Time elapsed: 0.342 sec - in org.apache.hadoop.net.TestDNS
Running org.apache.hadoop.net.unix.TestDomainSocket
Tests run: 17, Failures: 0, Errors: 0, Skipped: 0, Time elapsed: 2.93 sec - in org.apache.hadoop.net.unix.TestDomainSocket
Running org.apache.hadoop.net.unix.TestDomainSocketWatcher
Tests run: 6, Failures: 0, Errors: 0, Skipped: 0, Time elapsed: 0.636 sec - in org.apache.hadoop.net.unix.TestDomainSocketWatcher
Running org.apache.hadoop.net.TestScriptBasedMapping
Tests run: 4, Failures: 0, Errors: 0, Skipped: 0, Time elapsed: 0.724 sec - in org.apache.hadoop.net.TestScriptBasedMapping
Running org.apache.hadoop.net.TestTableMapping
Tests run: 6, Failures: 0, Errors: 0, Skipped: 0, Time elapsed: 0.654 sec - in org.apache.hadoop.net.TestTableMapping
Running org.apache.hadoop.net.TestNetworkTopologyWithNodeGroup
Tests run: 9, Failures: 0, Errors: 0, Skipped: 0, Time elapsed: 0.201 sec - in org.apache.hadoop.net.TestNetworkTopologyWithNodeGroup
Running org.apache.hadoop.net.TestScriptBasedMappingWithDependency
Tests run: 4, Failures: 0, Errors: 0, Skipped: 0, Time elapsed: 0.536 sec - in org.apache.hadoop.net.TestScriptBasedMappingWithDependency
Running org.apache.hadoop.cli.TestCLI
Tests run: 1, Failures: 0, Errors: 0, Skipped: 0, Time elapsed: 0.661 sec - in org.apache.hadoop.cli.TestCLI
Running org.apache.hadoop.service.TestServiceLifecycle
Tests run: 18, Failures: 0, Errors: 0, Skipped: 0, Time elapsed: 2.387 sec - in org.apache.hadoop.service.TestServiceLifecycle
Running org.apache.hadoop.service.TestCompositeService
Tests run: 42, Failures: 0, Errors: 0, Skipped: 0, Time elapsed: 0.305 sec - in org.apache.hadoop.service.TestCompositeService
Running org.apache.hadoop.service.TestGlobalStateChangeListener
Tests run: 5, Failures: 0, Errors: 0, Skipped: 0, Time elapsed: 0.211 sec - in org.apache.hadoop.service.TestGlobalStateChangeListener

Results :

Tests run: 3324, Failures: 0, Errors: 0, Skipped: 86

[INFO] 
[INFO] --- maven-antrun-plugin:1.7:run (common-test-bats-driver) @ hadoop-common ---
[INFO] Executing tasks

main:
     [exec] 
     [exec] 
     [exec] ERROR: bats not installed. Skipping bash tests.
     [exec] ERROR: Please install bats as soon as possible.
     [exec] 
     [exec] 
[INFO] Executed tasks
[INFO] 
[INFO] --- hadoop-maven-plugins:3.0.0-SNAPSHOT:cmake-test (test_bulk_crc32) @ hadoop-common
---
[INFO] -------------------------------------------------------
[INFO]  C M A K E B U I L D E R    T E S T
[INFO] -------------------------------------------------------
[INFO] test_bulk_crc32: running <https://builds.apache.org/job/Hadoop-Common-trunk/ws/hadoop-common-project/hadoop-common/target/native/test_bulk_crc32>
[INFO] with extra environment variables {}
[INFO] ------------------------------------------------------------------------
[INFO] Reactor Summary:
[INFO] 
[INFO] Apache Hadoop Annotations ......................... SUCCESS [  8.188 s]
[INFO] Apache Hadoop MiniKDC ............................. SUCCESS [ 21.478 s]
[INFO] Apache Hadoop Auth ................................ SUCCESS [03:54 min]
[INFO] Apache Hadoop Auth Examples ....................... SUCCESS [  3.653 s]
[INFO] Apache Hadoop Common .............................. FAILURE [24:01 min]
[INFO] Apache Hadoop NFS ................................. SKIPPED
[INFO] Apache Hadoop KMS ................................. SKIPPED
[INFO] Apache Hadoop Common Project ...................... SKIPPED
[INFO] ------------------------------------------------------------------------
[INFO] BUILD FAILURE
[INFO] ------------------------------------------------------------------------
[INFO] Total time: 28:30 min
[INFO] Finished at: 2016-03-15T05:11:18+00:00
[INFO] Final Memory: 82M/857M
[INFO] ------------------------------------------------------------------------
[ERROR] Failed to execute goal org.apache.hadoop:hadoop-maven-plugins:3.0.0-SNAPSHOT:cmake-test
(test_bulk_crc32) on project hadoop-common: Execution test_bulk_crc32 of goal org.apache.hadoop:hadoop-maven-plugins:3.0.0-SNAPSHOT:cmake-test
failed: A required class was missing while executing org.apache.hadoop:hadoop-maven-plugins:3.0.0-SNAPSHOT:cmake-test:
org/apache/hadoop/maven/plugin/cmakebuilder/TestMojo$TestThread
[ERROR] -----------------------------------------------------
[ERROR] realm =    plugin>org.apache.hadoop:hadoop-maven-plugins:3.0.0-SNAPSHOT
[ERROR] strategy = org.codehaus.plexus.classworlds.strategy.SelfFirstStrategy
[ERROR] urls[0] = file:/home/jenkins/.m2/repository/org/apache/hadoop/hadoop-maven-plugins/3.0.0-SNAPSHOT/hadoop-maven-plugins-3.0.0-SNAPSHOT.jar
[ERROR] urls[1] = file:/home/jenkins/.m2/repository/org/sonatype/sisu/sisu-inject-bean/1.4.2/sisu-inject-bean-1.4.2.jar
[ERROR] urls[2] = file:/home/jenkins/.m2/repository/org/sonatype/sisu/sisu-guice/2.1.7/sisu-guice-2.1.7-noaop.jar
[ERROR] urls[3] = file:/home/jenkins/.m2/repository/org/sonatype/aether/aether-util/1.7/aether-util-1.7.jar
[ERROR] urls[4] = file:/home/jenkins/.m2/repository/org/codehaus/plexus/plexus-interpolation/1.14/plexus-interpolation-1.14.jar
[ERROR] urls[5] = file:/home/jenkins/.m2/repository/org/codehaus/plexus/plexus-utils/2.0.5/plexus-utils-2.0.5.jar
[ERROR] urls[6] = file:/home/jenkins/.m2/repository/org/codehaus/plexus/plexus-component-annotations/1.5.5/plexus-component-annotations-1.5.5.jar
[ERROR] urls[7] = file:/home/jenkins/.m2/repository/org/sonatype/plexus/plexus-sec-dispatcher/1.3/plexus-sec-dispatcher-1.3.jar
[ERROR] urls[8] = file:/home/jenkins/.m2/repository/org/sonatype/plexus/plexus-cipher/1.4/plexus-cipher-1.4.jar
[ERROR] urls[9] = file:/home/jenkins/.m2/repository/org/codehaus/jackson/jackson-core-asl/1.9.13/jackson-core-asl-1.9.13.jar
[ERROR] urls[10] = file:/home/jenkins/.m2/repository/org/codehaus/jackson/jackson-mapper-asl/1.9.13/jackson-mapper-asl-1.9.13.jar
[ERROR] Number of foreign imports: 1
[ERROR] import: Entry[import  from realm ClassRealm[project>org.apache.hadoop:hadoop-common-project:3.0.0-SNAPSHOT,
parent: ClassRealm[maven.api, parent: null]]]
[ERROR] 
[ERROR] -----------------------------------------------------: org.apache.hadoop.maven.plugin.cmakebuilder.TestMojo$TestThread
[ERROR] -> [Help 1]
[ERROR] 
[ERROR] To see the full stack trace of the errors, re-run Maven with the -e switch.
[ERROR] Re-run Maven using the -X switch to enable full debug logging.
[ERROR] 
[ERROR] For more information about the errors and possible solutions, please read the following
articles:
[ERROR] [Help 1] http://cwiki.apache.org/confluence/display/MAVEN/PluginContainerException
[ERROR] 
[ERROR] After correcting the problems, you can resume the build with the command
[ERROR]   mvn <goals> -rf :hadoop-common
result: 1

################
# mvn -eaf test -Pclover -DcloverLicenseLocation=/home/jenkins/tools/clover/latest/lib/clover.license
################
Build step 'Execute shell' marked build as failure
Archiving artifacts
Recording test results

Mime
View raw message