hadoop-common-dev mailing list archives

Site index · List index
Message view « Date » · « Thread »
Top « Date » · « Thread »
From Apache Jenkins Server <jenk...@builds.apache.org>
Subject Build failed in Jenkins: Hadoop-Common-trunk #2516
Date Sat, 19 Mar 2016 02:57:07 GMT
See <https://builds.apache.org/job/Hadoop-Common-trunk/2516/changes>

Changes:

[cnauroth] HADOOP-12926. lz4.c does not detect 64-bit mode properly. Contributed by

------------------------------------------
[...truncated 5101 lines...]
Running org.apache.hadoop.fs.contract.ftp.TestFTPContractMkdir
Tests run: 5, Failures: 0, Errors: 0, Skipped: 5, Time elapsed: 0.751 sec - in org.apache.hadoop.fs.contract.ftp.TestFTPContractMkdir
Running org.apache.hadoop.fs.contract.ftp.TestFTPContractCreate
Tests run: 6, Failures: 0, Errors: 0, Skipped: 6, Time elapsed: 0.709 sec - in org.apache.hadoop.fs.contract.ftp.TestFTPContractCreate
Running org.apache.hadoop.fs.contract.ftp.TestFTPContractRename
Tests run: 6, Failures: 0, Errors: 0, Skipped: 6, Time elapsed: 0.709 sec - in org.apache.hadoop.fs.contract.ftp.TestFTPContractRename
Running org.apache.hadoop.fs.contract.ftp.TestFTPContractOpen
Tests run: 6, Failures: 0, Errors: 0, Skipped: 6, Time elapsed: 0.864 sec - in org.apache.hadoop.fs.contract.ftp.TestFTPContractOpen
Running org.apache.hadoop.fs.contract.ftp.TestFTPContractDelete
Tests run: 8, Failures: 0, Errors: 0, Skipped: 8, Time elapsed: 0.717 sec - in org.apache.hadoop.fs.contract.ftp.TestFTPContractDelete
Running org.apache.hadoop.fs.TestPath
Tests run: 21, Failures: 0, Errors: 0, Skipped: 0, Time elapsed: 1.228 sec - in org.apache.hadoop.fs.TestPath
Running org.apache.hadoop.fs.TestLocalFileSystem
Tests run: 20, Failures: 0, Errors: 0, Skipped: 1, Time elapsed: 1.949 sec - in org.apache.hadoop.fs.TestLocalFileSystem
Running org.apache.hadoop.fs.permission.TestAcl
Tests run: 6, Failures: 0, Errors: 0, Skipped: 0, Time elapsed: 0.215 sec - in org.apache.hadoop.fs.permission.TestAcl
Running org.apache.hadoop.fs.permission.TestFsPermission
Tests run: 7, Failures: 0, Errors: 0, Skipped: 0, Time elapsed: 0.566 sec - in org.apache.hadoop.fs.permission.TestFsPermission
Running org.apache.hadoop.fs.TestFilterFileSystem
Tests run: 12, Failures: 0, Errors: 0, Skipped: 0, Time elapsed: 1.045 sec - in org.apache.hadoop.fs.TestFilterFileSystem
Running org.apache.hadoop.fs.TestStat
Tests run: 5, Failures: 0, Errors: 0, Skipped: 0, Time elapsed: 0.85 sec - in org.apache.hadoop.fs.TestStat
Running org.apache.hadoop.fs.TestFsOptions
Tests run: 1, Failures: 0, Errors: 0, Skipped: 0, Time elapsed: 0.07 sec - in org.apache.hadoop.fs.TestFsOptions
Running org.apache.hadoop.fs.TestGlobExpander
Tests run: 2, Failures: 0, Errors: 0, Skipped: 0, Time elapsed: 0.054 sec - in org.apache.hadoop.fs.TestGlobExpander
Running org.apache.hadoop.fs.TestHarFileSystemBasics
Tests run: 12, Failures: 0, Errors: 0, Skipped: 0, Time elapsed: 2.404 sec - in org.apache.hadoop.fs.TestHarFileSystemBasics
Running org.apache.hadoop.fs.TestFileContextResolveAfs
Tests run: 1, Failures: 0, Errors: 0, Skipped: 0, Time elapsed: 1.026 sec - in org.apache.hadoop.fs.TestFileContextResolveAfs
Running org.apache.hadoop.fs.TestFileSystemCanonicalization
Tests run: 16, Failures: 0, Errors: 0, Skipped: 0, Time elapsed: 0.714 sec - in org.apache.hadoop.fs.TestFileSystemCanonicalization
Running org.apache.hadoop.fs.TestFsShellCopy
Tests run: 16, Failures: 0, Errors: 0, Skipped: 4, Time elapsed: 1.861 sec - in org.apache.hadoop.fs.TestFsShellCopy
Running org.apache.hadoop.fs.TestSymlinkLocalFSFileContext
Tests run: 63, Failures: 0, Errors: 0, Skipped: 3, Time elapsed: 3.419 sec - in org.apache.hadoop.fs.TestSymlinkLocalFSFileContext
Running org.apache.hadoop.fs.TestFileContext
Tests run: 1, Failures: 0, Errors: 0, Skipped: 0, Time elapsed: 0.442 sec - in org.apache.hadoop.fs.TestFileContext
Running org.apache.hadoop.fs.TestDelegationTokenRenewer
Tests run: 5, Failures: 0, Errors: 0, Skipped: 0, Time elapsed: 5.869 sec - in org.apache.hadoop.fs.TestDelegationTokenRenewer
Running org.apache.hadoop.fs.TestFileSystemCaching
Tests run: 13, Failures: 0, Errors: 0, Skipped: 0, Time elapsed: 1.561 sec - in org.apache.hadoop.fs.TestFileSystemCaching
Running org.apache.hadoop.fs.TestFcLocalFsUtil
Tests run: 2, Failures: 0, Errors: 0, Skipped: 0, Time elapsed: 1.082 sec - in org.apache.hadoop.fs.TestFcLocalFsUtil
Running org.apache.hadoop.fs.TestLocalFsFCStatistics
Tests run: 3, Failures: 0, Errors: 0, Skipped: 0, Time elapsed: 1.305 sec - in org.apache.hadoop.fs.TestLocalFsFCStatistics
Running org.apache.hadoop.fs.TestTruncatedInputBug
Tests run: 1, Failures: 0, Errors: 0, Skipped: 0, Time elapsed: 1.003 sec - in org.apache.hadoop.fs.TestTruncatedInputBug
Running org.apache.hadoop.fs.TestDU
Tests run: 3, Failures: 0, Errors: 0, Skipped: 0, Time elapsed: 10.551 sec - in org.apache.hadoop.fs.TestDU
Running org.apache.hadoop.fs.TestFsShell
Tests run: 3, Failures: 0, Errors: 0, Skipped: 0, Time elapsed: 1.061 sec - in org.apache.hadoop.fs.TestFsShell
Running org.apache.hadoop.fs.TestLocalDirAllocator
Tests run: 36, Failures: 0, Errors: 0, Skipped: 0, Time elapsed: 1.618 sec - in org.apache.hadoop.fs.TestLocalDirAllocator
Running org.apache.hadoop.fs.viewfs.TestChRootedFileSystem
Tests run: 18, Failures: 0, Errors: 0, Skipped: 0, Time elapsed: 1.747 sec - in org.apache.hadoop.fs.viewfs.TestChRootedFileSystem
Running org.apache.hadoop.fs.viewfs.TestViewFileSystemDelegationTokenSupport
Tests run: 4, Failures: 0, Errors: 0, Skipped: 0, Time elapsed: 1.183 sec - in org.apache.hadoop.fs.viewfs.TestViewFileSystemDelegationTokenSupport
Running org.apache.hadoop.fs.viewfs.TestViewFsWithAuthorityLocalFs
Tests run: 58, Failures: 0, Errors: 0, Skipped: 0, Time elapsed: 3.226 sec - in org.apache.hadoop.fs.viewfs.TestViewFsWithAuthorityLocalFs
Running org.apache.hadoop.fs.viewfs.TestViewFileSystemDelegation
Tests run: 3, Failures: 0, Errors: 0, Skipped: 0, Time elapsed: 1.282 sec - in org.apache.hadoop.fs.viewfs.TestViewFileSystemDelegation
Running org.apache.hadoop.fs.viewfs.TestViewFsConfig
Tests run: 1, Failures: 0, Errors: 0, Skipped: 0, Time elapsed: 0.863 sec - in org.apache.hadoop.fs.viewfs.TestViewFsConfig
Running org.apache.hadoop.fs.viewfs.TestViewFileSystemLocalFileSystem
Tests run: 60, Failures: 0, Errors: 0, Skipped: 0, Time elapsed: 3.274 sec - in org.apache.hadoop.fs.viewfs.TestViewFileSystemLocalFileSystem
Running org.apache.hadoop.fs.viewfs.TestFcPermissionsLocalFs
Tests run: 4, Failures: 0, Errors: 0, Skipped: 0, Time elapsed: 1.5 sec - in org.apache.hadoop.fs.viewfs.TestFcPermissionsLocalFs
Running org.apache.hadoop.fs.viewfs.TestFSMainOperationsLocalFileSystem
Tests run: 49, Failures: 0, Errors: 0, Skipped: 0, Time elapsed: 2.981 sec - in org.apache.hadoop.fs.viewfs.TestFSMainOperationsLocalFileSystem
Running org.apache.hadoop.fs.viewfs.TestViewFsURIs
Tests run: 1, Failures: 0, Errors: 0, Skipped: 0, Time elapsed: 0.999 sec - in org.apache.hadoop.fs.viewfs.TestViewFsURIs
Running org.apache.hadoop.fs.viewfs.TestViewFsTrash
Tests run: 1, Failures: 0, Errors: 0, Skipped: 0, Time elapsed: 1.843 sec - in org.apache.hadoop.fs.viewfs.TestViewFsTrash
Running org.apache.hadoop.fs.viewfs.TestViewFsLocalFs
Tests run: 58, Failures: 0, Errors: 0, Skipped: 0, Time elapsed: 2.417 sec - in org.apache.hadoop.fs.viewfs.TestViewFsLocalFs
Running org.apache.hadoop.fs.viewfs.TestViewFileSystemWithAuthorityLocalFileSystem
Tests run: 60, Failures: 0, Errors: 0, Skipped: 0, Time elapsed: 3.973 sec - in org.apache.hadoop.fs.viewfs.TestViewFileSystemWithAuthorityLocalFileSystem
Running org.apache.hadoop.fs.viewfs.TestViewfsFileStatus
Tests run: 2, Failures: 0, Errors: 0, Skipped: 0, Time elapsed: 1.572 sec - in org.apache.hadoop.fs.viewfs.TestViewfsFileStatus
Running org.apache.hadoop.fs.viewfs.TestFcCreateMkdirLocalFs
Tests run: 8, Failures: 0, Errors: 0, Skipped: 0, Time elapsed: 1.687 sec - in org.apache.hadoop.fs.viewfs.TestFcCreateMkdirLocalFs
Running org.apache.hadoop.fs.viewfs.TestChRootedFs
Tests run: 14, Failures: 0, Errors: 0, Skipped: 0, Time elapsed: 1.842 sec - in org.apache.hadoop.fs.viewfs.TestChRootedFs
Running org.apache.hadoop.fs.viewfs.TestFcMainOperationsLocalFs
Tests run: 60, Failures: 0, Errors: 0, Skipped: 0, Time elapsed: 2.85 sec - in org.apache.hadoop.fs.viewfs.TestFcMainOperationsLocalFs
Running org.apache.hadoop.fs.TestFSMainOperationsLocalFileSystem
Tests run: 49, Failures: 0, Errors: 0, Skipped: 0, Time elapsed: 1.733 sec - in org.apache.hadoop.fs.TestFSMainOperationsLocalFileSystem
Running org.apache.hadoop.fs.TestFcLocalFsPermission
Tests run: 4, Failures: 0, Errors: 0, Skipped: 0, Time elapsed: 1.171 sec - in org.apache.hadoop.fs.TestFcLocalFsPermission
Running org.apache.hadoop.fs.TestAfsCheckPath
Tests run: 4, Failures: 0, Errors: 0, Skipped: 0, Time elapsed: 0.191 sec - in org.apache.hadoop.fs.TestAfsCheckPath
Running org.apache.hadoop.fs.TestFileUtil
Tests run: 27, Failures: 0, Errors: 0, Skipped: 0, Time elapsed: 7.727 sec - in org.apache.hadoop.fs.TestFileUtil
Running org.apache.hadoop.fs.TestGlobPattern
Tests run: 3, Failures: 0, Errors: 0, Skipped: 0, Time elapsed: 0.178 sec - in org.apache.hadoop.fs.TestGlobPattern
Running org.apache.hadoop.fs.TestDFVariations
Tests run: 5, Failures: 0, Errors: 0, Skipped: 0, Time elapsed: 0.297 sec - in org.apache.hadoop.fs.TestDFVariations
Running org.apache.hadoop.fs.TestBlockLocation
Tests run: 2, Failures: 0, Errors: 0, Skipped: 0, Time elapsed: 0.093 sec - in org.apache.hadoop.fs.TestBlockLocation
Running org.apache.hadoop.fs.shell.TestCopy
Tests run: 5, Failures: 0, Errors: 0, Skipped: 0, Time elapsed: 1.273 sec - in org.apache.hadoop.fs.shell.TestCopy
Running org.apache.hadoop.fs.shell.TestCopyPreserveFlag
Tests run: 8, Failures: 0, Errors: 0, Skipped: 0, Time elapsed: 1.334 sec - in org.apache.hadoop.fs.shell.TestCopyPreserveFlag
Running org.apache.hadoop.fs.shell.TestPathExceptions
Tests run: 4, Failures: 0, Errors: 0, Skipped: 0, Time elapsed: 0.108 sec - in org.apache.hadoop.fs.shell.TestPathExceptions
Running org.apache.hadoop.fs.shell.TestAclCommands
Tests run: 7, Failures: 0, Errors: 0, Skipped: 0, Time elapsed: 1.336 sec - in org.apache.hadoop.fs.shell.TestAclCommands
Running org.apache.hadoop.fs.shell.TestLs
Tests run: 33, Failures: 0, Errors: 0, Skipped: 0, Time elapsed: 1.895 sec - in org.apache.hadoop.fs.shell.TestLs
Running org.apache.hadoop.fs.shell.TestTextCommand
Tests run: 4, Failures: 0, Errors: 0, Skipped: 0, Time elapsed: 1.467 sec - in org.apache.hadoop.fs.shell.TestTextCommand
Running org.apache.hadoop.fs.shell.TestMove
Tests run: 1, Failures: 0, Errors: 0, Skipped: 0, Time elapsed: 1.313 sec - in org.apache.hadoop.fs.shell.TestMove
Running org.apache.hadoop.fs.shell.TestPathData
Tests run: 11, Failures: 0, Errors: 0, Skipped: 0, Time elapsed: 1.547 sec - in org.apache.hadoop.fs.shell.TestPathData
Running org.apache.hadoop.fs.shell.TestCommandFactory
Tests run: 2, Failures: 0, Errors: 0, Skipped: 0, Time elapsed: 0.229 sec - in org.apache.hadoop.fs.shell.TestCommandFactory
Running org.apache.hadoop.fs.shell.TestCount
Tests run: 25, Failures: 0, Errors: 0, Skipped: 0, Time elapsed: 1.42 sec - in org.apache.hadoop.fs.shell.TestCount
Running org.apache.hadoop.fs.shell.TestXAttrCommands
Tests run: 2, Failures: 0, Errors: 0, Skipped: 0, Time elapsed: 0.705 sec - in org.apache.hadoop.fs.shell.TestXAttrCommands
Running org.apache.hadoop.fs.shell.find.TestPrint0
Tests run: 1, Failures: 0, Errors: 0, Skipped: 0, Time elapsed: 1.291 sec - in org.apache.hadoop.fs.shell.find.TestPrint0
Running org.apache.hadoop.fs.shell.find.TestResult
Tests run: 18, Failures: 0, Errors: 0, Skipped: 0, Time elapsed: 0.112 sec - in org.apache.hadoop.fs.shell.find.TestResult
Running org.apache.hadoop.fs.shell.find.TestAnd
Tests run: 10, Failures: 0, Errors: 0, Skipped: 0, Time elapsed: 0.416 sec - in org.apache.hadoop.fs.shell.find.TestAnd
Running org.apache.hadoop.fs.shell.find.TestName
Tests run: 6, Failures: 0, Errors: 0, Skipped: 0, Time elapsed: 1.391 sec - in org.apache.hadoop.fs.shell.find.TestName
Running org.apache.hadoop.fs.shell.find.TestFilterExpression
Tests run: 11, Failures: 0, Errors: 0, Skipped: 0, Time elapsed: 0.446 sec - in org.apache.hadoop.fs.shell.find.TestFilterExpression
Running org.apache.hadoop.fs.shell.find.TestFind
Tests run: 24, Failures: 0, Errors: 0, Skipped: 0, Time elapsed: 2.155 sec - in org.apache.hadoop.fs.shell.find.TestFind
Running org.apache.hadoop.fs.shell.find.TestIname
Tests run: 6, Failures: 0, Errors: 0, Skipped: 0, Time elapsed: 1.421 sec - in org.apache.hadoop.fs.shell.find.TestIname
Running org.apache.hadoop.fs.shell.find.TestPrint
Tests run: 1, Failures: 0, Errors: 0, Skipped: 0, Time elapsed: 1.266 sec - in org.apache.hadoop.fs.shell.find.TestPrint
Running org.apache.hadoop.fs.TestFileSystemInitialization
Tests run: 2, Failures: 0, Errors: 0, Skipped: 0, Time elapsed: 0.95 sec - in org.apache.hadoop.fs.TestFileSystemInitialization
Running org.apache.hadoop.fs.TestHarFileSystem
Tests run: 4, Failures: 0, Errors: 0, Skipped: 0, Time elapsed: 0.934 sec - in org.apache.hadoop.fs.TestHarFileSystem
Running org.apache.hadoop.fs.TestFileSystemTokens
Tests run: 10, Failures: 0, Errors: 0, Skipped: 0, Time elapsed: 0.692 sec - in org.apache.hadoop.fs.TestFileSystemTokens
Running org.apache.hadoop.fs.TestGetFileBlockLocations
Tests run: 3, Failures: 0, Errors: 0, Skipped: 0, Time elapsed: 1.243 sec - in org.apache.hadoop.fs.TestGetFileBlockLocations
Running org.apache.hadoop.fs.TestLocalFSFileContextCreateMkdir
Tests run: 8, Failures: 0, Errors: 0, Skipped: 0, Time elapsed: 1.309 sec - in org.apache.hadoop.fs.TestLocalFSFileContextCreateMkdir
Running org.apache.hadoop.fs.sftp.TestSFTPFileSystem
Tests run: 9, Failures: 0, Errors: 0, Skipped: 0, Time elapsed: 5.347 sec - in org.apache.hadoop.fs.sftp.TestSFTPFileSystem
Running org.apache.hadoop.fs.TestAvroFSInput
Tests run: 1, Failures: 0, Errors: 0, Skipped: 0, Time elapsed: 1.021 sec - in org.apache.hadoop.fs.TestAvroFSInput
Running org.apache.hadoop.fs.TestFilterFs
Tests run: 1, Failures: 0, Errors: 0, Skipped: 0, Time elapsed: 0.187 sec - in org.apache.hadoop.fs.TestFilterFs
Running org.apache.hadoop.fs.TestLocalFSFileContextMainOperations
Tests run: 62, Failures: 0, Errors: 0, Skipped: 0, Time elapsed: 2.029 sec - in org.apache.hadoop.fs.TestLocalFSFileContextMainOperations
Running org.apache.hadoop.fs.TestSymlinkLocalFSFileSystem
Tests run: 63, Failures: 0, Errors: 0, Skipped: 7, Time elapsed: 2.506 sec - in org.apache.hadoop.fs.TestSymlinkLocalFSFileSystem
Running org.apache.hadoop.fs.TestS3_LocalFileContextURI
Tests run: 17, Failures: 0, Errors: 0, Skipped: 0, Time elapsed: 1.665 sec - in org.apache.hadoop.fs.TestS3_LocalFileContextURI
Running org.apache.hadoop.fs.TestFsShellReturnCode
Tests run: 10, Failures: 0, Errors: 0, Skipped: 0, Time elapsed: 2.235 sec - in org.apache.hadoop.fs.TestFsShellReturnCode
Running org.apache.hadoop.fs.ftp.TestFTPFileSystem
Tests run: 1, Failures: 0, Errors: 0, Skipped: 0, Time elapsed: 0.238 sec - in org.apache.hadoop.fs.ftp.TestFTPFileSystem
Running org.apache.hadoop.fs.TestHardLink
Tests run: 5, Failures: 0, Errors: 0, Skipped: 0, Time elapsed: 0.33 sec - in org.apache.hadoop.fs.TestHardLink
Running org.apache.hadoop.fs.TestListFiles
Tests run: 2, Failures: 0, Errors: 0, Skipped: 0, Time elapsed: 1.057 sec - in org.apache.hadoop.fs.TestListFiles
Running org.apache.hadoop.fs.TestLocal_S3FileContextURI
Tests run: 17, Failures: 0, Errors: 0, Skipped: 0, Time elapsed: 1.699 sec - in org.apache.hadoop.fs.TestLocal_S3FileContextURI
Running org.apache.hadoop.fs.TestDelegateToFileSystem
Tests run: 2, Failures: 0, Errors: 0, Skipped: 0, Time elapsed: 0.522 sec - in org.apache.hadoop.fs.TestDelegateToFileSystem
Running org.apache.hadoop.ha.TestZKFailoverControllerStress
Tests run: 3, Failures: 0, Errors: 0, Skipped: 0, Time elapsed: 94.745 sec - in org.apache.hadoop.ha.TestZKFailoverControllerStress
Running org.apache.hadoop.ha.TestShellCommandFencer
Tests run: 9, Failures: 0, Errors: 0, Skipped: 0, Time elapsed: 1.154 sec - in org.apache.hadoop.ha.TestShellCommandFencer
Running org.apache.hadoop.ha.TestFailoverController
Tests run: 17, Failures: 0, Errors: 0, Skipped: 0, Time elapsed: 1.473 sec - in org.apache.hadoop.ha.TestFailoverController
Running org.apache.hadoop.ha.TestNodeFencer
Tests run: 9, Failures: 0, Errors: 0, Skipped: 0, Time elapsed: 0.968 sec - in org.apache.hadoop.ha.TestNodeFencer
Running org.apache.hadoop.ha.TestActiveStandbyElectorRealZK
Tests run: 4, Failures: 0, Errors: 0, Skipped: 0, Time elapsed: 10.951 sec - in org.apache.hadoop.ha.TestActiveStandbyElectorRealZK
Running org.apache.hadoop.ha.TestSshFenceByTcpPort
Tests run: 4, Failures: 0, Errors: 0, Skipped: 1, Time elapsed: 3.715 sec - in org.apache.hadoop.ha.TestSshFenceByTcpPort
Running org.apache.hadoop.ha.TestZKFailoverController
Tests run: 20, Failures: 0, Errors: 0, Skipped: 0, Time elapsed: 56.499 sec - in org.apache.hadoop.ha.TestZKFailoverController
Running org.apache.hadoop.ha.TestHealthMonitorWithDedicatedHealthAddress
Exception: java.lang.RuntimeException thrown from the UncaughtExceptionHandler in thread "Health
Monitor for DummyHAService #3"
Tests run: 3, Failures: 0, Errors: 0, Skipped: 0, Time elapsed: 2.343 sec - in org.apache.hadoop.ha.TestHealthMonitorWithDedicatedHealthAddress
Running org.apache.hadoop.ha.TestActiveStandbyElector
Tests run: 23, Failures: 0, Errors: 0, Skipped: 0, Time elapsed: 3.093 sec - in org.apache.hadoop.ha.TestActiveStandbyElector
Running org.apache.hadoop.ha.TestHAAdmin
Tests run: 2, Failures: 0, Errors: 0, Skipped: 0, Time elapsed: 0.531 sec - in org.apache.hadoop.ha.TestHAAdmin
Running org.apache.hadoop.ha.TestHealthMonitor
Exception: java.lang.RuntimeException thrown from the UncaughtExceptionHandler in thread "Health
Monitor for DummyHAService #3"
Tests run: 3, Failures: 0, Errors: 0, Skipped: 0, Time elapsed: 2.264 sec - in org.apache.hadoop.ha.TestHealthMonitor
Running org.apache.hadoop.service.TestGlobalStateChangeListener
Tests run: 5, Failures: 0, Errors: 0, Skipped: 0, Time elapsed: 0.246 sec - in org.apache.hadoop.service.TestGlobalStateChangeListener
Running org.apache.hadoop.service.TestServiceLifecycle
Tests run: 18, Failures: 0, Errors: 0, Skipped: 0, Time elapsed: 2.385 sec - in org.apache.hadoop.service.TestServiceLifecycle
Running org.apache.hadoop.service.TestCompositeService
Tests run: 42, Failures: 0, Errors: 0, Skipped: 0, Time elapsed: 0.334 sec - in org.apache.hadoop.service.TestCompositeService

Results :

Failed tests: 
  TestReloadingX509TrustManager.testReload:112 expected:<2> but was:<1>

Tests run: 3324, Failures: 1, Errors: 0, Skipped: 86

[INFO] ------------------------------------------------------------------------
[INFO] Reactor Summary:
[INFO] 
[INFO] Apache Hadoop Annotations ......................... SUCCESS [ 10.484 s]
[INFO] Apache Hadoop MiniKDC ............................. SUCCESS [02:00 min]
[INFO] Apache Hadoop Auth ................................ SUCCESS [14:23 min]
[INFO] Apache Hadoop Auth Examples ....................... SUCCESS [  4.664 s]
[INFO] Apache Hadoop Common .............................. FAILURE [26:46 min]
[INFO] Apache Hadoop NFS ................................. SKIPPED
[INFO] Apache Hadoop KMS ................................. SKIPPED
[INFO] Apache Hadoop Common Project ...................... SKIPPED
[INFO] ------------------------------------------------------------------------
[INFO] BUILD FAILURE
[INFO] ------------------------------------------------------------------------
[INFO] Total time: 43:26 min
[INFO] Finished at: 2016-03-19T02:57:03+00:00
[INFO] Final Memory: 84M/938M
[INFO] ------------------------------------------------------------------------
[ERROR] Failed to execute goal org.apache.maven.plugins:maven-surefire-plugin:2.17:test (default-test)
on project hadoop-common: There are test failures.
[ERROR] 
[ERROR] Please refer to <https://builds.apache.org/job/Hadoop-Common-trunk/ws/hadoop-common-project/hadoop-common/target/surefire-reports>
for the individual test results.
[ERROR] -> [Help 1]
[ERROR] 
[ERROR] To see the full stack trace of the errors, re-run Maven with the -e switch.
[ERROR] Re-run Maven using the -X switch to enable full debug logging.
[ERROR] 
[ERROR] For more information about the errors and possible solutions, please read the following
articles:
[ERROR] [Help 1] http://cwiki.apache.org/confluence/display/MAVEN/MojoFailureException
[ERROR] 
[ERROR] After correcting the problems, you can resume the build with the command
[ERROR]   mvn <goals> -rf :hadoop-common
result: 1

################
# mvn -eaf test -Pclover -DcloverLicenseLocation=/home/jenkins/tools/clover/latest/lib/clover.license
################
Build step 'Execute shell' marked build as failure
Archiving artifacts
Recording test results

Mime
View raw message