hadoop-common-dev mailing list archives

Site index · List index
Message view « Date » · « Thread »
Top « Date » · « Thread »
From Apache Jenkins Server <jenk...@builds.apache.org>
Subject Build failed in Jenkins: Hadoop-Common-trunk #2331
Date Thu, 04 Feb 2016 00:17:50 GMT
See <https://builds.apache.org/job/Hadoop-Common-trunk/2331/changes>

Changes:

[shv] Move HDFS-9601 to branch-2.8.0 in CHANGES.txt. (shv)

[zhezhang] HDFS-9658. Erasure Coding: allow to use multiple EC policies in striping

[shv] HDFS-9503. Use generic option -fs for NNThroughputBenchmark instead of

[zhezhang] HADOOP-12041. Implement another Reed-Solomon coder in pure Java.

------------------------------------------
[...truncated 5114 lines...]
Running org.apache.hadoop.fs.shell.TestAclCommands
Tests run: 7, Failures: 0, Errors: 0, Skipped: 0, Time elapsed: 0.963 sec - in org.apache.hadoop.fs.shell.TestAclCommands
Running org.apache.hadoop.fs.shell.find.TestFind
Tests run: 24, Failures: 0, Errors: 0, Skipped: 0, Time elapsed: 1.803 sec - in org.apache.hadoop.fs.shell.find.TestFind
Running org.apache.hadoop.fs.shell.find.TestPrint0
Tests run: 1, Failures: 0, Errors: 0, Skipped: 0, Time elapsed: 0.93 sec - in org.apache.hadoop.fs.shell.find.TestPrint0
Running org.apache.hadoop.fs.shell.find.TestPrint
Tests run: 1, Failures: 0, Errors: 0, Skipped: 0, Time elapsed: 0.924 sec - in org.apache.hadoop.fs.shell.find.TestPrint
Running org.apache.hadoop.fs.shell.find.TestAnd
Tests run: 10, Failures: 0, Errors: 0, Skipped: 0, Time elapsed: 0.346 sec - in org.apache.hadoop.fs.shell.find.TestAnd
Running org.apache.hadoop.fs.shell.find.TestResult
Tests run: 18, Failures: 0, Errors: 0, Skipped: 0, Time elapsed: 0.103 sec - in org.apache.hadoop.fs.shell.find.TestResult
Running org.apache.hadoop.fs.shell.find.TestIname
Tests run: 6, Failures: 0, Errors: 0, Skipped: 0, Time elapsed: 1.187 sec - in org.apache.hadoop.fs.shell.find.TestIname
Running org.apache.hadoop.fs.shell.find.TestName
Tests run: 6, Failures: 0, Errors: 0, Skipped: 0, Time elapsed: 1.153 sec - in org.apache.hadoop.fs.shell.find.TestName
Running org.apache.hadoop.fs.shell.find.TestFilterExpression
Tests run: 11, Failures: 0, Errors: 0, Skipped: 0, Time elapsed: 0.358 sec - in org.apache.hadoop.fs.shell.find.TestFilterExpression
Running org.apache.hadoop.fs.shell.TestPathExceptions
Tests run: 4, Failures: 0, Errors: 0, Skipped: 0, Time elapsed: 0.083 sec - in org.apache.hadoop.fs.shell.TestPathExceptions
Running org.apache.hadoop.fs.shell.TestCommandFactory
Tests run: 2, Failures: 0, Errors: 0, Skipped: 0, Time elapsed: 0.197 sec - in org.apache.hadoop.fs.shell.TestCommandFactory
Running org.apache.hadoop.fs.shell.TestLs
Tests run: 33, Failures: 0, Errors: 0, Skipped: 0, Time elapsed: 1.553 sec - in org.apache.hadoop.fs.shell.TestLs
Running org.apache.hadoop.fs.shell.TestMove
Tests run: 1, Failures: 0, Errors: 0, Skipped: 0, Time elapsed: 0.97 sec - in org.apache.hadoop.fs.shell.TestMove
Running org.apache.hadoop.fs.shell.TestXAttrCommands
Tests run: 2, Failures: 0, Errors: 0, Skipped: 0, Time elapsed: 0.567 sec - in org.apache.hadoop.fs.shell.TestXAttrCommands
Running org.apache.hadoop.fs.shell.TestPathData
Tests run: 11, Failures: 0, Errors: 0, Skipped: 0, Time elapsed: 1.216 sec - in org.apache.hadoop.fs.shell.TestPathData
Running org.apache.hadoop.fs.shell.TestCount
Tests run: 25, Failures: 0, Errors: 0, Skipped: 0, Time elapsed: 1.024 sec - in org.apache.hadoop.fs.shell.TestCount
Running org.apache.hadoop.fs.contract.rawlocal.TestRawlocalContractRename
Tests run: 7, Failures: 0, Errors: 0, Skipped: 0, Time elapsed: 0.996 sec - in org.apache.hadoop.fs.contract.rawlocal.TestRawlocalContractRename
Running org.apache.hadoop.fs.contract.rawlocal.TestRawlocalContractAppend
Tests run: 5, Failures: 0, Errors: 0, Skipped: 5, Time elapsed: 0.872 sec - in org.apache.hadoop.fs.contract.rawlocal.TestRawlocalContractAppend
Running org.apache.hadoop.fs.contract.rawlocal.TestRawlocalContractDelete
Tests run: 8, Failures: 0, Errors: 0, Skipped: 0, Time elapsed: 0.988 sec - in org.apache.hadoop.fs.contract.rawlocal.TestRawlocalContractDelete
Running org.apache.hadoop.fs.contract.rawlocal.TestRawlocalContractGetFileStatus
Tests run: 1, Failures: 0, Errors: 0, Skipped: 0, Time elapsed: 0.753 sec - in org.apache.hadoop.fs.contract.rawlocal.TestRawlocalContractGetFileStatus
Running org.apache.hadoop.fs.contract.rawlocal.TestRawlocalContractSetTimes
Tests run: 1, Failures: 0, Errors: 0, Skipped: 0, Time elapsed: 0.749 sec - in org.apache.hadoop.fs.contract.rawlocal.TestRawlocalContractSetTimes
Running org.apache.hadoop.fs.contract.rawlocal.TestRawlocalContractSeek
Tests run: 10, Failures: 0, Errors: 0, Skipped: 0, Time elapsed: 1.204 sec - in org.apache.hadoop.fs.contract.rawlocal.TestRawlocalContractSeek
Running org.apache.hadoop.fs.contract.rawlocal.TestRawlocalContractOpen
Tests run: 6, Failures: 0, Errors: 0, Skipped: 0, Time elapsed: 1.036 sec - in org.apache.hadoop.fs.contract.rawlocal.TestRawlocalContractOpen
Running org.apache.hadoop.fs.contract.rawlocal.TestRawlocalContractMkdir
Tests run: 5, Failures: 0, Errors: 0, Skipped: 0, Time elapsed: 0.888 sec - in org.apache.hadoop.fs.contract.rawlocal.TestRawlocalContractMkdir
Running org.apache.hadoop.fs.contract.rawlocal.TestRawLocalContractUnderlyingFileBehavior
Tests run: 1, Failures: 0, Errors: 0, Skipped: 0, Time elapsed: 0.189 sec - in org.apache.hadoop.fs.contract.rawlocal.TestRawLocalContractUnderlyingFileBehavior
Running org.apache.hadoop.fs.contract.rawlocal.TestRawlocalContractCreate
Tests run: 6, Failures: 0, Errors: 0, Skipped: 0, Time elapsed: 0.916 sec - in org.apache.hadoop.fs.contract.rawlocal.TestRawlocalContractCreate
Running org.apache.hadoop.fs.contract.ftp.TestFTPContractCreate
Tests run: 6, Failures: 0, Errors: 0, Skipped: 6, Time elapsed: 0.628 sec - in org.apache.hadoop.fs.contract.ftp.TestFTPContractCreate
Running org.apache.hadoop.fs.contract.ftp.TestFTPContractDelete
Tests run: 8, Failures: 0, Errors: 0, Skipped: 8, Time elapsed: 0.683 sec - in org.apache.hadoop.fs.contract.ftp.TestFTPContractDelete
Running org.apache.hadoop.fs.contract.ftp.TestFTPContractRename
Tests run: 6, Failures: 0, Errors: 0, Skipped: 6, Time elapsed: 0.629 sec - in org.apache.hadoop.fs.contract.ftp.TestFTPContractRename
Running org.apache.hadoop.fs.contract.ftp.TestFTPContractMkdir
Tests run: 5, Failures: 0, Errors: 0, Skipped: 5, Time elapsed: 0.597 sec - in org.apache.hadoop.fs.contract.ftp.TestFTPContractMkdir
Running org.apache.hadoop.fs.contract.ftp.TestFTPContractOpen
Tests run: 6, Failures: 0, Errors: 0, Skipped: 6, Time elapsed: 0.773 sec - in org.apache.hadoop.fs.contract.ftp.TestFTPContractOpen
Running org.apache.hadoop.fs.contract.localfs.TestLocalFSContractAppend
Tests run: 5, Failures: 0, Errors: 0, Skipped: 5, Time elapsed: 0.98 sec - in org.apache.hadoop.fs.contract.localfs.TestLocalFSContractAppend
Running org.apache.hadoop.fs.contract.localfs.TestLocalFSContractGetFileStatus
Tests run: 1, Failures: 0, Errors: 0, Skipped: 0, Time elapsed: 0.776 sec - in org.apache.hadoop.fs.contract.localfs.TestLocalFSContractGetFileStatus
Running org.apache.hadoop.fs.contract.localfs.TestLocalFSContractOpen
Tests run: 6, Failures: 0, Errors: 0, Skipped: 0, Time elapsed: 1.082 sec - in org.apache.hadoop.fs.contract.localfs.TestLocalFSContractOpen
Running org.apache.hadoop.fs.contract.localfs.TestLocalFSContractLoaded
Tests run: 2, Failures: 0, Errors: 0, Skipped: 0, Time elapsed: 0.795 sec - in org.apache.hadoop.fs.contract.localfs.TestLocalFSContractLoaded
Running org.apache.hadoop.fs.contract.localfs.TestLocalFSContractDelete
Tests run: 8, Failures: 0, Errors: 0, Skipped: 0, Time elapsed: 0.974 sec - in org.apache.hadoop.fs.contract.localfs.TestLocalFSContractDelete
Running org.apache.hadoop.fs.contract.localfs.TestLocalFSContractMkdir
Tests run: 5, Failures: 0, Errors: 0, Skipped: 0, Time elapsed: 0.9 sec - in org.apache.hadoop.fs.contract.localfs.TestLocalFSContractMkdir
Running org.apache.hadoop.fs.contract.localfs.TestLocalFSContractRename
Tests run: 6, Failures: 0, Errors: 0, Skipped: 0, Time elapsed: 0.937 sec - in org.apache.hadoop.fs.contract.localfs.TestLocalFSContractRename
Running org.apache.hadoop.fs.contract.localfs.TestLocalFSContractCreate
Tests run: 6, Failures: 0, Errors: 0, Skipped: 0, Time elapsed: 0.946 sec - in org.apache.hadoop.fs.contract.localfs.TestLocalFSContractCreate
Running org.apache.hadoop.fs.contract.localfs.TestLocalFSContractSetTimes
Tests run: 1, Failures: 0, Errors: 0, Skipped: 0, Time elapsed: 0.76 sec - in org.apache.hadoop.fs.contract.localfs.TestLocalFSContractSetTimes
Running org.apache.hadoop.fs.contract.localfs.TestLocalFSContractSeek
Tests run: 10, Failures: 0, Errors: 0, Skipped: 0, Time elapsed: 1.325 sec - in org.apache.hadoop.fs.contract.localfs.TestLocalFSContractSeek
Running org.apache.hadoop.fs.TestQuotaUsage
Tests run: 8, Failures: 0, Errors: 0, Skipped: 0, Time elapsed: 0.198 sec - in org.apache.hadoop.fs.TestQuotaUsage
Running org.apache.hadoop.fs.TestContentSummary
Tests run: 13, Failures: 0, Errors: 0, Skipped: 0, Time elapsed: 0.439 sec - in org.apache.hadoop.fs.TestContentSummary
Running org.apache.hadoop.fs.TestTrash
Tests run: 4, Failures: 0, Errors: 0, Skipped: 0, Time elapsed: 16.195 sec - in org.apache.hadoop.fs.TestTrash
Running org.apache.hadoop.fs.TestLocalFSFileContextCreateMkdir
Tests run: 8, Failures: 0, Errors: 0, Skipped: 0, Time elapsed: 0.959 sec - in org.apache.hadoop.fs.TestLocalFSFileContextCreateMkdir
Running org.apache.hadoop.fs.TestLocalFsFCStatistics
Tests run: 3, Failures: 0, Errors: 0, Skipped: 0, Time elapsed: 0.892 sec - in org.apache.hadoop.fs.TestLocalFsFCStatistics
Running org.apache.hadoop.fs.TestFileStatus
Tests run: 11, Failures: 0, Errors: 0, Skipped: 0, Time elapsed: 0.209 sec - in org.apache.hadoop.fs.TestFileStatus
Running org.apache.hadoop.fs.TestCommandFormat
Tests run: 10, Failures: 0, Errors: 0, Skipped: 0, Time elapsed: 0.085 sec - in org.apache.hadoop.fs.TestCommandFormat
Running org.apache.hadoop.jmx.TestJMXJsonServlet
Tests run: 1, Failures: 0, Errors: 0, Skipped: 0, Time elapsed: 1.021 sec - in org.apache.hadoop.jmx.TestJMXJsonServlet
Running org.apache.hadoop.http.TestGlobalFilter
Tests run: 1, Failures: 0, Errors: 0, Skipped: 0, Time elapsed: 0.951 sec - in org.apache.hadoop.http.TestGlobalFilter
Running org.apache.hadoop.http.TestPathFilter
Tests run: 1, Failures: 0, Errors: 0, Skipped: 0, Time elapsed: 0.884 sec - in org.apache.hadoop.http.TestPathFilter
Running org.apache.hadoop.http.TestHttpCookieFlag
Tests run: 2, Failures: 0, Errors: 0, Skipped: 0, Time elapsed: 1.716 sec - in org.apache.hadoop.http.TestHttpCookieFlag
Running org.apache.hadoop.http.TestHttpRequestLogAppender
Tests run: 1, Failures: 0, Errors: 0, Skipped: 0, Time elapsed: 0.077 sec - in org.apache.hadoop.http.TestHttpRequestLogAppender
Running org.apache.hadoop.http.TestHtmlQuoting
Tests run: 4, Failures: 0, Errors: 0, Skipped: 0, Time elapsed: 0.293 sec - in org.apache.hadoop.http.TestHtmlQuoting
Running org.apache.hadoop.http.TestHttpRequestLog
Tests run: 2, Failures: 0, Errors: 0, Skipped: 0, Time elapsed: 0.176 sec - in org.apache.hadoop.http.TestHttpRequestLog
Running org.apache.hadoop.http.TestHttpServerWebapps
Tests run: 2, Failures: 0, Errors: 0, Skipped: 0, Time elapsed: 0.605 sec - in org.apache.hadoop.http.TestHttpServerWebapps
Running org.apache.hadoop.http.TestHttpServerLifecycle
Tests run: 7, Failures: 0, Errors: 0, Skipped: 0, Time elapsed: 1.477 sec - in org.apache.hadoop.http.TestHttpServerLifecycle
Running org.apache.hadoop.http.TestAuthenticationSessionCookie
Tests run: 2, Failures: 0, Errors: 0, Skipped: 0, Time elapsed: 2.025 sec - in org.apache.hadoop.http.TestAuthenticationSessionCookie
Running org.apache.hadoop.http.TestHttpServer
Tests run: 14, Failures: 0, Errors: 0, Skipped: 0, Time elapsed: 3.37 sec - in org.apache.hadoop.http.TestHttpServer
Running org.apache.hadoop.http.lib.TestStaticUserWebFilter
Tests run: 3, Failures: 0, Errors: 0, Skipped: 0, Time elapsed: 0.606 sec - in org.apache.hadoop.http.lib.TestStaticUserWebFilter
Running org.apache.hadoop.http.TestHttpServerLogs
Tests run: 2, Failures: 0, Errors: 0, Skipped: 0, Time elapsed: 0.944 sec - in org.apache.hadoop.http.TestHttpServerLogs
Running org.apache.hadoop.http.TestServletFilter
Tests run: 3, Failures: 0, Errors: 0, Skipped: 0, Time elapsed: 1.379 sec - in org.apache.hadoop.http.TestServletFilter
Running org.apache.hadoop.http.TestSSLHttpServer
Tests run: 2, Failures: 0, Errors: 0, Skipped: 0, Time elapsed: 1.769 sec - in org.apache.hadoop.http.TestSSLHttpServer
Running org.apache.hadoop.metrics2.sink.TestFileSink
Tests run: 1, Failures: 0, Errors: 0, Skipped: 0, Time elapsed: 0.485 sec - in org.apache.hadoop.metrics2.sink.TestFileSink
Running org.apache.hadoop.metrics2.sink.ganglia.TestGangliaSink
Tests run: 4, Failures: 0, Errors: 0, Skipped: 0, Time elapsed: 0.27 sec - in org.apache.hadoop.metrics2.sink.ganglia.TestGangliaSink
Running org.apache.hadoop.metrics2.sink.TestRollingFileSystemSink
Tests run: 7, Failures: 0, Errors: 0, Skipped: 0, Time elapsed: 21.323 sec - in org.apache.hadoop.metrics2.sink.TestRollingFileSystemSink
Running org.apache.hadoop.metrics2.util.TestSampleStat
Tests run: 1, Failures: 0, Errors: 0, Skipped: 0, Time elapsed: 0.083 sec - in org.apache.hadoop.metrics2.util.TestSampleStat
Running org.apache.hadoop.metrics2.util.TestSampleQuantiles
Tests run: 3, Failures: 0, Errors: 0, Skipped: 0, Time elapsed: 0.672 sec - in org.apache.hadoop.metrics2.util.TestSampleQuantiles
Running org.apache.hadoop.metrics2.util.TestMetricsCache
Tests run: 4, Failures: 0, Errors: 0, Skipped: 0, Time elapsed: 1.828 sec - in org.apache.hadoop.metrics2.util.TestMetricsCache
Running org.apache.hadoop.metrics2.impl.TestMetricsSourceAdapter
Tests run: 3, Failures: 0, Errors: 0, Skipped: 0, Time elapsed: 11.456 sec - in org.apache.hadoop.metrics2.impl.TestMetricsSourceAdapter
Running org.apache.hadoop.metrics2.impl.TestSinkQueue
Tests run: 8, Failures: 0, Errors: 0, Skipped: 0, Time elapsed: 0.491 sec - in org.apache.hadoop.metrics2.impl.TestSinkQueue
Running org.apache.hadoop.metrics2.impl.TestMetricsCollectorImpl
Tests run: 2, Failures: 0, Errors: 0, Skipped: 0, Time elapsed: 0.279 sec - in org.apache.hadoop.metrics2.impl.TestMetricsCollectorImpl
Running org.apache.hadoop.metrics2.impl.TestMetricsVisitor
Tests run: 1, Failures: 0, Errors: 0, Skipped: 0, Time elapsed: 0.395 sec - in org.apache.hadoop.metrics2.impl.TestMetricsVisitor
Running org.apache.hadoop.metrics2.impl.TestStatsDMetrics
Tests run: 2, Failures: 0, Errors: 0, Skipped: 0, Time elapsed: 0.361 sec - in org.apache.hadoop.metrics2.impl.TestStatsDMetrics
Running org.apache.hadoop.metrics2.impl.TestGraphiteMetrics
Tests run: 5, Failures: 0, Errors: 0, Skipped: 0, Time elapsed: 0.427 sec - in org.apache.hadoop.metrics2.impl.TestGraphiteMetrics
Running org.apache.hadoop.metrics2.impl.TestMetricsConfig
Tests run: 3, Failures: 0, Errors: 0, Skipped: 0, Time elapsed: 0.31 sec - in org.apache.hadoop.metrics2.impl.TestMetricsConfig
Running org.apache.hadoop.metrics2.impl.TestMetricsSystemImpl
Tests run: 12, Failures: 0, Errors: 0, Skipped: 0, Time elapsed: 1.85 sec - in org.apache.hadoop.metrics2.impl.TestMetricsSystemImpl
Running org.apache.hadoop.metrics2.impl.TestGangliaMetrics
Tests run: 2, Failures: 0, Errors: 0, Skipped: 0, Time elapsed: 0.456 sec - in org.apache.hadoop.metrics2.impl.TestGangliaMetrics
Running org.apache.hadoop.metrics2.source.TestJvmMetrics
Tests run: 5, Failures: 0, Errors: 0, Skipped: 0, Time elapsed: 0.729 sec - in org.apache.hadoop.metrics2.source.TestJvmMetrics
Running org.apache.hadoop.metrics2.filter.TestPatternFilter
Tests run: 5, Failures: 0, Errors: 0, Skipped: 0, Time elapsed: 0.495 sec - in org.apache.hadoop.metrics2.filter.TestPatternFilter
Running org.apache.hadoop.metrics2.lib.TestMetricsAnnotations
Tests run: 9, Failures: 0, Errors: 0, Skipped: 0, Time elapsed: 0.462 sec - in org.apache.hadoop.metrics2.lib.TestMetricsAnnotations
Running org.apache.hadoop.metrics2.lib.TestUniqNames
Tests run: 2, Failures: 0, Errors: 0, Skipped: 0, Time elapsed: 0.083 sec - in org.apache.hadoop.metrics2.lib.TestUniqNames
Running org.apache.hadoop.metrics2.lib.TestInterns
Tests run: 4, Failures: 0, Errors: 0, Skipped: 0, Time elapsed: 0.229 sec - in org.apache.hadoop.metrics2.lib.TestInterns
Running org.apache.hadoop.metrics2.lib.TestMetricsRegistry
Tests run: 4, Failures: 0, Errors: 0, Skipped: 0, Time elapsed: 0.422 sec - in org.apache.hadoop.metrics2.lib.TestMetricsRegistry
Running org.apache.hadoop.metrics2.lib.TestMutableMetrics
Tests run: 5, Failures: 0, Errors: 0, Skipped: 0, Time elapsed: 28.475 sec - in org.apache.hadoop.metrics2.lib.TestMutableMetrics

Results :

Tests run: 3270, Failures: 0, Errors: 0, Skipped: 86

[INFO] 
[INFO] --- maven-antrun-plugin:1.7:run (common-test-bats-driver) @ hadoop-common ---
[INFO] Executing tasks

main:
     [exec] 
     [exec] 
     [exec] ERROR: bats not installed. Skipping bash tests.
     [exec] ERROR: Please install bats as soon as possible.
     [exec] 
     [exec] 
[INFO] Executed tasks
[INFO] 
[INFO] --- hadoop-maven-plugins:3.0.0-SNAPSHOT:cmake-test (test_bulk_crc32) @ hadoop-common
---
[INFO] -------------------------------------------------------
[INFO]  C M A K E B U I L D E R    T E S T
[INFO] -------------------------------------------------------
[INFO] test_bulk_crc32: running <https://builds.apache.org/job/Hadoop-Common-trunk/ws/hadoop-common-project/hadoop-common/target/native/test_bulk_crc32>
[INFO] with extra environment variables {}
[INFO] ------------------------------------------------------------------------
[INFO] Reactor Summary:
[INFO] 
[INFO] Apache Hadoop Annotations ......................... SUCCESS [  8.339 s]
[INFO] Apache Hadoop MiniKDC ............................. SUCCESS [ 21.910 s]
[INFO] Apache Hadoop Auth ................................ SUCCESS [03:51 min]
[INFO] Apache Hadoop Auth Examples ....................... SUCCESS [  3.721 s]
[INFO] Apache Hadoop Common .............................. FAILURE [22:44 min]
[INFO] Apache Hadoop NFS ................................. SKIPPED
[INFO] Apache Hadoop KMS ................................. SKIPPED
[INFO] Apache Hadoop Common Project ...................... SKIPPED
[INFO] ------------------------------------------------------------------------
[INFO] BUILD FAILURE
[INFO] ------------------------------------------------------------------------
[INFO] Total time: 27:11 min
[INFO] Finished at: 2016-02-04T00:17:44+00:00
[INFO] Final Memory: 81M/921M
[INFO] ------------------------------------------------------------------------
[ERROR] Failed to execute goal org.apache.hadoop:hadoop-maven-plugins:3.0.0-SNAPSHOT:cmake-test
(test_bulk_crc32) on project hadoop-common: Execution test_bulk_crc32 of goal org.apache.hadoop:hadoop-maven-plugins:3.0.0-SNAPSHOT:cmake-test
failed: A required class was missing while executing org.apache.hadoop:hadoop-maven-plugins:3.0.0-SNAPSHOT:cmake-test:
org/apache/hadoop/maven/plugin/cmakebuilder/TestMojo$TestThread
[ERROR] -----------------------------------------------------
[ERROR] realm =    plugin>org.apache.hadoop:hadoop-maven-plugins:3.0.0-SNAPSHOT
[ERROR] strategy = org.codehaus.plexus.classworlds.strategy.SelfFirstStrategy
[ERROR] urls[0] = file:/home/jenkins/.m2/repository/org/apache/hadoop/hadoop-maven-plugins/3.0.0-SNAPSHOT/hadoop-maven-plugins-3.0.0-SNAPSHOT.jar
[ERROR] urls[1] = file:/home/jenkins/.m2/repository/org/sonatype/sisu/sisu-inject-bean/1.4.2/sisu-inject-bean-1.4.2.jar
[ERROR] urls[2] = file:/home/jenkins/.m2/repository/org/sonatype/sisu/sisu-guice/2.1.7/sisu-guice-2.1.7-noaop.jar
[ERROR] urls[3] = file:/home/jenkins/.m2/repository/org/sonatype/aether/aether-util/1.7/aether-util-1.7.jar
[ERROR] urls[4] = file:/home/jenkins/.m2/repository/org/codehaus/plexus/plexus-interpolation/1.14/plexus-interpolation-1.14.jar
[ERROR] urls[5] = file:/home/jenkins/.m2/repository/org/codehaus/plexus/plexus-utils/2.0.5/plexus-utils-2.0.5.jar
[ERROR] urls[6] = file:/home/jenkins/.m2/repository/org/codehaus/plexus/plexus-component-annotations/1.5.5/plexus-component-annotations-1.5.5.jar
[ERROR] urls[7] = file:/home/jenkins/.m2/repository/org/sonatype/plexus/plexus-sec-dispatcher/1.3/plexus-sec-dispatcher-1.3.jar
[ERROR] urls[8] = file:/home/jenkins/.m2/repository/org/sonatype/plexus/plexus-cipher/1.4/plexus-cipher-1.4.jar
[ERROR] urls[9] = file:/home/jenkins/.m2/repository/org/codehaus/jackson/jackson-core-asl/1.9.13/jackson-core-asl-1.9.13.jar
[ERROR] urls[10] = file:/home/jenkins/.m2/repository/org/codehaus/jackson/jackson-mapper-asl/1.9.13/jackson-mapper-asl-1.9.13.jar
[ERROR] Number of foreign imports: 1
[ERROR] import: Entry[import  from realm ClassRealm[project>org.apache.hadoop:hadoop-common-project:3.0.0-SNAPSHOT,
parent: ClassRealm[maven.api, parent: null]]]
[ERROR] 
[ERROR] -----------------------------------------------------: org.apache.hadoop.maven.plugin.cmakebuilder.TestMojo$TestThread
[ERROR] -> [Help 1]
[ERROR] 
[ERROR] To see the full stack trace of the errors, re-run Maven with the -e switch.
[ERROR] Re-run Maven using the -X switch to enable full debug logging.
[ERROR] 
[ERROR] For more information about the errors and possible solutions, please read the following
articles:
[ERROR] [Help 1] http://cwiki.apache.org/confluence/display/MAVEN/PluginContainerException
[ERROR] 
[ERROR] After correcting the problems, you can resume the build with the command
[ERROR]   mvn <goals> -rf :hadoop-common
result: 1

################
# mvn -eaf test -Pclover -DcloverLicenseLocation=/home/jenkins/tools/clover/latest/lib/clover.license
################
Build step 'Execute shell' marked build as failure
Archiving artifacts
Recording test results

Mime
View raw message