hadoop-common-dev mailing list archives

Site index · List index
Message view « Date » · « Thread »
Top « Date » · « Thread »
From Apache Jenkins Server <jenk...@builds.apache.org>
Subject Build failed in Jenkins: Hadoop-Common-trunk #2334
Date Thu, 04 Feb 2016 09:53:11 GMT
See <https://builds.apache.org/job/Hadoop-Common-trunk/2334/changes>

Changes:

[vvasudev] YARN-4669. Fix logging statements in resource manager's Application

------------------------------------------
[...truncated 5093 lines...]
Running org.apache.hadoop.security.ssl.TestSSLFactory
Tests run: 15, Failures: 0, Errors: 0, Skipped: 0, Time elapsed: 4.795 sec - in org.apache.hadoop.security.ssl.TestSSLFactory
Running org.apache.hadoop.security.ssl.TestReloadingX509TrustManager
Tests run: 5, Failures: 0, Errors: 0, Skipped: 0, Time elapsed: 2.795 sec - in org.apache.hadoop.security.ssl.TestReloadingX509TrustManager
Running org.apache.hadoop.security.TestUGILoginFromKeytab
Tests run: 1, Failures: 0, Errors: 0, Skipped: 0, Time elapsed: 6.674 sec - in org.apache.hadoop.security.TestUGILoginFromKeytab
Running org.apache.hadoop.security.TestUserGroupInformation
Tests run: 35, Failures: 0, Errors: 0, Skipped: 0, Time elapsed: 4.321 sec - in org.apache.hadoop.security.TestUserGroupInformation
Running org.apache.hadoop.security.TestUGIWithExternalKdc
Tests run: 1, Failures: 0, Errors: 0, Skipped: 1, Time elapsed: 0.116 sec - in org.apache.hadoop.security.TestUGIWithExternalKdc
Running org.apache.hadoop.security.http.TestRestCsrfPreventionFilter
Tests run: 8, Failures: 0, Errors: 0, Skipped: 0, Time elapsed: 0.476 sec - in org.apache.hadoop.security.http.TestRestCsrfPreventionFilter
Running org.apache.hadoop.security.http.TestCrossOriginFilter
Tests run: 9, Failures: 0, Errors: 0, Skipped: 0, Time elapsed: 0.6 sec - in org.apache.hadoop.security.http.TestCrossOriginFilter
Running org.apache.hadoop.security.TestProxyUserFromEnv
Tests run: 1, Failures: 0, Errors: 0, Skipped: 0, Time elapsed: 0.787 sec - in org.apache.hadoop.security.TestProxyUserFromEnv
Running org.apache.hadoop.security.authorize.TestProxyUsers
Tests run: 17, Failures: 0, Errors: 0, Skipped: 0, Time elapsed: 1.22 sec - in org.apache.hadoop.security.authorize.TestProxyUsers
Running org.apache.hadoop.security.authorize.TestProxyServers
Tests run: 1, Failures: 0, Errors: 0, Skipped: 0, Time elapsed: 0.519 sec - in org.apache.hadoop.security.authorize.TestProxyServers
Running org.apache.hadoop.security.authorize.TestServiceAuthorization
Tests run: 7, Failures: 0, Errors: 0, Skipped: 0, Time elapsed: 1.579 sec - in org.apache.hadoop.security.authorize.TestServiceAuthorization
Running org.apache.hadoop.security.authorize.TestAccessControlList
Tests run: 8, Failures: 0, Errors: 0, Skipped: 0, Time elapsed: 1.194 sec - in org.apache.hadoop.security.authorize.TestAccessControlList
Running org.apache.hadoop.security.alias.TestCredShell
Tests run: 9, Failures: 0, Errors: 0, Skipped: 0, Time elapsed: 1.738 sec - in org.apache.hadoop.security.alias.TestCredShell
Running org.apache.hadoop.security.alias.TestCredentialProviderFactory
Tests run: 6, Failures: 0, Errors: 0, Skipped: 0, Time elapsed: 1.766 sec - in org.apache.hadoop.security.alias.TestCredentialProviderFactory
Running org.apache.hadoop.security.alias.TestCredentialProvider
Tests run: 2, Failures: 0, Errors: 0, Skipped: 0, Time elapsed: 0.092 sec - in org.apache.hadoop.security.alias.TestCredentialProvider
Running org.apache.hadoop.security.TestAuthenticationFilter
Tests run: 1, Failures: 0, Errors: 0, Skipped: 0, Time elapsed: 0.675 sec - in org.apache.hadoop.security.TestAuthenticationFilter
Running org.apache.hadoop.security.TestLdapGroupsMapping
Tests run: 5, Failures: 0, Errors: 0, Skipped: 0, Time elapsed: 1.676 sec - in org.apache.hadoop.security.TestLdapGroupsMapping
Running org.apache.hadoop.security.token.TestToken
Tests run: 3, Failures: 0, Errors: 0, Skipped: 0, Time elapsed: 0.519 sec - in org.apache.hadoop.security.token.TestToken
Running org.apache.hadoop.security.token.delegation.TestDelegationToken
Tests run: 15, Failures: 0, Errors: 0, Skipped: 0, Time elapsed: 32.117 sec - in org.apache.hadoop.security.token.delegation.TestDelegationToken
Running org.apache.hadoop.security.token.delegation.web.TestDelegationTokenAuthenticationHandlerWithMocks
Tests run: 2, Failures: 0, Errors: 0, Skipped: 0, Time elapsed: 1.809 sec - in org.apache.hadoop.security.token.delegation.web.TestDelegationTokenAuthenticationHandlerWithMocks
Running org.apache.hadoop.security.token.delegation.web.TestDelegationTokenManager
Tests run: 2, Failures: 0, Errors: 0, Skipped: 0, Time elapsed: 1.097 sec - in org.apache.hadoop.security.token.delegation.web.TestDelegationTokenManager
Running org.apache.hadoop.security.token.delegation.web.TestWebDelegationToken
Tests run: 12, Failures: 0, Errors: 0, Skipped: 0, Time elapsed: 12.493 sec - in org.apache.hadoop.security.token.delegation.web.TestWebDelegationToken
Running org.apache.hadoop.security.token.delegation.TestZKDelegationTokenSecretManager
Tests run: 6, Failures: 0, Errors: 0, Skipped: 0, Time elapsed: 73.59 sec - in org.apache.hadoop.security.token.delegation.TestZKDelegationTokenSecretManager
Running org.apache.hadoop.security.TestShellBasedUnixGroupsMapping
Tests run: 4, Failures: 0, Errors: 0, Skipped: 0, Time elapsed: 0.417 sec - in org.apache.hadoop.security.TestShellBasedUnixGroupsMapping
Running org.apache.hadoop.security.TestShellBasedIdMapping
Tests run: 7, Failures: 0, Errors: 0, Skipped: 0, Time elapsed: 3.1 sec - in org.apache.hadoop.security.TestShellBasedIdMapping
Running org.apache.hadoop.security.TestCompositeGroupMapping
Tests run: 3, Failures: 0, Errors: 0, Skipped: 0, Time elapsed: 0.889 sec - in org.apache.hadoop.security.TestCompositeGroupMapping
Running org.apache.hadoop.security.TestSecurityUtil
Tests run: 17, Failures: 0, Errors: 0, Skipped: 0, Time elapsed: 1.004 sec - in org.apache.hadoop.security.TestSecurityUtil
Running org.apache.hadoop.security.TestHttpCrossOriginFilterInitializer
Tests run: 1, Failures: 0, Errors: 0, Skipped: 0, Time elapsed: 0.411 sec - in org.apache.hadoop.security.TestHttpCrossOriginFilterInitializer
Running org.apache.hadoop.security.TestJNIGroupsMapping
Tests run: 1, Failures: 0, Errors: 0, Skipped: 0, Time elapsed: 0.81 sec - in org.apache.hadoop.security.TestJNIGroupsMapping
Running org.apache.hadoop.security.TestLdapGroupsMappingWithPosixGroup
Tests run: 1, Failures: 0, Errors: 0, Skipped: 0, Time elapsed: 0.807 sec - in org.apache.hadoop.security.TestLdapGroupsMappingWithPosixGroup
Running org.apache.hadoop.security.TestDoAsEffectiveUser
Tests run: 9, Failures: 0, Errors: 0, Skipped: 0, Time elapsed: 1.877 sec - in org.apache.hadoop.security.TestDoAsEffectiveUser
Running org.apache.hadoop.security.TestNullGroupsMapping
Tests run: 1, Failures: 0, Errors: 0, Skipped: 0, Time elapsed: 0.095 sec - in org.apache.hadoop.security.TestNullGroupsMapping
Running org.apache.hadoop.security.TestUGIWithSecurityOn
Tests run: 2, Failures: 0, Errors: 0, Skipped: 2, Time elapsed: 0.109 sec - in org.apache.hadoop.security.TestUGIWithSecurityOn
Running org.apache.hadoop.security.TestWhitelistBasedResolver
Tests run: 3, Failures: 0, Errors: 0, Skipped: 0, Time elapsed: 0.677 sec - in org.apache.hadoop.security.TestWhitelistBasedResolver
Running org.apache.hadoop.security.TestCredentials
Tests run: 4, Failures: 0, Errors: 0, Skipped: 0, Time elapsed: 0.643 sec - in org.apache.hadoop.security.TestCredentials
Running org.apache.hadoop.security.TestGroupFallback
Tests run: 4, Failures: 0, Errors: 0, Skipped: 0, Time elapsed: 0.933 sec - in org.apache.hadoop.security.TestGroupFallback
Running org.apache.hadoop.util.TestLightWeightCache
Tests run: 1, Failures: 0, Errors: 0, Skipped: 0, Time elapsed: 12.208 sec - in org.apache.hadoop.util.TestLightWeightCache
Running org.apache.hadoop.util.TestHostsFileReader
Tests run: 7, Failures: 0, Errors: 0, Skipped: 0, Time elapsed: 0.201 sec - in org.apache.hadoop.util.TestHostsFileReader
Running org.apache.hadoop.util.TestDiskChecker
Tests run: 15, Failures: 0, Errors: 0, Skipped: 0, Time elapsed: 1.567 sec - in org.apache.hadoop.util.TestDiskChecker
Running org.apache.hadoop.util.TestProgress
Tests run: 1, Failures: 0, Errors: 0, Skipped: 0, Time elapsed: 0.198 sec - in org.apache.hadoop.util.TestProgress
Running org.apache.hadoop.util.TestGenericsUtil
Tests run: 6, Failures: 0, Errors: 0, Skipped: 0, Time elapsed: 0.452 sec - in org.apache.hadoop.util.TestGenericsUtil
Running org.apache.hadoop.util.TestChunkedArrayList
Tests run: 5, Failures: 0, Errors: 0, Skipped: 0, Time elapsed: 0.973 sec - in org.apache.hadoop.util.TestChunkedArrayList
Running org.apache.hadoop.util.TestVersionUtil
Tests run: 1, Failures: 0, Errors: 0, Skipped: 0, Time elapsed: 0.214 sec - in org.apache.hadoop.util.TestVersionUtil
Running org.apache.hadoop.util.TestProtoUtil
Tests run: 2, Failures: 0, Errors: 0, Skipped: 0, Time elapsed: 0.341 sec - in org.apache.hadoop.util.TestProtoUtil
Running org.apache.hadoop.util.TestLightWeightGSet
Tests run: 2, Failures: 0, Errors: 0, Skipped: 0, Time elapsed: 0.238 sec - in org.apache.hadoop.util.TestLightWeightGSet
Running org.apache.hadoop.util.TestGSet
Tests run: 7, Failures: 0, Errors: 0, Skipped: 0, Time elapsed: 2.239 sec - in org.apache.hadoop.util.TestGSet
Running org.apache.hadoop.util.TestStringInterner
Tests run: 3, Failures: 0, Errors: 0, Skipped: 0, Time elapsed: 0.117 sec - in org.apache.hadoop.util.TestStringInterner
Running org.apache.hadoop.util.TestZKUtil
Tests run: 9, Failures: 0, Errors: 0, Skipped: 0, Time elapsed: 0.14 sec - in org.apache.hadoop.util.TestZKUtil
Running org.apache.hadoop.util.TestStringUtils
Tests run: 14, Failures: 0, Errors: 0, Skipped: 0, Time elapsed: 0.474 sec - in org.apache.hadoop.util.TestStringUtils
Running org.apache.hadoop.util.TestFindClass
Tests run: 16, Failures: 0, Errors: 0, Skipped: 0, Time elapsed: 1.245 sec - in org.apache.hadoop.util.TestFindClass
Running org.apache.hadoop.util.TestGenericOptionsParser
Tests run: 7, Failures: 0, Errors: 0, Skipped: 0, Time elapsed: 1.472 sec - in org.apache.hadoop.util.TestGenericOptionsParser
Running org.apache.hadoop.util.TestRunJar
Tests run: 3, Failures: 0, Errors: 0, Skipped: 0, Time elapsed: 0.595 sec - in org.apache.hadoop.util.TestRunJar
Running org.apache.hadoop.util.TestSysInfoLinux
Tests run: 5, Failures: 0, Errors: 0, Skipped: 0, Time elapsed: 0.389 sec - in org.apache.hadoop.util.TestSysInfoLinux
Running org.apache.hadoop.util.TestDirectBufferPool
Tests run: 3, Failures: 0, Errors: 0, Skipped: 0, Time elapsed: 0.3 sec - in org.apache.hadoop.util.TestDirectBufferPool
Running org.apache.hadoop.util.TestFileBasedIPList
Tests run: 8, Failures: 0, Errors: 0, Skipped: 0, Time elapsed: 0.224 sec - in org.apache.hadoop.util.TestFileBasedIPList
Running org.apache.hadoop.util.TestIndexedSort
Tests run: 2, Failures: 0, Errors: 0, Skipped: 0, Time elapsed: 0.901 sec - in org.apache.hadoop.util.TestIndexedSort
Running org.apache.hadoop.util.TestIdentityHashStore
Tests run: 3, Failures: 0, Errors: 0, Skipped: 0, Time elapsed: 0.25 sec - in org.apache.hadoop.util.TestIdentityHashStore
Running org.apache.hadoop.util.TestMachineList
Tests run: 14, Failures: 0, Errors: 0, Skipped: 0, Time elapsed: 0.754 sec - in org.apache.hadoop.util.TestMachineList
Running org.apache.hadoop.util.TestWinUtils
Tests run: 11, Failures: 0, Errors: 0, Skipped: 11, Time elapsed: 0.314 sec - in org.apache.hadoop.util.TestWinUtils
Running org.apache.hadoop.util.hash.TestHash
Tests run: 1, Failures: 0, Errors: 0, Skipped: 0, Time elapsed: 0.619 sec - in org.apache.hadoop.util.hash.TestHash
Running org.apache.hadoop.util.TestSignalLogger
Tests run: 1, Failures: 0, Errors: 0, Skipped: 0, Time elapsed: 0.24 sec - in org.apache.hadoop.util.TestSignalLogger
Running org.apache.hadoop.util.TestApplicationClassLoader
Tests run: 4, Failures: 0, Errors: 0, Skipped: 0, Time elapsed: 0.337 sec - in org.apache.hadoop.util.TestApplicationClassLoader
Running org.apache.hadoop.util.TestNodeHealthScriptRunner
Tests run: 2, Failures: 0, Errors: 0, Skipped: 0, Time elapsed: 5.066 sec - in org.apache.hadoop.util.TestNodeHealthScriptRunner
Running org.apache.hadoop.util.TestCacheableIPList
Tests run: 4, Failures: 0, Errors: 0, Skipped: 0, Time elapsed: 1.302 sec - in org.apache.hadoop.util.TestCacheableIPList
Running org.apache.hadoop.util.TestSysInfoWindows
Tests run: 4, Failures: 0, Errors: 0, Skipped: 0, Time elapsed: 0.174 sec - in org.apache.hadoop.util.TestSysInfoWindows
Running org.apache.hadoop.util.TestClassUtil
Tests run: 1, Failures: 0, Errors: 0, Skipped: 0, Time elapsed: 0.102 sec - in org.apache.hadoop.util.TestClassUtil
Running org.apache.hadoop.util.TestOptions
Tests run: 2, Failures: 0, Errors: 0, Skipped: 0, Time elapsed: 0.085 sec - in org.apache.hadoop.util.TestOptions
Running org.apache.hadoop.util.TestShell
Tests run: 20, Failures: 0, Errors: 0, Skipped: 0, Time elapsed: 5.372 sec - in org.apache.hadoop.util.TestShell
Running org.apache.hadoop.util.TestAsyncDiskService
Tests run: 1, Failures: 0, Errors: 0, Skipped: 0, Time elapsed: 0.215 sec - in org.apache.hadoop.util.TestAsyncDiskService
Running org.apache.hadoop.util.TestPureJavaCrc32
Tests run: 1, Failures: 0, Errors: 0, Skipped: 0, Time elapsed: 0.751 sec - in org.apache.hadoop.util.TestPureJavaCrc32
Running org.apache.hadoop.util.TestDataChecksum
Tests run: 4, Failures: 0, Errors: 0, Skipped: 0, Time elapsed: 5.463 sec - in org.apache.hadoop.util.TestDataChecksum
Running org.apache.hadoop.util.TestShutdownThreadsHelper
Tests run: 2, Failures: 0, Errors: 0, Skipped: 0, Time elapsed: 3.224 sec - in org.apache.hadoop.util.TestShutdownThreadsHelper
Running org.apache.hadoop.util.TestHttpExceptionUtils
Tests run: 7, Failures: 0, Errors: 0, Skipped: 0, Time elapsed: 0.864 sec - in org.apache.hadoop.util.TestHttpExceptionUtils
Running org.apache.hadoop.util.TestNativeCodeLoader
Tests run: 1, Failures: 0, Errors: 0, Skipped: 0, Time elapsed: 0.192 sec - in org.apache.hadoop.util.TestNativeCodeLoader
Running org.apache.hadoop.util.TestReflectionUtils
Tests run: 5, Failures: 0, Errors: 0, Skipped: 0, Time elapsed: 0.746 sec - in org.apache.hadoop.util.TestReflectionUtils
Running org.apache.hadoop.util.TestNativeLibraryChecker
Tests run: 2, Failures: 0, Errors: 0, Skipped: 0, Time elapsed: 0.629 sec - in org.apache.hadoop.util.TestNativeLibraryChecker
Running org.apache.hadoop.util.TestShutdownHookManager
Tests run: 1, Failures: 0, Errors: 0, Skipped: 0, Time elapsed: 0.218 sec - in org.apache.hadoop.util.TestShutdownHookManager
Running org.apache.hadoop.util.TestClasspath
Tests run: 7, Failures: 0, Errors: 0, Skipped: 0, Time elapsed: 0.526 sec - in org.apache.hadoop.util.TestClasspath
Running org.apache.hadoop.util.TestLightWeightResizableGSet
Tests run: 2, Failures: 0, Errors: 0, Skipped: 0, Time elapsed: 0.696 sec - in org.apache.hadoop.util.TestLightWeightResizableGSet
Running org.apache.hadoop.util.bloom.TestBloomFilters
Tests run: 6, Failures: 0, Errors: 0, Skipped: 0, Time elapsed: 0.616 sec - in org.apache.hadoop.util.bloom.TestBloomFilters
Running org.apache.hadoop.util.TestConfTest
Tests run: 14, Failures: 0, Errors: 0, Skipped: 0, Time elapsed: 0.42 sec - in org.apache.hadoop.util.TestConfTest
Running org.apache.hadoop.util.TestStopWatch
Tests run: 3, Failures: 0, Errors: 0, Skipped: 0, Time elapsed: 0.09 sec - in org.apache.hadoop.util.TestStopWatch
Running org.apache.hadoop.util.TestJarFinder
Tests run: 4, Failures: 0, Errors: 0, Skipped: 0, Time elapsed: 0.916 sec - in org.apache.hadoop.util.TestJarFinder
Running org.apache.hadoop.util.curator.TestChildReaper
Tests run: 4, Failures: 0, Errors: 0, Skipped: 0, Time elapsed: 53.124 sec - in org.apache.hadoop.util.curator.TestChildReaper
Running org.apache.hadoop.util.TestLineReader
Tests run: 1, Failures: 0, Errors: 0, Skipped: 0, Time elapsed: 0.246 sec - in org.apache.hadoop.util.TestLineReader
Running org.apache.hadoop.util.TestNativeCrc32
Tests run: 22, Failures: 0, Errors: 0, Skipped: 0, Time elapsed: 1.241 sec - in org.apache.hadoop.util.TestNativeCrc32
Running org.apache.hadoop.log.TestLog4Json
Tests run: 5, Failures: 0, Errors: 0, Skipped: 0, Time elapsed: 0.591 sec - in org.apache.hadoop.log.TestLog4Json
Running org.apache.hadoop.log.TestLogLevel
Tests run: 1, Failures: 0, Errors: 0, Skipped: 0, Time elapsed: 1.09 sec - in org.apache.hadoop.log.TestLogLevel
Running org.apache.hadoop.conf.TestReconfiguration
Tests run: 5, Failures: 0, Errors: 0, Skipped: 0, Time elapsed: 2.823 sec - in org.apache.hadoop.conf.TestReconfiguration
Running org.apache.hadoop.conf.TestConfServlet
Tests run: 3, Failures: 0, Errors: 0, Skipped: 0, Time elapsed: 0.867 sec - in org.apache.hadoop.conf.TestConfServlet
Running org.apache.hadoop.conf.TestConfiguration
Tests run: 62, Failures: 0, Errors: 0, Skipped: 0, Time elapsed: 5.624 sec - in org.apache.hadoop.conf.TestConfiguration
Running org.apache.hadoop.conf.TestConfigurationSubclass
Tests run: 3, Failures: 0, Errors: 0, Skipped: 0, Time elapsed: 0.529 sec - in org.apache.hadoop.conf.TestConfigurationSubclass
Running org.apache.hadoop.conf.TestGetInstances
Tests run: 1, Failures: 0, Errors: 0, Skipped: 0, Time elapsed: 0.417 sec - in org.apache.hadoop.conf.TestGetInstances
Running org.apache.hadoop.conf.TestConfigurationDeprecation
Tests run: 9, Failures: 0, Errors: 0, Skipped: 0, Time elapsed: 14.4 sec - in org.apache.hadoop.conf.TestConfigurationDeprecation
Running org.apache.hadoop.conf.TestDeprecatedKeys
Tests run: 3, Failures: 0, Errors: 0, Skipped: 0, Time elapsed: 0.803 sec - in org.apache.hadoop.conf.TestDeprecatedKeys
Running org.apache.hadoop.tracing.TestTraceUtils
Tests run: 3, Failures: 0, Errors: 0, Skipped: 0, Time elapsed: 0.782 sec - in org.apache.hadoop.tracing.TestTraceUtils
Running org.apache.hadoop.cli.TestCLI
Tests run: 1, Failures: 0, Errors: 0, Skipped: 0, Time elapsed: 0.945 sec - in org.apache.hadoop.cli.TestCLI
Running org.apache.hadoop.metrics.ganglia.TestGangliaContext
Tests run: 5, Failures: 0, Errors: 0, Skipped: 0, Time elapsed: 0.264 sec - in org.apache.hadoop.metrics.ganglia.TestGangliaContext
Running org.apache.hadoop.metrics.spi.TestOutputRecord
Tests run: 1, Failures: 0, Errors: 0, Skipped: 0, Time elapsed: 0.064 sec - in org.apache.hadoop.metrics.spi.TestOutputRecord
Running org.apache.hadoop.metrics.TestMetricsServlet
Tests run: 3, Failures: 0, Errors: 0, Skipped: 0, Time elapsed: 0.125 sec - in org.apache.hadoop.metrics.TestMetricsServlet

Results :

Failed tests: 
  TestDNS.testLookupWithoutHostsFallback:231 
Expected: is "-DUMMY_HOSTNAME"
     but: was "localhost"

Tests run: 3270, Failures: 1, Errors: 0, Skipped: 86

[INFO] ------------------------------------------------------------------------
[INFO] Reactor Summary:
[INFO] 
[INFO] Apache Hadoop Annotations ......................... SUCCESS [ 12.648 s]
[INFO] Apache Hadoop MiniKDC ............................. SUCCESS [ 29.583 s]
[INFO] Apache Hadoop Auth ................................ SUCCESS [04:17 min]
[INFO] Apache Hadoop Auth Examples ....................... SUCCESS [  5.197 s]
[INFO] Apache Hadoop Common .............................. FAILURE [26:35 min]
[INFO] Apache Hadoop NFS ................................. SKIPPED
[INFO] Apache Hadoop KMS ................................. SKIPPED
[INFO] Apache Hadoop Common Project ...................... SKIPPED
[INFO] ------------------------------------------------------------------------
[INFO] BUILD FAILURE
[INFO] ------------------------------------------------------------------------
[INFO] Total time: 31:41 min
[INFO] Finished at: 2016-02-04T09:53:04+00:00
[INFO] Final Memory: 87M/912M
[INFO] ------------------------------------------------------------------------
[ERROR] Failed to execute goal org.apache.maven.plugins:maven-surefire-plugin:2.17:test (default-test)
on project hadoop-common: There are test failures.
[ERROR] 
[ERROR] Please refer to <https://builds.apache.org/job/Hadoop-Common-trunk/ws/hadoop-common-project/hadoop-common/target/surefire-reports>
for the individual test results.
[ERROR] -> [Help 1]
[ERROR] 
[ERROR] To see the full stack trace of the errors, re-run Maven with the -e switch.
[ERROR] Re-run Maven using the -X switch to enable full debug logging.
[ERROR] 
[ERROR] For more information about the errors and possible solutions, please read the following
articles:
[ERROR] [Help 1] http://cwiki.apache.org/confluence/display/MAVEN/MojoFailureException
[ERROR] 
[ERROR] After correcting the problems, you can resume the build with the command
[ERROR]   mvn <goals> -rf :hadoop-common
result: 1

################
# mvn -eaf test -Pclover -DcloverLicenseLocation=/home/jenkins/tools/clover/latest/lib/clover.license
################
Build step 'Execute shell' marked build as failure
Archiving artifacts
Recording test results

Mime
View raw message