hadoop-common-dev mailing list archives

Site index · List index
Message view « Date » · « Thread »
Top « Date » · « Thread »
From Apache Jenkins Server <jenk...@builds.apache.org>
Subject Build failed in Jenkins: Hadoop-common-trunk-Java8 #1118
Date Tue, 23 Feb 2016 10:00:25 GMT
See <https://builds.apache.org/job/Hadoop-common-trunk-Java8/1118/changes>

Changes:

[vvasudev] MAPREDUCE-6635. Unsafe long to int conversion in

------------------------------------------
[...truncated 3624 lines...]
[INFO] Installing <https://builds.apache.org/job/Hadoop-common-trunk-Java8/ws/hadoop-dist/target/hadoop-dist-3.0.0-SNAPSHOT.jar>
to /home/jenkins/.m2/repository/org/apache/hadoop/hadoop-dist/3.0.0-SNAPSHOT/hadoop-dist-3.0.0-SNAPSHOT.jar
[INFO] Installing <https://builds.apache.org/job/Hadoop-common-trunk-Java8/ws/hadoop-dist/pom.xml>
to /home/jenkins/.m2/repository/org/apache/hadoop/hadoop-dist/3.0.0-SNAPSHOT/hadoop-dist-3.0.0-SNAPSHOT.pom
[INFO] ------------------------------------------------------------------------
[INFO] Reactor Summary:
[INFO] 
[INFO] Apache Hadoop Main ................................ SUCCESS [  2.200 s]
[INFO] Apache Hadoop Build Tools ......................... SUCCESS [  1.284 s]
[INFO] Apache Hadoop Project POM ......................... SUCCESS [  1.336 s]
[INFO] Apache Hadoop Annotations ......................... SUCCESS [  3.092 s]
[INFO] Apache Hadoop Project Dist POM .................... SUCCESS [  0.712 s]
[INFO] Apache Hadoop Assemblies .......................... SUCCESS [  0.325 s]
[INFO] Apache Hadoop Maven Plugins ....................... SUCCESS [  4.615 s]
[INFO] Apache Hadoop MiniKDC ............................. SUCCESS [  2.508 s]
[INFO] Apache Hadoop Auth ................................ SUCCESS [  5.373 s]
[INFO] Apache Hadoop Auth Examples ....................... SUCCESS [  2.239 s]
[INFO] Apache Hadoop Common .............................. SUCCESS [ 36.106 s]
[INFO] Apache Hadoop NFS ................................. SUCCESS [  1.761 s]
[INFO] Apache Hadoop KMS ................................. SUCCESS [  4.997 s]
[INFO] Apache Hadoop Common Project ...................... SUCCESS [  0.082 s]
[INFO] Apache Hadoop HDFS Client ......................... SUCCESS [ 23.890 s]
[INFO] Apache Hadoop HDFS ................................ SUCCESS [ 28.479 s]
[INFO] Apache Hadoop HDFS Native Client .................. SUCCESS [  0.523 s]
[INFO] Apache Hadoop HttpFS .............................. SUCCESS [ 19.685 s]
[INFO] Apache Hadoop HDFS BookKeeper Journal ............. SUCCESS [  1.348 s]
[INFO] Apache Hadoop HDFS-NFS ............................ SUCCESS [  0.954 s]
[INFO] Apache Hadoop HDFS Project ........................ SUCCESS [  0.042 s]
[INFO] Apache Hadoop YARN ................................ SUCCESS [  0.050 s]
[INFO] Apache Hadoop YARN API ............................ SUCCESS [  8.870 s]
[INFO] Apache Hadoop YARN Common ......................... SUCCESS [  7.469 s]
[INFO] Apache Hadoop YARN Server ......................... SUCCESS [  0.108 s]
[INFO] Apache Hadoop YARN Server Common .................. SUCCESS [  2.098 s]
[INFO] Apache Hadoop YARN NodeManager .................... SUCCESS [  4.349 s]
[INFO] Apache Hadoop YARN Web Proxy ...................... SUCCESS [  1.479 s]
[INFO] Apache Hadoop YARN ApplicationHistoryService ...... SUCCESS [  1.718 s]
[INFO] Apache Hadoop YARN ResourceManager ................ SUCCESS [  8.348 s]
[INFO] Apache Hadoop YARN Server Tests ................... SUCCESS [  1.055 s]
[INFO] Apache Hadoop YARN Client ......................... SUCCESS [  1.805 s]
[INFO] Apache Hadoop YARN SharedCacheManager ............. SUCCESS [  0.512 s]
[INFO] Apache Hadoop YARN Timeline Plugin Storage ........ SUCCESS [  0.793 s]
[INFO] Apache Hadoop YARN Applications ................... SUCCESS [  0.111 s]
[INFO] Apache Hadoop YARN DistributedShell ............... SUCCESS [  0.643 s]
[INFO] Apache Hadoop YARN Unmanaged Am Launcher .......... SUCCESS [  0.358 s]
[INFO] Apache Hadoop YARN Site ........................... SUCCESS [  0.052 s]
[INFO] Apache Hadoop YARN Registry ....................... SUCCESS [  0.877 s]
[INFO] Apache Hadoop YARN Project ........................ SUCCESS [  0.167 s]
[INFO] Apache Hadoop MapReduce Client .................... SUCCESS [  0.146 s]
[INFO] Apache Hadoop MapReduce Core ...................... SUCCESS [  5.532 s]
[INFO] Apache Hadoop MapReduce Common .................... SUCCESS [  3.118 s]
[INFO] Apache Hadoop MapReduce Shuffle ................... SUCCESS [  0.680 s]
[INFO] Apache Hadoop MapReduce App ....................... SUCCESS [  3.101 s]
[INFO] Apache Hadoop MapReduce HistoryServer ............. SUCCESS [  1.385 s]
[INFO] Apache Hadoop MapReduce JobClient ................. SUCCESS [  4.255 s]
[INFO] Apache Hadoop MapReduce HistoryServer Plugins ..... SUCCESS [  0.292 s]
[INFO] Apache Hadoop MapReduce NativeTask ................ SUCCESS [  0.681 s]
[INFO] Apache Hadoop MapReduce Examples .................. SUCCESS [  1.154 s]
[INFO] Apache Hadoop MapReduce ........................... SUCCESS [  0.141 s]
[INFO] Apache Hadoop MapReduce Streaming ................. SUCCESS [  1.255 s]
[INFO] Apache Hadoop Distributed Copy .................... SUCCESS [  1.921 s]
[INFO] Apache Hadoop Archives ............................ SUCCESS [  0.364 s]
[INFO] Apache Hadoop Archive Logs ........................ SUCCESS [  0.464 s]
[INFO] Apache Hadoop Rumen ............................... SUCCESS [  0.992 s]
[INFO] Apache Hadoop Gridmix ............................. SUCCESS [  1.275 s]
[INFO] Apache Hadoop Data Join ........................... SUCCESS [  0.351 s]
[INFO] Apache Hadoop Ant Tasks ........................... SUCCESS [  0.167 s]
[INFO] Apache Hadoop Extras .............................. SUCCESS [  0.452 s]
[INFO] Apache Hadoop Pipes ............................... SUCCESS [  0.031 s]
[INFO] Apache Hadoop OpenStack support ................... SUCCESS [  0.430 s]
[INFO] Apache Hadoop Amazon Web Services support ......... SUCCESS [  0.618 s]
[INFO] Apache Hadoop Azure support ....................... SUCCESS [  1.050 s]
[INFO] Apache Hadoop Client .............................. SUCCESS [  0.821 s]
[INFO] Apache Hadoop Mini-Cluster ........................ SUCCESS [  0.203 s]
[INFO] Apache Hadoop Scheduler Load Simulator ............ SUCCESS [  1.880 s]
[INFO] Apache Hadoop Tools Dist .......................... SUCCESS [  0.319 s]
[INFO] Apache Hadoop Kafka Library support ............... SUCCESS [  0.475 s]
[INFO] Apache Hadoop Tools ............................... SUCCESS [  0.066 s]
[INFO] Apache Hadoop Distribution ........................ SUCCESS [  0.085 s]
[INFO] ------------------------------------------------------------------------
[INFO] BUILD SUCCESS
[INFO] ------------------------------------------------------------------------
[INFO] Total time: 03:41 min
[INFO] Finished at: 2016-02-23T09:59:55+00:00
[INFO] Final Memory: 251M/1041M
[INFO] ------------------------------------------------------------------------
Java HotSpot(TM) 64-Bit Server VM warning: ignoring option MaxPermSize=768m; support was removed
in 8.0
[INFO] Error stacktraces are turned on.
[INFO] Scanning for projects...
[INFO] ------------------------------------------------------------------------
[INFO] Reactor Build Order:
[INFO] 
[INFO] Apache Hadoop Annotations
[INFO] Apache Hadoop MiniKDC
[INFO] Apache Hadoop Auth
[INFO] Apache Hadoop Auth Examples
[INFO] Apache Hadoop Common
[INFO] Apache Hadoop NFS
[INFO] Apache Hadoop KMS
[INFO] Apache Hadoop Common Project
[INFO] 
[INFO] Using the builder org.apache.maven.lifecycle.internal.builder.singlethreaded.SingleThreadedBuilder
with a thread count of 1
[INFO]                                                                         
[INFO] ------------------------------------------------------------------------
[INFO] Building Apache Hadoop Annotations 3.0.0-SNAPSHOT
[INFO] ------------------------------------------------------------------------
[INFO] 
[INFO] --- maven-clean-plugin:2.5:clean (default-clean) @ hadoop-annotations ---
[INFO] Deleting <https://builds.apache.org/job/Hadoop-common-trunk-Java8/ws/hadoop-common-project/hadoop-annotations/target>
[INFO] 
[INFO] --- maven-antrun-plugin:1.7:run (create-testdirs) @ hadoop-annotations ---
[INFO] Executing tasks

main:
    [mkdir] Created dir: <https://builds.apache.org/job/Hadoop-common-trunk-Java8/ws/hadoop-common-project/hadoop-annotations/target/test-dir>
[INFO] Executed tasks
[INFO] 
[INFO] --- maven-resources-plugin:2.6:resources (default-resources) @ hadoop-annotations ---
[INFO] Using 'UTF-8' encoding to copy filtered resources.
[INFO] skip non existing resourceDirectory <https://builds.apache.org/job/Hadoop-common-trunk-Java8/ws/hadoop-common-project/hadoop-annotations/src/main/resources>
[INFO] 
[INFO] --- maven-compiler-plugin:3.1:compile (default-compile) @ hadoop-annotations ---
[INFO] Compiling 8 source files to <https://builds.apache.org/job/Hadoop-common-trunk-Java8/ws/hadoop-common-project/hadoop-annotations/target/classes>
[INFO] 
[INFO] --- maven-resources-plugin:2.6:testResources (default-testResources) @ hadoop-annotations
---
[INFO] Using 'UTF-8' encoding to copy filtered resources.
[INFO] skip non existing resourceDirectory <https://builds.apache.org/job/Hadoop-common-trunk-Java8/ws/hadoop-common-project/hadoop-annotations/src/test/resources>
[INFO] 
[INFO] --- maven-compiler-plugin:3.1:testCompile (default-testCompile) @ hadoop-annotations
---
[INFO] No sources to compile
[INFO] 
[INFO] --- maven-surefire-plugin:2.17:test (default-test) @ hadoop-annotations ---
[INFO] No tests to run.
[INFO] 
[INFO] --- maven-jar-plugin:2.5:jar (default-jar) @ hadoop-annotations ---
[INFO] Building jar: <https://builds.apache.org/job/Hadoop-common-trunk-Java8/ws/hadoop-common-project/hadoop-annotations/target/hadoop-annotations-3.0.0-SNAPSHOT.jar>
[INFO] 
[INFO] --- maven-source-plugin:2.3:jar-no-fork (hadoop-java-sources) @ hadoop-annotations
---
[INFO] Building jar: <https://builds.apache.org/job/Hadoop-common-trunk-Java8/ws/hadoop-common-project/hadoop-annotations/target/hadoop-annotations-3.0.0-SNAPSHOT-sources.jar>
[INFO] 
[INFO] --- maven-source-plugin:2.3:test-jar-no-fork (hadoop-java-sources) @ hadoop-annotations
---
[INFO] No sources in project. Archive not created.
[INFO] 
[INFO] --- maven-enforcer-plugin:1.3.1:enforce (dist-enforce) @ hadoop-annotations ---
[INFO] 
[INFO] --- maven-site-plugin:3.4:attach-descriptor (attach-descriptor) @ hadoop-annotations
---
[INFO] 
[INFO] --- maven-javadoc-plugin:2.8.1:jar (module-javadocs) @ hadoop-annotations ---
[WARNING] Unable to find the javadoc version: Exit code: 1 - 
Command line was:/home/jenkins/tools/java/jdk1.8.0/jre/../bin/javadoc -J-version
[WARNING] Using the Java the version instead of, i.e. 1.8
[INFO] ------------------------------------------------------------------------
[INFO] Reactor Summary:
[INFO] 
[INFO] Apache Hadoop Annotations ......................... FAILURE [ 10.218 s]
[INFO] Apache Hadoop MiniKDC ............................. SKIPPED
[INFO] Apache Hadoop Auth ................................ SKIPPED
[INFO] Apache Hadoop Auth Examples ....................... SKIPPED
[INFO] Apache Hadoop Common .............................. SKIPPED
[INFO] Apache Hadoop NFS ................................. SKIPPED
[INFO] Apache Hadoop KMS ................................. SKIPPED
[INFO] Apache Hadoop Common Project ...................... SKIPPED
[INFO] ------------------------------------------------------------------------
[INFO] BUILD FAILURE
[INFO] ------------------------------------------------------------------------
[INFO] Total time: 12.750 s
[INFO] Finished at: 2016-02-23T10:00:14+00:00
[INFO] Final Memory: 27M/131M
[INFO] ------------------------------------------------------------------------
[ERROR] Failed to execute goal org.apache.maven.plugins:maven-javadoc-plugin:2.8.1:jar (module-javadocs)
on project hadoop-annotations: MavenReportException: Error while creating archive:
[ERROR] Error occurred during initialization of VM
[ERROR] java.lang.OutOfMemoryError: unable to create new native thread
[ERROR] 
[ERROR] Error occurred during initialization of VM, try to reduce the Java heap size for the
MAVEN_OPTS environnement variable using -Xms:<size> and -Xmx:<size>.
[ERROR] Or, try to reduce the Java heap size for the Javadoc goal using -Dminmemory=<size>
and -Dmaxmemory=<size>.
[ERROR] 
[ERROR] Command line was: /home/jenkins/tools/java/jdk1.8.0/jre/../bin/javadoc @options @packages
[ERROR] 
[ERROR] Refer to the generated Javadoc files in '<https://builds.apache.org/job/Hadoop-common-trunk-Java8/ws/hadoop-common-project/hadoop-annotations/target'>
dir.
[ERROR] -> [Help 1]
org.apache.maven.lifecycle.LifecycleExecutionException: Failed to execute goal org.apache.maven.plugins:maven-javadoc-plugin:2.8.1:jar
(module-javadocs) on project hadoop-annotations: MavenReportException: Error while creating
archive: 
Error occurred during initialization of VM
java.lang.OutOfMemoryError: unable to create new native thread

Error occurred during initialization of VM, try to reduce the Java heap size for the MAVEN_OPTS
environnement variable using -Xms:<size> and -Xmx:<size>.
Or, try to reduce the Java heap size for the Javadoc goal using -Dminmemory=<size> and
-Dmaxmemory=<size>.

Command line was: /home/jenkins/tools/java/jdk1.8.0/jre/../bin/javadoc @options @packages

Refer to the generated Javadoc files in '<https://builds.apache.org/job/Hadoop-common-trunk-Java8/ws/hadoop-common-project/hadoop-annotations/target'>
dir.

	at org.apache.maven.lifecycle.internal.MojoExecutor.execute(MojoExecutor.java:216)
	at org.apache.maven.lifecycle.internal.MojoExecutor.execute(MojoExecutor.java:153)
	at org.apache.maven.lifecycle.internal.MojoExecutor.execute(MojoExecutor.java:145)
	at org.apache.maven.lifecycle.internal.LifecycleModuleBuilder.buildProject(LifecycleModuleBuilder.java:108)
	at org.apache.maven.lifecycle.internal.LifecycleModuleBuilder.buildProject(LifecycleModuleBuilder.java:76)
	at org.apache.maven.lifecycle.internal.builder.singlethreaded.SingleThreadedBuilder.build(SingleThreadedBuilder.java:51)
	at org.apache.maven.lifecycle.internal.LifecycleStarter.execute(LifecycleStarter.java:116)
	at org.apache.maven.DefaultMaven.doExecute(DefaultMaven.java:361)
	at org.apache.maven.DefaultMaven.execute(DefaultMaven.java:155)
	at org.apache.maven.cli.MavenCli.execute(MavenCli.java:584)
	at org.apache.maven.cli.MavenCli.doMain(MavenCli.java:213)
	at org.apache.maven.cli.MavenCli.main(MavenCli.java:157)
	at sun.reflect.NativeMethodAccessorImpl.invoke0(Native Method)
	at sun.reflect.NativeMethodAccessorImpl.invoke(NativeMethodAccessorImpl.java:62)
	at sun.reflect.DelegatingMethodAccessorImpl.invoke(DelegatingMethodAccessorImpl.java:43)
	at java.lang.reflect.Method.invoke(Method.java:483)
	at org.codehaus.plexus.classworlds.launcher.Launcher.launchEnhanced(Launcher.java:289)
	at org.codehaus.plexus.classworlds.launcher.Launcher.launch(Launcher.java:229)
	at org.codehaus.plexus.classworlds.launcher.Launcher.mainWithExitCode(Launcher.java:415)
	at org.codehaus.plexus.classworlds.launcher.Launcher.main(Launcher.java:356)
Caused by: org.apache.maven.plugin.MojoExecutionException: MavenReportException: Error while
creating archive: 
Error occurred during initialization of VM
java.lang.OutOfMemoryError: unable to create new native thread

Error occurred during initialization of VM, try to reduce the Java heap size for the MAVEN_OPTS
environnement variable using -Xms:<size> and -Xmx:<size>.
Or, try to reduce the Java heap size for the Javadoc goal using -Dminmemory=<size> and
-Dmaxmemory=<size>.

Command line was: /home/jenkins/tools/java/jdk1.8.0/jre/../bin/javadoc @options @packages

Refer to the generated Javadoc files in '<https://builds.apache.org/job/Hadoop-common-trunk-Java8/ws/hadoop-common-project/hadoop-annotations/target'>
dir.

	at org.apache.maven.plugin.javadoc.AbstractJavadocMojo.failOnError(AbstractJavadocMojo.java:5861)
	at org.apache.maven.plugin.javadoc.JavadocJar.execute(JavadocJar.java:207)
	at org.apache.maven.plugin.DefaultBuildPluginManager.executeMojo(DefaultBuildPluginManager.java:133)
	at org.apache.maven.lifecycle.internal.MojoExecutor.execute(MojoExecutor.java:208)
	... 19 more
Caused by: org.apache.maven.reporting.MavenReportException: 
Error occurred during initialization of VM
java.lang.OutOfMemoryError: unable to create new native thread

Error occurred during initialization of VM, try to reduce the Java heap size for the MAVEN_OPTS
environnement variable using -Xms:<size> and -Xmx:<size>.
Or, try to reduce the Java heap size for the Javadoc goal using -Dminmemory=<size> and
-Dmaxmemory=<size>.

Command line was: /home/jenkins/tools/java/jdk1.8.0/jre/../bin/javadoc @options @packages

Refer to the generated Javadoc files in '<https://builds.apache.org/job/Hadoop-common-trunk-Java8/ws/hadoop-common-project/hadoop-annotations/target'>
dir.

	at org.apache.maven.plugin.javadoc.AbstractJavadocMojo.executeJavadocCommandLine(AbstractJavadocMojo.java:5057)
	at org.apache.maven.plugin.javadoc.AbstractJavadocMojo.executeReport(AbstractJavadocMojo.java:1997)
	at org.apache.maven.plugin.javadoc.JavadocJar.execute(JavadocJar.java:179)
	... 21 more
[ERROR] 
[ERROR] Re-run Maven using the -X switch to enable full debug logging.
[ERROR] 
[ERROR] For more information about the errors and possible solutions, please read the following
articles:
[ERROR] [Help 1] http://cwiki.apache.org/confluence/display/MAVEN/MojoExecutionException
Build step 'Execute shell' marked build as failure
Archiving artifacts
Recording test results
ERROR: Publisher 'Publish JUnit test result report' failed: No test report files were found.
Configuration error?


Mime
View raw message