hadoop-common-dev mailing list archives

Site index · List index
Message view « Date » · « Thread »
Top « Date » · « Thread »
From Apache Jenkins Server <jenk...@builds.apache.org>
Subject Build failed in Jenkins: Hadoop-Common-trunk #2422
Date Tue, 23 Feb 2016 22:57:44 GMT
See <https://builds.apache.org/job/Hadoop-Common-trunk/2422/changes>

Changes:

[jlowe] YARN-2046. Out of band heartbeats are sent only on container kill and

[zhz] HDFS-9844. Correct path creation in getTrashRoot to handle root dir.

[zhz] HDFS-9816. Erasure Coding: allow to use multiple EC policies in striping

------------------------------------------
[...truncated 8827 lines...]
Generating <https://builds.apache.org/job/Hadoop-Common-trunk/ws/hadoop-common-project/hadoop-nfs/target/org/apache/hadoop/nfs/nfs3/request/class-use/RequestWithHandle.html...>
Generating <https://builds.apache.org/job/Hadoop-Common-trunk/ws/hadoop-common-project/hadoop-nfs/target/org/apache/hadoop/nfs/nfs3/request/class-use/FSINFO3Request.html...>
Generating <https://builds.apache.org/job/Hadoop-Common-trunk/ws/hadoop-common-project/hadoop-nfs/target/org/apache/hadoop/nfs/nfs3/request/class-use/PATHCONF3Request.html...>
Generating <https://builds.apache.org/job/Hadoop-Common-trunk/ws/hadoop-common-project/hadoop-nfs/target/org/apache/hadoop/nfs/nfs3/request/class-use/SYMLINK3Request.html...>
Generating <https://builds.apache.org/job/Hadoop-Common-trunk/ws/hadoop-common-project/hadoop-nfs/target/org/apache/hadoop/nfs/nfs3/request/class-use/CREATE3Request.html...>
Generating <https://builds.apache.org/job/Hadoop-Common-trunk/ws/hadoop-common-project/hadoop-nfs/target/org/apache/hadoop/nfs/nfs3/request/class-use/GETATTR3Request.html...>
Generating <https://builds.apache.org/job/Hadoop-Common-trunk/ws/hadoop-common-project/hadoop-nfs/target/org/apache/hadoop/nfs/nfs3/request/class-use/NFS3Request.html...>
Generating <https://builds.apache.org/job/Hadoop-Common-trunk/ws/hadoop-common-project/hadoop-nfs/target/org/apache/hadoop/nfs/nfs3/request/class-use/READDIR3Request.html...>
Generating <https://builds.apache.org/job/Hadoop-Common-trunk/ws/hadoop-common-project/hadoop-nfs/target/org/apache/hadoop/nfs/nfs3/request/class-use/REMOVE3Request.html...>
Generating <https://builds.apache.org/job/Hadoop-Common-trunk/ws/hadoop-common-project/hadoop-nfs/target/org/apache/hadoop/nfs/nfs3/request/class-use/COMMIT3Request.html...>
Generating <https://builds.apache.org/job/Hadoop-Common-trunk/ws/hadoop-common-project/hadoop-nfs/target/org/apache/hadoop/nfs/nfs3/request/class-use/FSSTAT3Request.html...>
Generating <https://builds.apache.org/job/Hadoop-Common-trunk/ws/hadoop-common-project/hadoop-nfs/target/org/apache/hadoop/nfs/nfs3/request/class-use/MKNOD3Request.html...>
Generating <https://builds.apache.org/job/Hadoop-Common-trunk/ws/hadoop-common-project/hadoop-nfs/target/org/apache/hadoop/nfs/nfs3/request/class-use/RMDIR3Request.html...>
Generating <https://builds.apache.org/job/Hadoop-Common-trunk/ws/hadoop-common-project/hadoop-nfs/target/org/apache/hadoop/nfs/nfs3/request/class-use/READDIRPLUS3Request.html...>
Generating <https://builds.apache.org/job/Hadoop-Common-trunk/ws/hadoop-common-project/hadoop-nfs/target/org/apache/hadoop/nfs/nfs3/class-use/Nfs3Constant.html...>
Generating <https://builds.apache.org/job/Hadoop-Common-trunk/ws/hadoop-common-project/hadoop-nfs/target/org/apache/hadoop/nfs/nfs3/class-use/Nfs3Constant.NFSPROC3.html...>
Generating <https://builds.apache.org/job/Hadoop-Common-trunk/ws/hadoop-common-project/hadoop-nfs/target/org/apache/hadoop/nfs/nfs3/class-use/Nfs3Constant.WriteStableHow.html...>
Generating <https://builds.apache.org/job/Hadoop-Common-trunk/ws/hadoop-common-project/hadoop-nfs/target/org/apache/hadoop/nfs/nfs3/class-use/Nfs3FileAttributes.html...>
Generating <https://builds.apache.org/job/Hadoop-Common-trunk/ws/hadoop-common-project/hadoop-nfs/target/org/apache/hadoop/nfs/nfs3/class-use/Nfs3FileAttributes.Specdata3.html...>
Generating <https://builds.apache.org/job/Hadoop-Common-trunk/ws/hadoop-common-project/hadoop-nfs/target/org/apache/hadoop/nfs/nfs3/class-use/Nfs3Status.html...>
Generating <https://builds.apache.org/job/Hadoop-Common-trunk/ws/hadoop-common-project/hadoop-nfs/target/org/apache/hadoop/nfs/nfs3/class-use/FileHandle.html...>
Generating <https://builds.apache.org/job/Hadoop-Common-trunk/ws/hadoop-common-project/hadoop-nfs/target/org/apache/hadoop/nfs/nfs3/class-use/Nfs3Base.html...>
Generating <https://builds.apache.org/job/Hadoop-Common-trunk/ws/hadoop-common-project/hadoop-nfs/target/org/apache/hadoop/nfs/nfs3/class-use/Nfs3Interface.html...>
Generating <https://builds.apache.org/job/Hadoop-Common-trunk/ws/hadoop-common-project/hadoop-nfs/target/org/apache/hadoop/nfs/nfs3/response/class-use/WccAttr.html...>
Generating <https://builds.apache.org/job/Hadoop-Common-trunk/ws/hadoop-common-project/hadoop-nfs/target/org/apache/hadoop/nfs/nfs3/response/class-use/WccData.html...>
Generating <https://builds.apache.org/job/Hadoop-Common-trunk/ws/hadoop-common-project/hadoop-nfs/target/org/apache/hadoop/nfs/nfs3/response/class-use/SETATTR3Response.html...>
Generating <https://builds.apache.org/job/Hadoop-Common-trunk/ws/hadoop-common-project/hadoop-nfs/target/org/apache/hadoop/nfs/nfs3/response/class-use/SYMLINK3Response.html...>
Generating <https://builds.apache.org/job/Hadoop-Common-trunk/ws/hadoop-common-project/hadoop-nfs/target/org/apache/hadoop/nfs/nfs3/response/class-use/MKDIR3Response.html...>
Generating <https://builds.apache.org/job/Hadoop-Common-trunk/ws/hadoop-common-project/hadoop-nfs/target/org/apache/hadoop/nfs/nfs3/response/class-use/COMMIT3Response.html...>
Generating <https://builds.apache.org/job/Hadoop-Common-trunk/ws/hadoop-common-project/hadoop-nfs/target/org/apache/hadoop/nfs/nfs3/response/class-use/READDIR3Response.html...>
Generating <https://builds.apache.org/job/Hadoop-Common-trunk/ws/hadoop-common-project/hadoop-nfs/target/org/apache/hadoop/nfs/nfs3/response/class-use/READDIR3Response.Entry3.html...>
Generating <https://builds.apache.org/job/Hadoop-Common-trunk/ws/hadoop-common-project/hadoop-nfs/target/org/apache/hadoop/nfs/nfs3/response/class-use/READDIR3Response.DirList3.html...>
Generating <https://builds.apache.org/job/Hadoop-Common-trunk/ws/hadoop-common-project/hadoop-nfs/target/org/apache/hadoop/nfs/nfs3/response/class-use/FSINFO3Response.html...>
Generating <https://builds.apache.org/job/Hadoop-Common-trunk/ws/hadoop-common-project/hadoop-nfs/target/org/apache/hadoop/nfs/nfs3/response/class-use/FSSTAT3Response.html...>
Generating <https://builds.apache.org/job/Hadoop-Common-trunk/ws/hadoop-common-project/hadoop-nfs/target/org/apache/hadoop/nfs/nfs3/response/class-use/PATHCONF3Response.html...>
Generating <https://builds.apache.org/job/Hadoop-Common-trunk/ws/hadoop-common-project/hadoop-nfs/target/org/apache/hadoop/nfs/nfs3/response/class-use/WRITE3Response.html...>
Generating <https://builds.apache.org/job/Hadoop-Common-trunk/ws/hadoop-common-project/hadoop-nfs/target/org/apache/hadoop/nfs/nfs3/response/class-use/MKNOD3Response.html...>
Generating <https://builds.apache.org/job/Hadoop-Common-trunk/ws/hadoop-common-project/hadoop-nfs/target/org/apache/hadoop/nfs/nfs3/response/class-use/READDIRPLUS3Response.html...>
Generating <https://builds.apache.org/job/Hadoop-Common-trunk/ws/hadoop-common-project/hadoop-nfs/target/org/apache/hadoop/nfs/nfs3/response/class-use/READDIRPLUS3Response.EntryPlus3.html...>
Generating <https://builds.apache.org/job/Hadoop-Common-trunk/ws/hadoop-common-project/hadoop-nfs/target/org/apache/hadoop/nfs/nfs3/response/class-use/READDIRPLUS3Response.DirListPlus3.html...>
Generating <https://builds.apache.org/job/Hadoop-Common-trunk/ws/hadoop-common-project/hadoop-nfs/target/org/apache/hadoop/nfs/nfs3/response/class-use/ACCESS3Response.html...>
Generating <https://builds.apache.org/job/Hadoop-Common-trunk/ws/hadoop-common-project/hadoop-nfs/target/org/apache/hadoop/nfs/nfs3/response/class-use/LINK3Response.html...>
Generating <https://builds.apache.org/job/Hadoop-Common-trunk/ws/hadoop-common-project/hadoop-nfs/target/org/apache/hadoop/nfs/nfs3/response/class-use/READ3Response.html...>
Generating <https://builds.apache.org/job/Hadoop-Common-trunk/ws/hadoop-common-project/hadoop-nfs/target/org/apache/hadoop/nfs/nfs3/response/class-use/CREATE3Response.html...>
Generating <https://builds.apache.org/job/Hadoop-Common-trunk/ws/hadoop-common-project/hadoop-nfs/target/org/apache/hadoop/nfs/nfs3/response/class-use/READLINK3Response.html...>
Generating <https://builds.apache.org/job/Hadoop-Common-trunk/ws/hadoop-common-project/hadoop-nfs/target/org/apache/hadoop/nfs/nfs3/response/class-use/NFS3Response.html...>
Generating <https://builds.apache.org/job/Hadoop-Common-trunk/ws/hadoop-common-project/hadoop-nfs/target/org/apache/hadoop/nfs/nfs3/response/class-use/RMDIR3Response.html...>
Generating <https://builds.apache.org/job/Hadoop-Common-trunk/ws/hadoop-common-project/hadoop-nfs/target/org/apache/hadoop/nfs/nfs3/response/class-use/GETATTR3Response.html...>
Generating <https://builds.apache.org/job/Hadoop-Common-trunk/ws/hadoop-common-project/hadoop-nfs/target/org/apache/hadoop/nfs/nfs3/response/class-use/RENAME3Response.html...>
Generating <https://builds.apache.org/job/Hadoop-Common-trunk/ws/hadoop-common-project/hadoop-nfs/target/org/apache/hadoop/nfs/nfs3/response/class-use/REMOVE3Response.html...>
Generating <https://builds.apache.org/job/Hadoop-Common-trunk/ws/hadoop-common-project/hadoop-nfs/target/org/apache/hadoop/nfs/nfs3/response/class-use/LOOKUP3Response.html...>
Generating <https://builds.apache.org/job/Hadoop-Common-trunk/ws/hadoop-common-project/hadoop-nfs/target/org/apache/hadoop/mount/package-use.html...>
Generating <https://builds.apache.org/job/Hadoop-Common-trunk/ws/hadoop-common-project/hadoop-nfs/target/org/apache/hadoop/nfs/package-use.html...>
Generating <https://builds.apache.org/job/Hadoop-Common-trunk/ws/hadoop-common-project/hadoop-nfs/target/org/apache/hadoop/nfs/nfs3/package-use.html...>
Generating <https://builds.apache.org/job/Hadoop-Common-trunk/ws/hadoop-common-project/hadoop-nfs/target/org/apache/hadoop/nfs/nfs3/request/package-use.html...>
Generating <https://builds.apache.org/job/Hadoop-Common-trunk/ws/hadoop-common-project/hadoop-nfs/target/org/apache/hadoop/nfs/nfs3/response/package-use.html...>
Generating <https://builds.apache.org/job/Hadoop-Common-trunk/ws/hadoop-common-project/hadoop-nfs/target/org/apache/hadoop/oncrpc/package-use.html...>
Generating <https://builds.apache.org/job/Hadoop-Common-trunk/ws/hadoop-common-project/hadoop-nfs/target/org/apache/hadoop/oncrpc/security/package-use.html...>
Generating <https://builds.apache.org/job/Hadoop-Common-trunk/ws/hadoop-common-project/hadoop-nfs/target/org/apache/hadoop/portmap/package-use.html...>
Building index for all the packages and classes...
Generating <https://builds.apache.org/job/Hadoop-Common-trunk/ws/hadoop-common-project/hadoop-nfs/target/overview-tree.html...>
Generating <https://builds.apache.org/job/Hadoop-Common-trunk/ws/hadoop-common-project/hadoop-nfs/target/index-all.html...>
Generating <https://builds.apache.org/job/Hadoop-Common-trunk/ws/hadoop-common-project/hadoop-nfs/target/deprecated-list.html...>
Building index for all classes...
Generating <https://builds.apache.org/job/Hadoop-Common-trunk/ws/hadoop-common-project/hadoop-nfs/target/allclasses-frame.html...>
Generating <https://builds.apache.org/job/Hadoop-Common-trunk/ws/hadoop-common-project/hadoop-nfs/target/allclasses-noframe.html...>
Generating <https://builds.apache.org/job/Hadoop-Common-trunk/ws/hadoop-common-project/hadoop-nfs/target/index.html...>
Generating <https://builds.apache.org/job/Hadoop-Common-trunk/ws/hadoop-common-project/hadoop-nfs/target/overview-summary.html...>
Generating <https://builds.apache.org/job/Hadoop-Common-trunk/ws/hadoop-common-project/hadoop-nfs/target/help-doc.html...>
[INFO] Building jar: <https://builds.apache.org/job/Hadoop-Common-trunk/ws/hadoop-common-project/hadoop-nfs/target/hadoop-nfs-3.0.0-SNAPSHOT-javadoc.jar>
[INFO] 
[INFO] --- maven-assembly-plugin:2.4:single (dist) @ hadoop-nfs ---
[INFO] Reading assembly descriptor: ../../hadoop-assemblies/src/main/resources/assemblies/hadoop-nfs-dist.xml
[WARNING] The following patterns were never triggered in this artifact exclusion filter:
o  'org.apache.hadoop:hadoop-common'
o  'org.apache.hadoop:hadoop-hdfs'
o  'org.hsqldb:hsqldb'

[INFO] Copying files to <https://builds.apache.org/job/Hadoop-Common-trunk/ws/hadoop-common-project/hadoop-nfs/target/hadoop-nfs-3.0.0-SNAPSHOT>
[INFO]                                                                         
[INFO] ------------------------------------------------------------------------
[INFO] Building Apache Hadoop KMS 3.0.0-SNAPSHOT
[INFO] ------------------------------------------------------------------------
[INFO] 
[INFO] --- maven-clean-plugin:2.5:clean (default-clean) @ hadoop-kms ---
[INFO] Deleting <https://builds.apache.org/job/Hadoop-Common-trunk/ws/hadoop-common-project/hadoop-kms/target>
[INFO] 
[INFO] --- findbugs-maven-plugin:3.0.0:findbugs (default-cli) @ hadoop-kms ---
[INFO] 
[INFO] --- maven-checkstyle-plugin:2.15:checkstyle (default-cli) @ hadoop-kms ---
[INFO] There are 45 errors reported by Checkstyle 6.6 with checkstyle/checkstyle.xml ruleset.
[WARNING] Unable to locate Source XRef to link to - DISABLED
[INFO] 
[INFO] --- maven-antrun-plugin:1.7:run (create-testdirs) @ hadoop-kms ---
[INFO] Executing tasks

main:
    [mkdir] Created dir: <https://builds.apache.org/job/Hadoop-Common-trunk/ws/hadoop-common-project/hadoop-kms/target/test-dir>
[INFO] Executed tasks
[INFO] 
[INFO] --- maven-resources-plugin:2.6:resources (default-resources) @ hadoop-kms ---
[INFO] Using 'UTF-8' encoding to copy filtered resources.
[INFO] skip non existing resourceDirectory <https://builds.apache.org/job/Hadoop-Common-trunk/ws/hadoop-common-project/hadoop-kms/src/main/resources>
[INFO] 
[INFO] --- maven-compiler-plugin:3.1:compile (default-compile) @ hadoop-kms ---
[INFO] Compiling 14 source files to <https://builds.apache.org/job/Hadoop-Common-trunk/ws/hadoop-common-project/hadoop-kms/target/classes>
[INFO] 
[INFO] --- maven-antrun-plugin:1.7:run (create-web-xmls) @ hadoop-kms ---
[INFO] Executing tasks

main:
    [mkdir] Created dir: <https://builds.apache.org/job/Hadoop-Common-trunk/ws/hadoop-common-project/hadoop-kms/target/test-classes/kms-webapp>
     [copy] Copying 1 file to <https://builds.apache.org/job/Hadoop-Common-trunk/ws/hadoop-common-project/hadoop-kms/target/test-classes/kms-webapp>
[INFO] Executed tasks
[INFO] 
[INFO] --- maven-resources-plugin:2.6:testResources (default-testResources) @ hadoop-kms ---
[INFO] Using 'UTF-8' encoding to copy filtered resources.
[INFO] Copying 3 resources
[INFO] 
[INFO] --- maven-compiler-plugin:3.1:testCompile (default-testCompile) @ hadoop-kms ---
[INFO] Compiling 6 source files to <https://builds.apache.org/job/Hadoop-Common-trunk/ws/hadoop-common-project/hadoop-kms/target/test-classes>
[INFO] 
[INFO] --- maven-surefire-plugin:2.17:test (default-test) @ hadoop-kms ---
[WARNING] The parameter forkMode is deprecated since version 2.14. Use forkCount and reuseForks
instead.
[INFO] Surefire report directory: <https://builds.apache.org/job/Hadoop-Common-trunk/ws/hadoop-common-project/hadoop-kms/target/surefire-reports>

-------------------------------------------------------
 T E S T S
-------------------------------------------------------

-------------------------------------------------------
 T E S T S
-------------------------------------------------------
Running org.apache.hadoop.crypto.key.kms.server.TestKMSACLs
Tests run: 3, Failures: 0, Errors: 0, Skipped: 0, Time elapsed: 0.694 sec - in org.apache.hadoop.crypto.key.kms.server.TestKMSACLs
Running org.apache.hadoop.crypto.key.kms.server.TestKMS
Tests run: 21, Failures: 0, Errors: 0, Skipped: 0, Time elapsed: 66.678 sec - in org.apache.hadoop.crypto.key.kms.server.TestKMS
Running org.apache.hadoop.crypto.key.kms.server.TestKeyAuthorizationKeyProvider
Tests run: 3, Failures: 0, Errors: 0, Skipped: 0, Time elapsed: 1.836 sec - in org.apache.hadoop.crypto.key.kms.server.TestKeyAuthorizationKeyProvider
Running org.apache.hadoop.crypto.key.kms.server.TestKMSAudit
Tests run: 2, Failures: 0, Errors: 0, Skipped: 0, Time elapsed: 6.681 sec - in org.apache.hadoop.crypto.key.kms.server.TestKMSAudit
Running org.apache.hadoop.crypto.key.kms.server.TestKMSWithZK
Tests run: 1, Failures: 0, Errors: 0, Skipped: 0, Time elapsed: 5.998 sec - in org.apache.hadoop.crypto.key.kms.server.TestKMSWithZK

Results :

Tests run: 30, Failures: 0, Errors: 0, Skipped: 0

[INFO] 
[INFO] --- maven-war-plugin:2.4:war (default-war) @ hadoop-kms ---
[INFO] Packaging webapp
[INFO] Assembling webapp [hadoop-kms] in [<https://builds.apache.org/job/Hadoop-Common-trunk/ws/hadoop-common-project/hadoop-kms/target/kms]>
[INFO] Processing war project
[INFO] Copying webapp resources [<https://builds.apache.org/job/Hadoop-Common-trunk/ws/hadoop-common-project/hadoop-kms/src/main/webapp]>
[INFO] Building jar: <https://builds.apache.org/job/Hadoop-Common-trunk/ws/hadoop-common-project/hadoop-kms/target/kms/WEB-INF/lib/hadoop-kms-3.0.0-SNAPSHOT.jar>
[INFO] Webapp assembled in [139 msecs]
[INFO] Building war: <https://builds.apache.org/job/Hadoop-Common-trunk/ws/hadoop-common-project/hadoop-kms/target/kms.war>
[INFO] 
[INFO] --- maven-site-plugin:3.4:site (docs) @ hadoop-kms ---
[INFO] configuring report plugin org.apache.maven.plugins:maven-dependency-plugin:2.8
[INFO] preparing 'analyze-report' report requires 'test-compile' forked phase execution
[INFO] 
[INFO] >>> maven-dependency-plugin:2.8:analyze-report @ hadoop-kms >>>
[INFO] 
[INFO] --- maven-antrun-plugin:1.7:run (create-testdirs) @ hadoop-kms ---
[INFO] Executing tasks

main:
[INFO] Executed tasks
[INFO] 
[INFO] --- maven-resources-plugin:2.6:resources (default-resources) @ hadoop-kms ---
[INFO] Using 'UTF-8' encoding to copy filtered resources.
[INFO] skip non existing resourceDirectory <https://builds.apache.org/job/Hadoop-Common-trunk/ws/hadoop-common-project/hadoop-kms/src/main/resources>
[INFO] 
[INFO] --- maven-compiler-plugin:3.1:compile (default-compile) @ hadoop-kms ---
[INFO] Nothing to compile - all classes are up to date
[INFO] 
[INFO] --- maven-antrun-plugin:1.7:run (create-web-xmls) @ hadoop-kms ---
[INFO] Executing tasks

main:
[INFO] Executed tasks
[INFO] 
[INFO] --- maven-resources-plugin:2.6:testResources (default-testResources) @ hadoop-kms ---
[INFO] Using 'UTF-8' encoding to copy filtered resources.
[INFO] Copying 3 resources
[INFO] 
[INFO] --- maven-compiler-plugin:3.1:testCompile (default-testCompile) @ hadoop-kms ---
[INFO] Nothing to compile - all classes are up to date
[INFO] 
[INFO] <<< maven-dependency-plugin:2.8:analyze-report @ hadoop-kms <<<
[WARNING] No project URL defined - decoration links will not be relativized!
[INFO] Rendering site with org.apache.maven.skins:maven-stylus-skin:jar:1.2 skin.
[INFO] Rendering 1 Doxia document: 1 markdown
[INFO] Generating "Dependency Analysis" report  --- maven-dependency-plugin:2.8:analyze-report
[INFO] 
[INFO] --- maven-jar-plugin:2.5:jar (prepare-jar) @ hadoop-kms ---
[INFO] Building jar: <https://builds.apache.org/job/Hadoop-Common-trunk/ws/hadoop-common-project/hadoop-kms/target/hadoop-kms-3.0.0-SNAPSHOT-classes.jar>
[INFO] 
[INFO] --- maven-jar-plugin:2.5:test-jar (prepare-test-jar) @ hadoop-kms ---
[INFO] Building jar: <https://builds.apache.org/job/Hadoop-Common-trunk/ws/hadoop-common-project/hadoop-kms/target/hadoop-kms-3.0.0-SNAPSHOT-tests.jar>
[INFO] 
[INFO] --- maven-source-plugin:2.3:jar-no-fork (hadoop-java-sources) @ hadoop-kms ---
[INFO] Building jar: <https://builds.apache.org/job/Hadoop-Common-trunk/ws/hadoop-common-project/hadoop-kms/target/hadoop-kms-3.0.0-SNAPSHOT-sources.jar>
[INFO] 
[INFO] --- maven-source-plugin:2.3:test-jar-no-fork (hadoop-java-sources) @ hadoop-kms ---
[INFO] Building jar: <https://builds.apache.org/job/Hadoop-Common-trunk/ws/hadoop-common-project/hadoop-kms/target/hadoop-kms-3.0.0-SNAPSHOT-test-sources.jar>
[INFO] 
[INFO] --- maven-enforcer-plugin:1.3.1:enforce (dist-enforce) @ hadoop-kms ---
[INFO] 
[INFO] --- maven-site-plugin:3.4:attach-descriptor (attach-descriptor) @ hadoop-kms ---
[INFO] 
[INFO] --- maven-assembly-plugin:2.4:single (dist) @ hadoop-kms ---
[INFO] ------------------------------------------------------------------------
[INFO] Reactor Summary:
[INFO] 
[INFO] Apache Hadoop Annotations ......................... SUCCESS [ 10.279 s]
[INFO] Apache Hadoop MiniKDC ............................. SUCCESS [ 22.351 s]
[INFO] Apache Hadoop Auth ................................ SUCCESS [03:59 min]
[INFO] Apache Hadoop Auth Examples ....................... SUCCESS [  3.934 s]
[INFO] Apache Hadoop Common .............................. SUCCESS [29:30 min]
[INFO] Apache Hadoop NFS ................................. SUCCESS [ 14.339 s]
[INFO] Apache Hadoop KMS ................................. FAILURE [01:29 min]
[INFO] Apache Hadoop Common Project ...................... SKIPPED
[INFO] ------------------------------------------------------------------------
[INFO] BUILD FAILURE
[INFO] ------------------------------------------------------------------------
[INFO] Total time: 35:51 min
[INFO] Finished at: 2016-02-23T22:57:21+00:00
[INFO] Final Memory: 100M/826M
[INFO] ------------------------------------------------------------------------
[ERROR] Failed to execute goal org.apache.maven.plugins:maven-assembly-plugin:2.4:single (dist)
on project hadoop-kms: Error reading assemblies: Descriptor with ID 'hadoop-kms-dist' not
found -> [Help 1]
[ERROR] 
[ERROR] To see the full stack trace of the errors, re-run Maven with the -e switch.
[ERROR] Re-run Maven using the -X switch to enable full debug logging.
[ERROR] 
[ERROR] For more information about the errors and possible solutions, please read the following
articles:
[ERROR] [Help 1] http://cwiki.apache.org/confluence/display/MAVEN/MojoExecutionException
[ERROR] 
[ERROR] After correcting the problems, you can resume the build with the command
[ERROR]   mvn <goals> -rf :hadoop-kms
result: 1

################
# mvn -eaf test -Pclover -DcloverLicenseLocation=/home/jenkins/tools/clover/latest/lib/clover.license
################
Build step 'Execute shell' marked build as failure
Archiving artifacts
Recording test results

Mime
View raw message