hadoop-common-dev mailing list archives

Site index · List index
Message view « Date » · « Thread »
Top « Date » · « Thread »
From Apache Jenkins Server <jenk...@builds.apache.org>
Subject Build failed in Jenkins: Hadoop-Common-trunk #2064
Date Wed, 02 Dec 2015 20:43:40 GMT
See <https://builds.apache.org/job/Hadoop-Common-trunk/2064/changes>

Changes:

[jianhe] YARN-4398. Remove unnecessary synchronization in RMStateStore.

------------------------------------------
[...truncated 5576 lines...]
	at org.apache.htrace.commons.logging.impl.LogFactoryImpl.newInstance(LogFactoryImpl.java:604)
	at org.apache.htrace.commons.logging.impl.LogFactoryImpl.getInstance(LogFactoryImpl.java:336)
	at org.apache.htrace.commons.logging.impl.LogFactoryImpl.getInstance(LogFactoryImpl.java:310)
	at org.apache.htrace.commons.logging.LogFactory.getLog(LogFactory.java:685)
	at org.apache.htrace.core.HTraceConfiguration.<clinit>(HTraceConfiguration.java:31)
	at org.apache.htrace.core.Tracer$Builder.<init>(Tracer.java:47)
	at org.apache.hadoop.fs.FsTracer.get(FsTracer.java:42)
	at org.apache.hadoop.fs.FileSystem.createFileSystem(FileSystem.java:2704)
	at org.apache.hadoop.fs.FileSystem.access$200(FileSystem.java:95)
	at org.apache.hadoop.fs.FileSystem$Cache.getInternal(FileSystem.java:2747)
	at org.apache.hadoop.fs.FileSystem$Cache.get(FileSystem.java:2729)
	at org.apache.hadoop.fs.FileSystem.get(FileSystem.java:375)
	at org.apache.hadoop.fs.FileSystem.get(FileSystem.java:174)
	at org.apache.hadoop.fs.FileSystem.get(FileSystem.java:359)
	at org.apache.hadoop.fs.shell.PathData.<init>(PathData.java:81)
	at org.apache.hadoop.fs.shell.find.TestName.applyGlob(TestName.java:74)

Running org.apache.hadoop.fs.shell.find.TestFilterExpression
Tests run: 11, Failures: 0, Errors: 0, Skipped: 0, Time elapsed: 0.895 sec - in org.apache.hadoop.fs.shell.find.TestFilterExpression
Running org.apache.hadoop.fs.shell.find.TestFind
Tests run: 24, Failures: 0, Errors: 1, Skipped: 0, Time elapsed: 4.675 sec <<< FAILURE!
- in org.apache.hadoop.fs.shell.find.TestFind
processArguments(org.apache.hadoop.fs.shell.find.TestFind)  Time elapsed: 2.324 sec  <<<
ERROR!
java.lang.Exception: test timed out after 1000 milliseconds
	at org.mockito.asm.MethodWriter.visitInsn(MethodWriter.java:640)
	at org.mockito.cglib.core.CodeEmitter.dup(CodeEmitter.java:213)
	at org.mockito.cglib.proxy.Enhancer.emitCurrentCallback(Enhancer.java:986)
	at org.mockito.cglib.proxy.Enhancer.access$300(Enhancer.java:61)
	at org.mockito.cglib.proxy.Enhancer$6.emitCallback(Enhancer.java:919)
	at org.mockito.cglib.proxy.MethodInterceptorGenerator.generate(MethodInterceptorGenerator.java:111)
	at org.mockito.cglib.proxy.Enhancer.emitMethods(Enhancer.java:948)
	at org.mockito.cglib.proxy.Enhancer.generateClass(Enhancer.java:499)
	at org.mockito.cglib.core.DefaultGeneratorStrategy.generate(DefaultGeneratorStrategy.java:25)
	at org.mockito.cglib.core.AbstractClassGenerator.create(AbstractClassGenerator.java:217)
	at org.mockito.cglib.proxy.Enhancer.createHelper(Enhancer.java:378)
	at org.mockito.cglib.proxy.Enhancer.createClass(Enhancer.java:318)
	at org.mockito.internal.creation.jmock.ClassImposterizer.createProxyClass(ClassImposterizer.java:93)
	at org.mockito.internal.creation.jmock.ClassImposterizer.imposterise(ClassImposterizer.java:50)
	at org.mockito.internal.util.MockUtil.createMock(MockUtil.java:54)
	at org.mockito.internal.MockitoCore.mock(MockitoCore.java:45)
	at org.mockito.Mockito.mock(Mockito.java:921)
	at org.mockito.Mockito.mock(Mockito.java:816)
	at org.apache.hadoop.fs.shell.find.TestFind.processArguments(TestFind.java:244)

Running org.apache.hadoop.fs.shell.find.TestIname
Tests run: 6, Failures: 0, Errors: 1, Skipped: 0, Time elapsed: 2.802 sec <<< FAILURE!
- in org.apache.hadoop.fs.shell.find.TestIname
applyGlob(org.apache.hadoop.fs.shell.find.TestIname)  Time elapsed: 2.199 sec  <<<
ERROR!
java.lang.Exception: test timed out after 1000 milliseconds
	at java.lang.StringCoding$StringEncoder.encode(StringCoding.java:300)
	at java.lang.StringCoding.encode(StringCoding.java:344)
	at java.lang.String.getBytes(String.java:916)
	at java.io.FileInputStream.open(Native Method)
	at java.io.FileInputStream.<init>(FileInputStream.java:146)
	at sun.misc.URLClassPath$FileLoader$1.getInputStream(URLClassPath.java:1086)
	at sun.misc.Resource.cachedInputStream(Resource.java:77)
	at sun.misc.Resource.getByteBuffer(Resource.java:160)
	at java.net.URLClassLoader.defineClass(URLClassLoader.java:436)
	at java.net.URLClassLoader.access$100(URLClassLoader.java:71)
	at java.net.URLClassLoader$1.run(URLClassLoader.java:361)
	at java.net.URLClassLoader$1.run(URLClassLoader.java:355)
	at java.security.AccessController.doPrivileged(Native Method)
	at java.net.URLClassLoader.findClass(URLClassLoader.java:354)
	at java.lang.ClassLoader.loadClass(ClassLoader.java:425)
	at sun.misc.Launcher$AppClassLoader.loadClass(Launcher.java:308)
	at java.lang.ClassLoader.loadClass(ClassLoader.java:358)
	at org.apache.hadoop.fs.FsTracer.get(FsTracer.java:42)
	at org.apache.hadoop.fs.FileSystem.createFileSystem(FileSystem.java:2704)
	at org.apache.hadoop.fs.FileSystem.access$200(FileSystem.java:95)
	at org.apache.hadoop.fs.FileSystem$Cache.getInternal(FileSystem.java:2747)
	at org.apache.hadoop.fs.FileSystem$Cache.get(FileSystem.java:2729)
	at org.apache.hadoop.fs.FileSystem.get(FileSystem.java:375)
	at org.apache.hadoop.fs.FileSystem.get(FileSystem.java:174)
	at org.apache.hadoop.fs.FileSystem.get(FileSystem.java:359)
	at org.apache.hadoop.fs.shell.PathData.<init>(PathData.java:81)
	at org.apache.hadoop.fs.shell.find.TestIname.applyGlob(TestIname.java:74)

Running org.apache.hadoop.fs.shell.find.TestPrint
Tests run: 1, Failures: 0, Errors: 1, Skipped: 0, Time elapsed: 2.468 sec <<< FAILURE!
- in org.apache.hadoop.fs.shell.find.TestPrint
testPrint(org.apache.hadoop.fs.shell.find.TestPrint)  Time elapsed: 2.277 sec  <<<
ERROR!
java.lang.Exception: test timed out after 1000 milliseconds
	at java.io.UnixFileSystem.getBooleanAttributes0(Native Method)
	at java.io.UnixFileSystem.getBooleanAttributes(UnixFileSystem.java:242)
	at java.io.File.exists(File.java:813)
	at sun.misc.URLClassPath$FileLoader.getResource(URLClassPath.java:1080)
	at sun.misc.URLClassPath.getResource(URLClassPath.java:199)
	at java.net.URLClassLoader$1.run(URLClassLoader.java:358)
	at java.net.URLClassLoader$1.run(URLClassLoader.java:355)
	at java.security.AccessController.doPrivileged(Native Method)
	at java.net.URLClassLoader.findClass(URLClassLoader.java:354)
	at java.lang.ClassLoader.loadClass(ClassLoader.java:425)
	at sun.misc.Launcher$AppClassLoader.loadClass(Launcher.java:308)
	at java.lang.ClassLoader.loadClass(ClassLoader.java:358)
	at java.lang.ClassLoader.defineClass1(Native Method)
	at java.lang.ClassLoader.defineClass(ClassLoader.java:800)
	at java.security.SecureClassLoader.defineClass(SecureClassLoader.java:142)
	at java.net.URLClassLoader.defineClass(URLClassLoader.java:449)
	at java.net.URLClassLoader.access$100(URLClassLoader.java:71)
	at java.net.URLClassLoader$1.run(URLClassLoader.java:361)
	at java.net.URLClassLoader$1.run(URLClassLoader.java:355)
	at java.security.AccessController.doPrivileged(Native Method)
	at java.net.URLClassLoader.findClass(URLClassLoader.java:354)
	at java.lang.ClassLoader.loadClass(ClassLoader.java:425)
	at sun.misc.Launcher$AppClassLoader.loadClass(Launcher.java:308)
	at java.lang.ClassLoader.loadClass(ClassLoader.java:358)
	at org.mockito.internal.invocation.Invocation.argumentsToMatchers(Invocation.java:149)
	at org.mockito.internal.invocation.InvocationMatcher.<init>(InvocationMatcher.java:30)
	at org.mockito.internal.invocation.MatchersBinder.bindMatchers(MatchersBinder.java:23)
	at org.mockito.internal.MockHandler.handle(MockHandler.java:68)
	at org.mockito.internal.creation.MethodInterceptorFilter.intercept(MethodInterceptorFilter.java:47)
	at org.apache.hadoop.fs.FileSystem$$EnhancerByMockitoWithCGLIB$$c05f0707.getFileStatus(<generated>)
	at org.apache.hadoop.fs.FilterFileSystem.getFileStatus(FilterFileSystem.java:435)
	at org.apache.hadoop.fs.shell.PathData.lookupStat(PathData.java:172)
	at org.apache.hadoop.fs.shell.PathData.<init>(PathData.java:104)
	at org.apache.hadoop.fs.shell.PathData.<init>(PathData.java:81)
	at org.apache.hadoop.fs.shell.find.TestPrint.testPrint(TestPrint.java:51)

Running org.apache.hadoop.fs.TestFileSystemInitialization
Tests run: 1, Failures: 0, Errors: 0, Skipped: 0, Time elapsed: 1.412 sec - in org.apache.hadoop.fs.TestFileSystemInitialization
Running org.apache.hadoop.fs.TestHarFileSystem
Tests run: 4, Failures: 0, Errors: 0, Skipped: 0, Time elapsed: 1.682 sec - in org.apache.hadoop.fs.TestHarFileSystem
Running org.apache.hadoop.fs.TestFileSystemTokens
Tests run: 10, Failures: 0, Errors: 0, Skipped: 0, Time elapsed: 1.506 sec - in org.apache.hadoop.fs.TestFileSystemTokens
Running org.apache.hadoop.fs.TestGetFileBlockLocations
Tests run: 3, Failures: 0, Errors: 0, Skipped: 0, Time elapsed: 1.894 sec - in org.apache.hadoop.fs.TestGetFileBlockLocations
Running org.apache.hadoop.fs.TestLocalFSFileContextCreateMkdir
Tests run: 8, Failures: 0, Errors: 0, Skipped: 0, Time elapsed: 2.112 sec - in org.apache.hadoop.fs.TestLocalFSFileContextCreateMkdir
Running org.apache.hadoop.fs.sftp.TestSFTPFileSystem
Tests run: 9, Failures: 0, Errors: 0, Skipped: 0, Time elapsed: 10.518 sec - in org.apache.hadoop.fs.sftp.TestSFTPFileSystem
Running org.apache.hadoop.fs.TestAvroFSInput
Tests run: 1, Failures: 0, Errors: 0, Skipped: 0, Time elapsed: 1.989 sec - in org.apache.hadoop.fs.TestAvroFSInput
Running org.apache.hadoop.fs.TestFilterFs
Tests run: 1, Failures: 0, Errors: 0, Skipped: 0, Time elapsed: 0.446 sec - in org.apache.hadoop.fs.TestFilterFs
Running org.apache.hadoop.fs.TestLocalFSFileContextMainOperations
Tests run: 62, Failures: 0, Errors: 0, Skipped: 0, Time elapsed: 5.483 sec - in org.apache.hadoop.fs.TestLocalFSFileContextMainOperations
Running org.apache.hadoop.fs.TestSymlinkLocalFSFileSystem
Tests run: 63, Failures: 0, Errors: 0, Skipped: 7, Time elapsed: 11.342 sec - in org.apache.hadoop.fs.TestSymlinkLocalFSFileSystem
Running org.apache.hadoop.fs.TestS3_LocalFileContextURI
Tests run: 17, Failures: 0, Errors: 0, Skipped: 0, Time elapsed: 3.166 sec - in org.apache.hadoop.fs.TestS3_LocalFileContextURI
Running org.apache.hadoop.fs.TestFsShellReturnCode
Tests run: 10, Failures: 0, Errors: 0, Skipped: 0, Time elapsed: 6.172 sec - in org.apache.hadoop.fs.TestFsShellReturnCode
Running org.apache.hadoop.fs.ftp.TestFTPFileSystem
Tests run: 1, Failures: 0, Errors: 0, Skipped: 0, Time elapsed: 0.386 sec - in org.apache.hadoop.fs.ftp.TestFTPFileSystem
Running org.apache.hadoop.fs.TestHardLink
Tests run: 5, Failures: 0, Errors: 0, Skipped: 0, Time elapsed: 0.791 sec - in org.apache.hadoop.fs.TestHardLink
Running org.apache.hadoop.fs.TestListFiles
Tests run: 2, Failures: 0, Errors: 0, Skipped: 0, Time elapsed: 1.888 sec - in org.apache.hadoop.fs.TestListFiles
Running org.apache.hadoop.fs.TestLocal_S3FileContextURI
Tests run: 17, Failures: 0, Errors: 0, Skipped: 0, Time elapsed: 2.952 sec - in org.apache.hadoop.fs.TestLocal_S3FileContextURI
Running org.apache.hadoop.fs.TestDelegateToFileSystem
Tests run: 2, Failures: 0, Errors: 0, Skipped: 0, Time elapsed: 0.918 sec - in org.apache.hadoop.fs.TestDelegateToFileSystem
Running org.apache.hadoop.ha.TestZKFailoverControllerStress
Tests run: 3, Failures: 0, Errors: 0, Skipped: 0, Time elapsed: 97.692 sec - in org.apache.hadoop.ha.TestZKFailoverControllerStress
Running org.apache.hadoop.ha.TestShellCommandFencer
Tests run: 9, Failures: 0, Errors: 0, Skipped: 0, Time elapsed: 2.647 sec - in org.apache.hadoop.ha.TestShellCommandFencer
Running org.apache.hadoop.ha.TestFailoverController
Tests run: 17, Failures: 0, Errors: 0, Skipped: 0, Time elapsed: 3.801 sec - in org.apache.hadoop.ha.TestFailoverController
Running org.apache.hadoop.ha.TestNodeFencer
Tests run: 9, Failures: 0, Errors: 0, Skipped: 0, Time elapsed: 1.901 sec - in org.apache.hadoop.ha.TestNodeFencer
Running org.apache.hadoop.ha.TestActiveStandbyElectorRealZK
Tests run: 4, Failures: 0, Errors: 0, Skipped: 0, Time elapsed: 12.801 sec - in org.apache.hadoop.ha.TestActiveStandbyElectorRealZK
Running org.apache.hadoop.ha.TestSshFenceByTcpPort
Tests run: 4, Failures: 0, Errors: 0, Skipped: 1, Time elapsed: 5.602 sec - in org.apache.hadoop.ha.TestSshFenceByTcpPort
Running org.apache.hadoop.ha.TestZKFailoverController
Tests run: 20, Failures: 0, Errors: 1, Skipped: 0, Time elapsed: 126.824 sec <<<
FAILURE! - in org.apache.hadoop.ha.TestZKFailoverController
testGracefulFailover(org.apache.hadoop.ha.TestZKFailoverController)  Time elapsed: 70.86 sec
 <<< ERROR!
org.apache.hadoop.ha.ServiceFailedException: Unable to become active. Local node did not get
an opportunity to do so from ZooKeeper, or the local node took too long to transition to active.
	at org.apache.hadoop.ha.ZKFailoverController.doGracefulFailover(ZKFailoverController.java:690)
	at org.apache.hadoop.ha.ZKFailoverController.access$400(ZKFailoverController.java:62)
	at org.apache.hadoop.ha.ZKFailoverController$3.run(ZKFailoverController.java:607)
	at org.apache.hadoop.ha.ZKFailoverController$3.run(ZKFailoverController.java:604)
	at java.security.AccessController.doPrivileged(Native Method)
	at javax.security.auth.Subject.doAs(Subject.java:415)
	at org.apache.hadoop.security.UserGroupInformation.doAs(UserGroupInformation.java:1669)
	at org.apache.hadoop.ha.ZKFailoverController.gracefulFailoverToYou(ZKFailoverController.java:604)
	at org.apache.hadoop.ha.ZKFCRpcServer.gracefulFailover(ZKFCRpcServer.java:94)
	at org.apache.hadoop.ha.TestZKFailoverController.testGracefulFailover(TestZKFailoverController.java:441)

Running org.apache.hadoop.ha.TestHealthMonitorWithDedicatedHealthAddress
Exception: java.lang.RuntimeException thrown from the UncaughtExceptionHandler in thread "Health
Monitor for DummyHAService #3"
Tests run: 3, Failures: 0, Errors: 0, Skipped: 0, Time elapsed: 5.797 sec - in org.apache.hadoop.ha.TestHealthMonitorWithDedicatedHealthAddress
Running org.apache.hadoop.ha.TestActiveStandbyElector
Tests run: 23, Failures: 0, Errors: 0, Skipped: 0, Time elapsed: 4.37 sec - in org.apache.hadoop.ha.TestActiveStandbyElector
Running org.apache.hadoop.ha.TestHAAdmin
Tests run: 2, Failures: 0, Errors: 0, Skipped: 0, Time elapsed: 1.39 sec - in org.apache.hadoop.ha.TestHAAdmin
Running org.apache.hadoop.ha.TestHealthMonitor
Exception: java.lang.RuntimeException thrown from the UncaughtExceptionHandler in thread "Health
Monitor for DummyHAService #3"
Tests run: 3, Failures: 0, Errors: 0, Skipped: 0, Time elapsed: 5.544 sec - in org.apache.hadoop.ha.TestHealthMonitor
Running org.apache.hadoop.service.TestGlobalStateChangeListener
Tests run: 5, Failures: 0, Errors: 0, Skipped: 0, Time elapsed: 0.458 sec - in org.apache.hadoop.service.TestGlobalStateChangeListener
Running org.apache.hadoop.service.TestServiceLifecycle
Tests run: 18, Failures: 0, Errors: 0, Skipped: 0, Time elapsed: 2.846 sec - in org.apache.hadoop.service.TestServiceLifecycle
Running org.apache.hadoop.service.TestCompositeService
Tests run: 18, Failures: 0, Errors: 0, Skipped: 0, Time elapsed: 0.805 sec - in org.apache.hadoop.service.TestCompositeService

Results :

Failed tests: 
  TestReloadingX509TrustManager.testReload:112 expected:<2> but was:<1>

Tests in error: 
  TestTimedOutTestsListener.testThreadDumpAndDeadlocks:163 »  test timed out aft...
  TestRPCWaitForProxy.testInterruptedWaitForProxy:74->Object.wait:-2 »  test tim...
  TestPrint0.testPrint:51 »  test timed out after 1000 milliseconds
  TestName.applyGlob:74 »  test timed out after 1000 milliseconds
  TestFind.processArguments:244 »  test timed out after 1000 milliseconds
  TestIname.applyGlob:74 »  test timed out after 1000 milliseconds
  TestPrint.testPrint:51 »  test timed out after 1000 milliseconds
  TestZKFailoverController.testGracefulFailover:441 » ServiceFailed Unable to be...

Tests run: 3206, Failures: 1, Errors: 8, Skipped: 86

[INFO] ------------------------------------------------------------------------
[INFO] Reactor Summary:
[INFO] 
[INFO] Apache Hadoop Annotations ......................... SUCCESS [ 24.747 s]
[INFO] Apache Hadoop MiniKDC ............................. SUCCESS [02:31 min]
[INFO] Apache Hadoop Auth ................................ SUCCESS [18:24 min]
[INFO] Apache Hadoop Auth Examples ....................... SUCCESS [  8.084 s]
[INFO] Apache Hadoop Common .............................. FAILURE [43:32 min]
[INFO] Apache Hadoop NFS ................................. SKIPPED
[INFO] Apache Hadoop KMS ................................. SKIPPED
[INFO] Apache Hadoop Common Project ...................... SKIPPED
[INFO] ------------------------------------------------------------------------
[INFO] BUILD FAILURE
[INFO] ------------------------------------------------------------------------
[INFO] Total time: 01:05 h
[INFO] Finished at: 2015-12-02T20:43:13+00:00
[INFO] Final Memory: 77M/990M
[INFO] ------------------------------------------------------------------------
[ERROR] Failed to execute goal org.apache.maven.plugins:maven-surefire-plugin:2.17:test (default-test)
on project hadoop-common: There are test failures.
[ERROR] 
[ERROR] Please refer to <https://builds.apache.org/job/Hadoop-Common-trunk/ws/hadoop-common-project/hadoop-common/target/surefire-reports>
for the individual test results.
[ERROR] -> [Help 1]
[ERROR] 
[ERROR] To see the full stack trace of the errors, re-run Maven with the -e switch.
[ERROR] Re-run Maven using the -X switch to enable full debug logging.
[ERROR] 
[ERROR] For more information about the errors and possible solutions, please read the following
articles:
[ERROR] [Help 1] http://cwiki.apache.org/confluence/display/MAVEN/MojoFailureException
[ERROR] 
[ERROR] After correcting the problems, you can resume the build with the command
[ERROR]   mvn <goals> -rf :hadoop-common
result: 1

################
# mvn -eaf test -Pclover -DcloverLicenseLocation=/home/jenkins/tools/clover/latest/lib/clover.license
################
Build step 'Execute shell' marked build as failure
Archiving artifacts
Recording test results

Mime
View raw message