hadoop-common-dev mailing list archives

Site index · List index
Message view « Date » · « Thread »
Top « Date » · « Thread »
From Apache Jenkins Server <jenk...@builds.apache.org>
Subject Build failed in Jenkins: Hadoop-common-trunk-Java8 #862
Date Mon, 28 Dec 2015 20:28:41 GMT
See <https://builds.apache.org/job/Hadoop-common-trunk-Java8/862/changes>

Changes:

[wangda] MAPREDUCE-6574. MR AM should print host of failed tasks. (Mohammad

------------------------------------------
[...truncated 9669 lines...]
[WARNING] ^
[WARNING] <https://builds.apache.org/job/Hadoop-common-trunk-Java8/ws/hadoop-common-project/hadoop-nfs/src/main/java/org/apache/hadoop/nfs/NfsExports.java>:176:
warning: no @return
[WARNING] public String[] getHostGroupList() {
[WARNING] ^
[WARNING] <https://builds.apache.org/job/Hadoop-common-trunk-Java8/ws/hadoop-common-project/hadoop-nfs/src/main/java/org/apache/hadoop/nfs/NfsTime.java>:58:
warning: no @return
[WARNING] public long getMilliSeconds() {
[WARNING] ^
[WARNING] <https://builds.apache.org/job/Hadoop-common-trunk-Java8/ws/hadoop-common-project/hadoop-nfs/src/main/java/org/apache/hadoop/nfs/nfs3/FileHandle.java>:49:
warning: no @param for v
[WARNING] public FileHandle(long v) {
[WARNING] ^
[WARNING] <https://builds.apache.org/job/Hadoop-common-trunk-Java8/ws/hadoop-common-project/hadoop-nfs/src/main/java/org/apache/hadoop/nfs/nfs3/Nfs3Constant.java>:80:
warning: no @param for value
[WARNING] public static NFSPROC3 fromValue(int value) {
[WARNING] ^
[WARNING] <https://builds.apache.org/job/Hadoop-common-trunk-Java8/ws/hadoop-common-project/hadoop-nfs/src/main/java/org/apache/hadoop/nfs/nfs3/Nfs3Interface.java>:30:
warning: no @return
[WARNING] public NFS3Response nullProcedure();
[WARNING] ^
[WARNING] <https://builds.apache.org/job/Hadoop-common-trunk-Java8/ws/hadoop-common-project/hadoop-nfs/src/main/java/org/apache/hadoop/nfs/nfs3/Nfs3Interface.java>:33:
warning: no @param for xdr
[WARNING] public NFS3Response getattr(XDR xdr, RpcInfo info);
[WARNING] ^
[WARNING] <https://builds.apache.org/job/Hadoop-common-trunk-Java8/ws/hadoop-common-project/hadoop-nfs/src/main/java/org/apache/hadoop/nfs/nfs3/Nfs3Interface.java>:33:
warning: no @param for info
[WARNING] public NFS3Response getattr(XDR xdr, RpcInfo info);
[WARNING] ^
[WARNING] <https://builds.apache.org/job/Hadoop-common-trunk-Java8/ws/hadoop-common-project/hadoop-nfs/src/main/java/org/apache/hadoop/nfs/nfs3/Nfs3Interface.java>:33:
warning: no @return
[WARNING] public NFS3Response getattr(XDR xdr, RpcInfo info);
[WARNING] ^
[WARNING] <https://builds.apache.org/job/Hadoop-common-trunk-Java8/ws/hadoop-common-project/hadoop-nfs/src/main/java/org/apache/hadoop/nfs/nfs3/Nfs3Interface.java>:36:
warning: no @param for xdr
[WARNING] public NFS3Response setattr(XDR xdr, RpcInfo info);
[WARNING] ^
[WARNING] <https://builds.apache.org/job/Hadoop-common-trunk-Java8/ws/hadoop-common-project/hadoop-nfs/src/main/java/org/apache/hadoop/nfs/nfs3/Nfs3Interface.java>:36:
warning: no @param for info
[WARNING] public NFS3Response setattr(XDR xdr, RpcInfo info);
[WARNING] ^
[WARNING] <https://builds.apache.org/job/Hadoop-common-trunk-Java8/ws/hadoop-common-project/hadoop-nfs/src/main/java/org/apache/hadoop/nfs/nfs3/Nfs3Interface.java>:36:
warning: no @return
[WARNING] public NFS3Response setattr(XDR xdr, RpcInfo info);
[WARNING] ^
[WARNING] <https://builds.apache.org/job/Hadoop-common-trunk-Java8/ws/hadoop-common-project/hadoop-nfs/src/main/java/org/apache/hadoop/nfs/nfs3/Nfs3Interface.java>:39:
warning: no @param for xdr
[WARNING] public NFS3Response lookup(XDR xdr, RpcInfo info);
[WARNING] ^
[WARNING] <https://builds.apache.org/job/Hadoop-common-trunk-Java8/ws/hadoop-common-project/hadoop-nfs/src/main/java/org/apache/hadoop/nfs/nfs3/Nfs3Interface.java>:39:
warning: no @param for info
[WARNING] public NFS3Response lookup(XDR xdr, RpcInfo info);
[WARNING] ^
[WARNING] <https://builds.apache.org/job/Hadoop-common-trunk-Java8/ws/hadoop-common-project/hadoop-nfs/src/main/java/org/apache/hadoop/nfs/nfs3/Nfs3Interface.java>:39:
warning: no @return
[WARNING] public NFS3Response lookup(XDR xdr, RpcInfo info);
[WARNING] ^
[WARNING] <https://builds.apache.org/job/Hadoop-common-trunk-Java8/ws/hadoop-common-project/hadoop-nfs/src/main/java/org/apache/hadoop/nfs/nfs3/Nfs3Interface.java>:42:
warning: no @param for xdr
[WARNING] public NFS3Response access(XDR xdr, RpcInfo info);
[WARNING] ^
[WARNING] <https://builds.apache.org/job/Hadoop-common-trunk-Java8/ws/hadoop-common-project/hadoop-nfs/src/main/java/org/apache/hadoop/nfs/nfs3/Nfs3Interface.java>:42:
warning: no @param for info
[WARNING] public NFS3Response access(XDR xdr, RpcInfo info);
[WARNING] ^
[WARNING] <https://builds.apache.org/job/Hadoop-common-trunk-Java8/ws/hadoop-common-project/hadoop-nfs/src/main/java/org/apache/hadoop/nfs/nfs3/Nfs3Interface.java>:42:
warning: no @return
[WARNING] public NFS3Response access(XDR xdr, RpcInfo info);
[WARNING] ^
[WARNING] <https://builds.apache.org/job/Hadoop-common-trunk-Java8/ws/hadoop-common-project/hadoop-nfs/src/main/java/org/apache/hadoop/nfs/nfs3/Nfs3Interface.java>:45:
warning: no @param for xdr
[WARNING] public NFS3Response readlink(XDR xdr, RpcInfo info);
[WARNING] ^
[WARNING] <https://builds.apache.org/job/Hadoop-common-trunk-Java8/ws/hadoop-common-project/hadoop-nfs/src/main/java/org/apache/hadoop/nfs/nfs3/Nfs3Interface.java>:45:
warning: no @param for info
[WARNING] public NFS3Response readlink(XDR xdr, RpcInfo info);
[WARNING] ^
[WARNING] <https://builds.apache.org/job/Hadoop-common-trunk-Java8/ws/hadoop-common-project/hadoop-nfs/src/main/java/org/apache/hadoop/nfs/nfs3/Nfs3Interface.java>:45:
warning: no @return
[WARNING] public NFS3Response readlink(XDR xdr, RpcInfo info);
[WARNING] ^
[INFO] Building jar: <https://builds.apache.org/job/Hadoop-common-trunk-Java8/ws/hadoop-common-project/hadoop-nfs/target/hadoop-nfs-3.0.0-SNAPSHOT-javadoc.jar>
[INFO] 
[INFO] --- maven-assembly-plugin:2.4:single (dist) @ hadoop-nfs ---
[INFO] Reading assembly descriptor: ../../hadoop-assemblies/src/main/resources/assemblies/hadoop-nfs-dist.xml
[WARNING] The following patterns were never triggered in this artifact exclusion filter:
o  'org.apache.hadoop:hadoop-common'
o  'org.apache.hadoop:hadoop-hdfs'
o  'org.hsqldb:hsqldb'

[INFO] Copying files to <https://builds.apache.org/job/Hadoop-common-trunk-Java8/ws/hadoop-common-project/hadoop-nfs/target/hadoop-nfs-3.0.0-SNAPSHOT>
[INFO]                                                                         
[INFO] ------------------------------------------------------------------------
[INFO] Building Apache Hadoop KMS 3.0.0-SNAPSHOT
[INFO] ------------------------------------------------------------------------
[INFO] 
[INFO] --- maven-clean-plugin:2.5:clean (default-clean) @ hadoop-kms ---
[INFO] Deleting <https://builds.apache.org/job/Hadoop-common-trunk-Java8/ws/hadoop-common-project/hadoop-kms/target>
[INFO] 
[INFO] --- maven-antrun-plugin:1.7:run (create-testdirs) @ hadoop-kms ---
[INFO] Executing tasks

main:
    [mkdir] Created dir: <https://builds.apache.org/job/Hadoop-common-trunk-Java8/ws/hadoop-common-project/hadoop-kms/target/test-dir>
[INFO] Executed tasks
[INFO] 
[INFO] --- maven-resources-plugin:2.6:resources (default-resources) @ hadoop-kms ---
[INFO] Using 'UTF-8' encoding to copy filtered resources.
[INFO] skip non existing resourceDirectory <https://builds.apache.org/job/Hadoop-common-trunk-Java8/ws/hadoop-common-project/hadoop-kms/src/main/resources>
[INFO] 
[INFO] --- maven-compiler-plugin:3.1:compile (default-compile) @ hadoop-kms ---
[INFO] Changes detected - recompiling the module!
[INFO] Compiling 14 source files to <https://builds.apache.org/job/Hadoop-common-trunk-Java8/ws/hadoop-common-project/hadoop-kms/target/classes>
[INFO] 
[INFO] --- maven-antrun-plugin:1.7:run (create-web-xmls) @ hadoop-kms ---
[INFO] Executing tasks

main:
    [mkdir] Created dir: <https://builds.apache.org/job/Hadoop-common-trunk-Java8/ws/hadoop-common-project/hadoop-kms/target/test-classes/kms-webapp>
     [copy] Copying 1 file to <https://builds.apache.org/job/Hadoop-common-trunk-Java8/ws/hadoop-common-project/hadoop-kms/target/test-classes/kms-webapp>
[INFO] Executed tasks
[INFO] 
[INFO] --- maven-resources-plugin:2.6:testResources (default-testResources) @ hadoop-kms ---
[INFO] Using 'UTF-8' encoding to copy filtered resources.
[INFO] Copying 3 resources
[INFO] 
[INFO] --- maven-compiler-plugin:3.1:testCompile (default-testCompile) @ hadoop-kms ---
[INFO] Changes detected - recompiling the module!
[INFO] Compiling 6 source files to <https://builds.apache.org/job/Hadoop-common-trunk-Java8/ws/hadoop-common-project/hadoop-kms/target/test-classes>
[INFO] 
[INFO] --- maven-surefire-plugin:2.17:test (default-test) @ hadoop-kms ---
[WARNING] The parameter forkMode is deprecated since version 2.14. Use forkCount and reuseForks
instead.
[INFO] Surefire report directory: <https://builds.apache.org/job/Hadoop-common-trunk-Java8/ws/hadoop-common-project/hadoop-kms/target/surefire-reports>

-------------------------------------------------------
 T E S T S
-------------------------------------------------------

-------------------------------------------------------
 T E S T S
-------------------------------------------------------
Java HotSpot(TM) 64-Bit Server VM warning: ignoring option MaxPermSize=768m; support was removed
in 8.0
Running org.apache.hadoop.crypto.key.kms.server.TestKMSAudit
Tests run: 2, Failures: 0, Errors: 0, Skipped: 0, Time elapsed: 6.511 sec - in org.apache.hadoop.crypto.key.kms.server.TestKMSAudit
Java HotSpot(TM) 64-Bit Server VM warning: ignoring option MaxPermSize=768m; support was removed
in 8.0
Running org.apache.hadoop.crypto.key.kms.server.TestKMSACLs
Tests run: 3, Failures: 0, Errors: 0, Skipped: 0, Time elapsed: 0.501 sec - in org.apache.hadoop.crypto.key.kms.server.TestKMSACLs
Java HotSpot(TM) 64-Bit Server VM warning: ignoring option MaxPermSize=768m; support was removed
in 8.0
Running org.apache.hadoop.crypto.key.kms.server.TestKMS
Tests run: 21, Failures: 0, Errors: 2, Skipped: 0, Time elapsed: 60.355 sec <<< FAILURE!
- in org.apache.hadoop.crypto.key.kms.server.TestKMS
testKMSRestartKerberosAuth(org.apache.hadoop.crypto.key.kms.server.TestKMS)  Time elapsed:
3.235 sec  <<< ERROR!
java.io.IOException: loginUserFromKeyTab must be done first
	at org.apache.hadoop.security.UserGroupInformation.reloginFromKeytab(UserGroupInformation.java:1029)
	at org.apache.hadoop.security.UserGroupInformation.checkTGTAndReloginFromKeytab(UserGroupInformation.java:994)
	at org.apache.hadoop.crypto.key.kms.KMSClientProvider.createConnection(KMSClientProvider.java:478)
	at org.apache.hadoop.crypto.key.kms.KMSClientProvider.createKeyInternal(KMSClientProvider.java:679)
	at org.apache.hadoop.crypto.key.kms.KMSClientProvider.createKey(KMSClientProvider.java:697)
	at org.apache.hadoop.crypto.key.kms.LoadBalancingKMSClientProvider$10.call(LoadBalancingKMSClientProvider.java:259)
	at org.apache.hadoop.crypto.key.kms.LoadBalancingKMSClientProvider$10.call(LoadBalancingKMSClientProvider.java:256)
	at org.apache.hadoop.crypto.key.kms.LoadBalancingKMSClientProvider.doOp(LoadBalancingKMSClientProvider.java:94)
	at org.apache.hadoop.crypto.key.kms.LoadBalancingKMSClientProvider.createKey(LoadBalancingKMSClientProvider.java:256)
	at org.apache.hadoop.crypto.key.kms.server.TestKMS$6$1.run(TestKMS.java:1003)
	at org.apache.hadoop.crypto.key.kms.server.TestKMS$6$1.run(TestKMS.java:1000)
	at java.security.AccessController.doPrivileged(Native Method)
	at javax.security.auth.Subject.doAs(Subject.java:422)
	at org.apache.hadoop.security.UserGroupInformation.doAs(UserGroupInformation.java:1669)
	at org.apache.hadoop.crypto.key.kms.server.TestKMS.doAs(TestKMS.java:266)
	at org.apache.hadoop.crypto.key.kms.server.TestKMS.access$100(TestKMS.java:75)

testKMSRestartSimpleAuth(org.apache.hadoop.crypto.key.kms.server.TestKMS)  Time elapsed: 0.559
sec  <<< ERROR!
java.io.IOException: loginUserFromKeyTab must be done first
	at org.apache.hadoop.security.UserGroupInformation.reloginFromKeytab(UserGroupInformation.java:1029)
	at org.apache.hadoop.security.UserGroupInformation.checkTGTAndReloginFromKeytab(UserGroupInformation.java:994)
	at org.apache.hadoop.crypto.key.kms.KMSClientProvider.createConnection(KMSClientProvider.java:478)
	at org.apache.hadoop.crypto.key.kms.KMSClientProvider.createKeyInternal(KMSClientProvider.java:679)
	at org.apache.hadoop.crypto.key.kms.KMSClientProvider.createKey(KMSClientProvider.java:697)
	at org.apache.hadoop.crypto.key.kms.LoadBalancingKMSClientProvider$10.call(LoadBalancingKMSClientProvider.java:259)
	at org.apache.hadoop.crypto.key.kms.LoadBalancingKMSClientProvider$10.call(LoadBalancingKMSClientProvider.java:256)
	at org.apache.hadoop.crypto.key.kms.LoadBalancingKMSClientProvider.doOp(LoadBalancingKMSClientProvider.java:94)
	at org.apache.hadoop.crypto.key.kms.LoadBalancingKMSClientProvider.createKey(LoadBalancingKMSClientProvider.java:256)
	at org.apache.hadoop.crypto.key.kms.server.TestKMS$6$1.run(TestKMS.java:1003)
	at org.apache.hadoop.crypto.key.kms.server.TestKMS$6$1.run(TestKMS.java:1000)
	at java.security.AccessController.doPrivileged(Native Method)
	at javax.security.auth.Subject.doAs(Subject.java:422)
	at org.apache.hadoop.security.UserGroupInformation.doAs(UserGroupInformation.java:1669)
	at org.apache.hadoop.crypto.key.kms.server.TestKMS.doAs(TestKMS.java:266)
	at org.apache.hadoop.crypto.key.kms.server.TestKMS.access$100(TestKMS.java:75)

Java HotSpot(TM) 64-Bit Server VM warning: ignoring option MaxPermSize=768m; support was removed
in 8.0
Running org.apache.hadoop.crypto.key.kms.server.TestKMSWithZK
Tests run: 1, Failures: 0, Errors: 0, Skipped: 0, Time elapsed: 5.502 sec - in org.apache.hadoop.crypto.key.kms.server.TestKMSWithZK
Java HotSpot(TM) 64-Bit Server VM warning: ignoring option MaxPermSize=768m; support was removed
in 8.0
Running org.apache.hadoop.crypto.key.kms.server.TestKeyAuthorizationKeyProvider
Tests run: 3, Failures: 0, Errors: 0, Skipped: 0, Time elapsed: 1.042 sec - in org.apache.hadoop.crypto.key.kms.server.TestKeyAuthorizationKeyProvider

Results :

Tests in error: 
  TestKMS.testKMSRestartKerberosAuth:928->doKMSRestart:993->runServer:130->access$100:75->doAs:266
» IO
  TestKMS.testKMSRestartSimpleAuth:933->doKMSRestart:993->runServer:130->access$100:75->doAs:266
» IO

Tests run: 30, Failures: 0, Errors: 2, Skipped: 0

[INFO] ------------------------------------------------------------------------
[INFO] Reactor Summary:
[INFO] 
[INFO] Apache Hadoop Annotations ......................... SUCCESS [  5.262 s]
[INFO] Apache Hadoop MiniKDC ............................. SUCCESS [ 17.259 s]
[INFO] Apache Hadoop Auth ................................ SUCCESS [03:46 min]
[INFO] Apache Hadoop Auth Examples ....................... SUCCESS [  3.528 s]
[INFO] Apache Hadoop Common .............................. SUCCESS [24:29 min]
[INFO] Apache Hadoop NFS ................................. SUCCESS [ 12.376 s]
[INFO] Apache Hadoop KMS ................................. FAILURE [01:16 min]
[INFO] Apache Hadoop Common Project ...................... SKIPPED
[INFO] ------------------------------------------------------------------------
[INFO] BUILD FAILURE
[INFO] ------------------------------------------------------------------------
[INFO] Total time: 30:12 min
[INFO] Finished at: 2015-12-28T20:28:04+00:00
[INFO] Final Memory: 84M/380M
[INFO] ------------------------------------------------------------------------
[ERROR] Failed to execute goal org.apache.maven.plugins:maven-surefire-plugin:2.17:test (default-test)
on project hadoop-kms: There are test failures.
[ERROR] 
[ERROR] Please refer to <https://builds.apache.org/job/Hadoop-common-trunk-Java8/ws/hadoop-common-project/hadoop-kms/target/surefire-reports>
for the individual test results.
[ERROR] -> [Help 1]
org.apache.maven.lifecycle.LifecycleExecutionException: Failed to execute goal org.apache.maven.plugins:maven-surefire-plugin:2.17:test
(default-test) on project hadoop-kms: There are test failures.

Please refer to <https://builds.apache.org/job/Hadoop-common-trunk-Java8/ws/hadoop-common-project/hadoop-kms/target/surefire-reports>
for the individual test results.
	at org.apache.maven.lifecycle.internal.MojoExecutor.execute(MojoExecutor.java:212)
	at org.apache.maven.lifecycle.internal.MojoExecutor.execute(MojoExecutor.java:153)
	at org.apache.maven.lifecycle.internal.MojoExecutor.execute(MojoExecutor.java:145)
	at org.apache.maven.lifecycle.internal.LifecycleModuleBuilder.buildProject(LifecycleModuleBuilder.java:108)
	at org.apache.maven.lifecycle.internal.LifecycleModuleBuilder.buildProject(LifecycleModuleBuilder.java:76)
	at org.apache.maven.lifecycle.internal.builder.singlethreaded.SingleThreadedBuilder.build(SingleThreadedBuilder.java:51)
	at org.apache.maven.lifecycle.internal.LifecycleStarter.execute(LifecycleStarter.java:116)
	at org.apache.maven.DefaultMaven.doExecute(DefaultMaven.java:361)
	at org.apache.maven.DefaultMaven.execute(DefaultMaven.java:155)
	at org.apache.maven.cli.MavenCli.execute(MavenCli.java:584)
	at org.apache.maven.cli.MavenCli.doMain(MavenCli.java:213)
	at org.apache.maven.cli.MavenCli.main(MavenCli.java:157)
	at sun.reflect.NativeMethodAccessorImpl.invoke0(Native Method)
	at sun.reflect.NativeMethodAccessorImpl.invoke(NativeMethodAccessorImpl.java:62)
	at sun.reflect.DelegatingMethodAccessorImpl.invoke(DelegatingMethodAccessorImpl.java:43)
	at java.lang.reflect.Method.invoke(Method.java:483)
	at org.codehaus.plexus.classworlds.launcher.Launcher.launchEnhanced(Launcher.java:289)
	at org.codehaus.plexus.classworlds.launcher.Launcher.launch(Launcher.java:229)
	at org.codehaus.plexus.classworlds.launcher.Launcher.mainWithExitCode(Launcher.java:415)
	at org.codehaus.plexus.classworlds.launcher.Launcher.main(Launcher.java:356)
Caused by: org.apache.maven.plugin.MojoFailureException: There are test failures.

Please refer to <https://builds.apache.org/job/Hadoop-common-trunk-Java8/ws/hadoop-common-project/hadoop-kms/target/surefire-reports>
for the individual test results.
	at org.apache.maven.plugin.surefire.SurefireHelper.reportExecution(SurefireHelper.java:82)
	at org.apache.maven.plugin.surefire.SurefirePlugin.handleSummary(SurefirePlugin.java:195)
	at org.apache.maven.plugin.surefire.AbstractSurefireMojo.executeAfterPreconditionsChecked(AbstractSurefireMojo.java:861)
	at org.apache.maven.plugin.surefire.AbstractSurefireMojo.execute(AbstractSurefireMojo.java:729)
	at org.apache.maven.plugin.DefaultBuildPluginManager.executeMojo(DefaultBuildPluginManager.java:133)
	at org.apache.maven.lifecycle.internal.MojoExecutor.execute(MojoExecutor.java:208)
	... 19 more
[ERROR] 
[ERROR] Re-run Maven using the -X switch to enable full debug logging.
[ERROR] 
[ERROR] For more information about the errors and possible solutions, please read the following
articles:
[ERROR] [Help 1] http://cwiki.apache.org/confluence/display/MAVEN/MojoFailureException
[ERROR] 
[ERROR] After correcting the problems, you can resume the build with the command
[ERROR]   mvn <goals> -rf :hadoop-kms
Build step 'Execute shell' marked build as failure
Archiving artifacts
Recording test results

Mime
View raw message