hadoop-common-dev mailing list archives

Site index · List index
Message view « Date » · « Thread »
Top « Date » · « Thread »
From Apache Jenkins Server <jenk...@builds.apache.org>
Subject Build failed in Jenkins: Hadoop-Common-trunk #2043
Date Wed, 25 Nov 2015 08:58:30 GMT
See <https://builds.apache.org/job/Hadoop-Common-trunk/2043/changes>

Changes:

[aajisaka] MAPREDUCE-6553. Replace '\u2b05' with '<-' in rendering job

[aajisaka] Fix indents in the 2.8.0 section of MapReduce CHANGES.txt.

------------------------------------------
[...truncated 5402 lines...]
Tests run: 2, Failures: 0, Errors: 0, Skipped: 0, Time elapsed: 0.514 sec - in org.apache.hadoop.metrics2.impl.TestMetricsCollectorImpl
Running org.apache.hadoop.metrics2.impl.TestMetricsSystemImpl
Tests run: 12, Failures: 0, Errors: 0, Skipped: 0, Time elapsed: 2.529 sec - in org.apache.hadoop.metrics2.impl.TestMetricsSystemImpl
Running org.apache.hadoop.metrics2.impl.TestMetricsConfig
Tests run: 3, Failures: 0, Errors: 0, Skipped: 0, Time elapsed: 0.434 sec - in org.apache.hadoop.metrics2.impl.TestMetricsConfig
Running org.apache.hadoop.metrics2.impl.TestGraphiteMetrics
Tests run: 5, Failures: 0, Errors: 0, Skipped: 0, Time elapsed: 0.538 sec - in org.apache.hadoop.metrics2.impl.TestGraphiteMetrics
Running org.apache.hadoop.metrics2.impl.TestMetricsVisitor
Tests run: 1, Failures: 0, Errors: 0, Skipped: 0, Time elapsed: 0.548 sec - in org.apache.hadoop.metrics2.impl.TestMetricsVisitor
Running org.apache.hadoop.metrics2.source.TestJvmMetrics
Tests run: 1, Failures: 0, Errors: 0, Skipped: 0, Time elapsed: 0.645 sec - in org.apache.hadoop.metrics2.source.TestJvmMetrics
Running org.apache.hadoop.metrics2.sink.TestFileSink
Tests run: 1, Failures: 0, Errors: 0, Skipped: 0, Time elapsed: 0.696 sec - in org.apache.hadoop.metrics2.sink.TestFileSink
Running org.apache.hadoop.metrics2.sink.ganglia.TestGangliaSink
Tests run: 4, Failures: 0, Errors: 0, Skipped: 0, Time elapsed: 0.365 sec - in org.apache.hadoop.metrics2.sink.ganglia.TestGangliaSink
Running org.apache.hadoop.metrics2.filter.TestPatternFilter
Tests run: 5, Failures: 0, Errors: 0, Skipped: 0, Time elapsed: 0.785 sec - in org.apache.hadoop.metrics2.filter.TestPatternFilter
Running org.apache.hadoop.log.TestLogLevel
Tests run: 1, Failures: 0, Errors: 0, Skipped: 0, Time elapsed: 1.246 sec - in org.apache.hadoop.log.TestLogLevel
Running org.apache.hadoop.log.TestLog4Json
Tests run: 5, Failures: 0, Errors: 0, Skipped: 0, Time elapsed: 0.647 sec - in org.apache.hadoop.log.TestLog4Json
Running org.apache.hadoop.jmx.TestJMXJsonServlet
Tests run: 1, Failures: 0, Errors: 0, Skipped: 0, Time elapsed: 1.496 sec - in org.apache.hadoop.jmx.TestJMXJsonServlet
Running org.apache.hadoop.ipc.TestIPCServerResponder
Tests run: 3, Failures: 0, Errors: 0, Skipped: 0, Time elapsed: 9.105 sec - in org.apache.hadoop.ipc.TestIPCServerResponder
Running org.apache.hadoop.ipc.TestRPCWaitForProxy
Tests run: 2, Failures: 0, Errors: 0, Skipped: 0, Time elapsed: 1.593 sec - in org.apache.hadoop.ipc.TestRPCWaitForProxy
Running org.apache.hadoop.ipc.TestSocketFactory
Tests run: 1, Failures: 0, Errors: 0, Skipped: 0, Time elapsed: 0.502 sec - in org.apache.hadoop.ipc.TestSocketFactory
Running org.apache.hadoop.ipc.TestCallQueueManager
Tests run: 3, Failures: 0, Errors: 0, Skipped: 0, Time elapsed: 8.42 sec - in org.apache.hadoop.ipc.TestCallQueueManager
Running org.apache.hadoop.ipc.TestIdentityProviders
Tests run: 2, Failures: 0, Errors: 0, Skipped: 0, Time elapsed: 0.925 sec - in org.apache.hadoop.ipc.TestIdentityProviders
Running org.apache.hadoop.ipc.TestWeightedRoundRobinMultiplexer
Tests run: 6, Failures: 0, Errors: 0, Skipped: 0, Time elapsed: 0.898 sec - in org.apache.hadoop.ipc.TestWeightedRoundRobinMultiplexer
Running org.apache.hadoop.ipc.TestRPCCompatibility
Tests run: 8, Failures: 0, Errors: 0, Skipped: 0, Time elapsed: 1.629 sec - in org.apache.hadoop.ipc.TestRPCCompatibility
Running org.apache.hadoop.ipc.TestProtoBufRpc
Tests run: 6, Failures: 0, Errors: 0, Skipped: 0, Time elapsed: 14.474 sec - in org.apache.hadoop.ipc.TestProtoBufRpc
Running org.apache.hadoop.ipc.TestMultipleProtocolServer
Tests run: 5, Failures: 0, Errors: 0, Skipped: 0, Time elapsed: 1.63 sec - in org.apache.hadoop.ipc.TestMultipleProtocolServer
Running org.apache.hadoop.ipc.TestRPCCallBenchmark
Tests run: 2, Failures: 0, Errors: 0, Skipped: 0, Time elapsed: 11.356 sec - in org.apache.hadoop.ipc.TestRPCCallBenchmark
Running org.apache.hadoop.ipc.TestRetryCacheMetrics
Tests run: 1, Failures: 0, Errors: 0, Skipped: 0, Time elapsed: 0.585 sec - in org.apache.hadoop.ipc.TestRetryCacheMetrics
Running org.apache.hadoop.ipc.TestMiniRPCBenchmark
Tests run: 1, Failures: 0, Errors: 0, Skipped: 0, Time elapsed: 1.365 sec - in org.apache.hadoop.ipc.TestMiniRPCBenchmark
Running org.apache.hadoop.ipc.TestIPC
Tests run: 34, Failures: 0, Errors: 0, Skipped: 0, Time elapsed: 95.803 sec - in org.apache.hadoop.ipc.TestIPC
Running org.apache.hadoop.ipc.TestDecayRpcScheduler
Tests run: 9, Failures: 0, Errors: 0, Skipped: 0, Time elapsed: 1.518 sec - in org.apache.hadoop.ipc.TestDecayRpcScheduler
Running org.apache.hadoop.ipc.TestFairCallQueue
Tests run: 22, Failures: 0, Errors: 0, Skipped: 0, Time elapsed: 2.011 sec - in org.apache.hadoop.ipc.TestFairCallQueue
Running org.apache.hadoop.ipc.TestServer
Tests run: 5, Failures: 0, Errors: 0, Skipped: 0, Time elapsed: 0.776 sec - in org.apache.hadoop.ipc.TestServer
Running org.apache.hadoop.ipc.TestRPC
Tests run: 20, Failures: 0, Errors: 0, Skipped: 0, Time elapsed: 20.172 sec - in org.apache.hadoop.ipc.TestRPC
Running org.apache.hadoop.ipc.TestSaslRPC
Tests run: 90, Failures: 0, Errors: 0, Skipped: 0, Time elapsed: 37.515 sec - in org.apache.hadoop.ipc.TestSaslRPC
Running org.apache.hadoop.ipc.TestRetryCache
Tests run: 6, Failures: 0, Errors: 0, Skipped: 0, Time elapsed: 1.733 sec - in org.apache.hadoop.ipc.TestRetryCache
Running org.apache.hadoop.security.token.delegation.web.TestDelegationTokenAuthenticationHandlerWithMocks
Tests run: 2, Failures: 0, Errors: 0, Skipped: 0, Time elapsed: 2.223 sec - in org.apache.hadoop.security.token.delegation.web.TestDelegationTokenAuthenticationHandlerWithMocks
Running org.apache.hadoop.security.token.delegation.web.TestDelegationTokenManager
Tests run: 2, Failures: 0, Errors: 0, Skipped: 0, Time elapsed: 1.419 sec - in org.apache.hadoop.security.token.delegation.web.TestDelegationTokenManager
Running org.apache.hadoop.security.token.delegation.web.TestWebDelegationToken
Tests run: 12, Failures: 0, Errors: 0, Skipped: 0, Time elapsed: 14.489 sec - in org.apache.hadoop.security.token.delegation.web.TestWebDelegationToken
Running org.apache.hadoop.security.token.delegation.TestDelegationToken
Tests run: 15, Failures: 0, Errors: 0, Skipped: 0, Time elapsed: 31.609 sec - in org.apache.hadoop.security.token.delegation.TestDelegationToken
Running org.apache.hadoop.security.token.delegation.TestZKDelegationTokenSecretManager
Tests run: 6, Failures: 0, Errors: 0, Skipped: 0, Time elapsed: 61.891 sec - in org.apache.hadoop.security.token.delegation.TestZKDelegationTokenSecretManager
Running org.apache.hadoop.security.token.TestToken
Tests run: 3, Failures: 0, Errors: 0, Skipped: 0, Time elapsed: 0.683 sec - in org.apache.hadoop.security.token.TestToken
Running org.apache.hadoop.security.TestWhitelistBasedResolver
Tests run: 3, Failures: 0, Errors: 0, Skipped: 0, Time elapsed: 0.734 sec - in org.apache.hadoop.security.TestWhitelistBasedResolver
Running org.apache.hadoop.security.TestAuthenticationFilter
Tests run: 1, Failures: 0, Errors: 0, Skipped: 0, Time elapsed: 0.811 sec - in org.apache.hadoop.security.TestAuthenticationFilter
Running org.apache.hadoop.security.TestGroupFallback
Tests run: 4, Failures: 0, Errors: 0, Skipped: 0, Time elapsed: 0.938 sec - in org.apache.hadoop.security.TestGroupFallback
Running org.apache.hadoop.security.TestProxyUserFromEnv
Tests run: 1, Failures: 0, Errors: 0, Skipped: 0, Time elapsed: 0.764 sec - in org.apache.hadoop.security.TestProxyUserFromEnv
Running org.apache.hadoop.security.TestUGILoginFromKeytab
Tests run: 1, Failures: 0, Errors: 0, Skipped: 0, Time elapsed: 7.499 sec - in org.apache.hadoop.security.TestUGILoginFromKeytab
Running org.apache.hadoop.security.TestLdapGroupsMappingWithPosixGroup
Tests run: 1, Failures: 0, Errors: 0, Skipped: 0, Time elapsed: 0.993 sec - in org.apache.hadoop.security.TestLdapGroupsMappingWithPosixGroup
Running org.apache.hadoop.security.TestShellBasedIdMapping
Tests run: 7, Failures: 0, Errors: 0, Skipped: 0, Time elapsed: 3.404 sec - in org.apache.hadoop.security.TestShellBasedIdMapping
Running org.apache.hadoop.security.TestDoAsEffectiveUser
Tests run: 9, Failures: 0, Errors: 0, Skipped: 0, Time elapsed: 1.932 sec - in org.apache.hadoop.security.TestDoAsEffectiveUser
Running org.apache.hadoop.security.TestUGIWithExternalKdc
Tests run: 1, Failures: 0, Errors: 0, Skipped: 1, Time elapsed: 0.128 sec - in org.apache.hadoop.security.TestUGIWithExternalKdc
Running org.apache.hadoop.security.TestJNIGroupsMapping
Tests run: 1, Failures: 0, Errors: 0, Skipped: 0, Time elapsed: 0.805 sec - in org.apache.hadoop.security.TestJNIGroupsMapping
Running org.apache.hadoop.security.TestGroupsCaching
Tests run: 10, Failures: 0, Errors: 0, Skipped: 0, Time elapsed: 2.201 sec - in org.apache.hadoop.security.TestGroupsCaching
Running org.apache.hadoop.security.alias.TestCredentialProviderFactory
Tests run: 6, Failures: 0, Errors: 0, Skipped: 0, Time elapsed: 2.454 sec - in org.apache.hadoop.security.alias.TestCredentialProviderFactory
Running org.apache.hadoop.security.alias.TestCredentialProvider
Tests run: 2, Failures: 0, Errors: 0, Skipped: 0, Time elapsed: 0.167 sec - in org.apache.hadoop.security.alias.TestCredentialProvider
Running org.apache.hadoop.security.alias.TestCredShell
Tests run: 9, Failures: 0, Errors: 0, Skipped: 0, Time elapsed: 1.867 sec - in org.apache.hadoop.security.alias.TestCredShell
Running org.apache.hadoop.security.ssl.TestReloadingX509TrustManager
Tests run: 5, Failures: 0, Errors: 0, Skipped: 0, Time elapsed: 3.288 sec - in org.apache.hadoop.security.ssl.TestReloadingX509TrustManager
Running org.apache.hadoop.security.ssl.TestSSLFactory
Tests run: 15, Failures: 0, Errors: 0, Skipped: 0, Time elapsed: 5.642 sec - in org.apache.hadoop.security.ssl.TestSSLFactory
Running org.apache.hadoop.security.TestLdapGroupsMapping
Tests run: 5, Failures: 0, Errors: 0, Skipped: 0, Time elapsed: 2.131 sec - in org.apache.hadoop.security.TestLdapGroupsMapping
Running org.apache.hadoop.security.TestUserFromEnv
Tests run: 1, Failures: 0, Errors: 0, Skipped: 0, Time elapsed: 0.733 sec - in org.apache.hadoop.security.TestUserFromEnv
Running org.apache.hadoop.security.TestHttpCrossOriginFilterInitializer
Tests run: 1, Failures: 0, Errors: 0, Skipped: 0, Time elapsed: 0.559 sec - in org.apache.hadoop.security.TestHttpCrossOriginFilterInitializer
Running org.apache.hadoop.security.http.TestCrossOriginFilter
Tests run: 9, Failures: 0, Errors: 0, Skipped: 0, Time elapsed: 0.676 sec - in org.apache.hadoop.security.http.TestCrossOriginFilter
Running org.apache.hadoop.security.TestCredentials
Tests run: 4, Failures: 0, Errors: 0, Skipped: 0, Time elapsed: 0.952 sec - in org.apache.hadoop.security.TestCredentials
Running org.apache.hadoop.security.TestNetgroupCache
Tests run: 3, Failures: 0, Errors: 0, Skipped: 0, Time elapsed: 0.114 sec - in org.apache.hadoop.security.TestNetgroupCache
Running org.apache.hadoop.security.TestUGIWithSecurityOn
Tests run: 2, Failures: 0, Errors: 0, Skipped: 2, Time elapsed: 0.134 sec - in org.apache.hadoop.security.TestUGIWithSecurityOn
Running org.apache.hadoop.security.authorize.TestAccessControlList
Tests run: 8, Failures: 0, Errors: 0, Skipped: 0, Time elapsed: 1.297 sec - in org.apache.hadoop.security.authorize.TestAccessControlList
Running org.apache.hadoop.security.authorize.TestProxyUsers
Tests run: 17, Failures: 0, Errors: 0, Skipped: 0, Time elapsed: 1.667 sec - in org.apache.hadoop.security.authorize.TestProxyUsers
Running org.apache.hadoop.security.authorize.TestProxyServers
Tests run: 1, Failures: 0, Errors: 0, Skipped: 0, Time elapsed: 0.536 sec - in org.apache.hadoop.security.authorize.TestProxyServers
Running org.apache.hadoop.security.authorize.TestServiceAuthorization
Tests run: 7, Failures: 0, Errors: 0, Skipped: 0, Time elapsed: 1.688 sec - in org.apache.hadoop.security.authorize.TestServiceAuthorization
Running org.apache.hadoop.security.TestCompositeGroupMapping
Tests run: 3, Failures: 0, Errors: 0, Skipped: 0, Time elapsed: 1.205 sec - in org.apache.hadoop.security.TestCompositeGroupMapping
Running org.apache.hadoop.security.TestSecurityUtil
Tests run: 17, Failures: 0, Errors: 0, Skipped: 0, Time elapsed: 1.46 sec - in org.apache.hadoop.security.TestSecurityUtil
Running org.apache.hadoop.security.TestUserGroupInformation
Tests run: 34, Failures: 0, Errors: 0, Skipped: 0, Time elapsed: 4.782 sec - in org.apache.hadoop.security.TestUserGroupInformation
Running org.apache.hadoop.tracing.TestTraceUtils
Tests run: 3, Failures: 0, Errors: 0, Skipped: 0, Time elapsed: 0.714 sec - in org.apache.hadoop.tracing.TestTraceUtils
Running org.apache.hadoop.http.lib.TestStaticUserWebFilter
Tests run: 3, Failures: 0, Errors: 0, Skipped: 0, Time elapsed: 0.811 sec - in org.apache.hadoop.http.lib.TestStaticUserWebFilter
Running org.apache.hadoop.http.TestServletFilter
Tests run: 3, Failures: 0, Errors: 0, Skipped: 0, Time elapsed: 1.722 sec - in org.apache.hadoop.http.TestServletFilter
Running org.apache.hadoop.http.TestHttpRequestLogAppender
Tests run: 1, Failures: 0, Errors: 0, Skipped: 0, Time elapsed: 0.112 sec - in org.apache.hadoop.http.TestHttpRequestLogAppender
Running org.apache.hadoop.http.TestHtmlQuoting
Tests run: 4, Failures: 0, Errors: 0, Skipped: 0, Time elapsed: 0.456 sec - in org.apache.hadoop.http.TestHtmlQuoting
Running org.apache.hadoop.http.TestPathFilter
Tests run: 1, Failures: 0, Errors: 0, Skipped: 0, Time elapsed: 1.226 sec - in org.apache.hadoop.http.TestPathFilter
Running org.apache.hadoop.http.TestGlobalFilter
Tests run: 1, Failures: 0, Errors: 0, Skipped: 0, Time elapsed: 1.572 sec - in org.apache.hadoop.http.TestGlobalFilter
Running org.apache.hadoop.http.TestHttpServerLifecycle
Tests run: 7, Failures: 0, Errors: 0, Skipped: 0, Time elapsed: 2.074 sec - in org.apache.hadoop.http.TestHttpServerLifecycle
Running org.apache.hadoop.http.TestAuthenticationSessionCookie
Tests run: 2, Failures: 0, Errors: 0, Skipped: 0, Time elapsed: 3.387 sec - in org.apache.hadoop.http.TestAuthenticationSessionCookie
Running org.apache.hadoop.http.TestHttpRequestLog
Tests run: 2, Failures: 0, Errors: 0, Skipped: 0, Time elapsed: 0.331 sec - in org.apache.hadoop.http.TestHttpRequestLog
Running org.apache.hadoop.http.TestHttpServerWebapps
Tests run: 2, Failures: 0, Errors: 0, Skipped: 0, Time elapsed: 0.886 sec - in org.apache.hadoop.http.TestHttpServerWebapps
Running org.apache.hadoop.http.TestHttpCookieFlag
Tests run: 2, Failures: 0, Errors: 0, Skipped: 0, Time elapsed: 2.945 sec - in org.apache.hadoop.http.TestHttpCookieFlag
Running org.apache.hadoop.http.TestHttpServer
Tests run: 14, Failures: 0, Errors: 0, Skipped: 0, Time elapsed: 5.592 sec - in org.apache.hadoop.http.TestHttpServer
Running org.apache.hadoop.http.TestSSLHttpServer
Tests run: 2, Failures: 0, Errors: 0, Skipped: 0, Time elapsed: 2.747 sec - in org.apache.hadoop.http.TestSSLHttpServer
Running org.apache.hadoop.metrics.spi.TestOutputRecord
Tests run: 1, Failures: 0, Errors: 0, Skipped: 0, Time elapsed: 0.071 sec - in org.apache.hadoop.metrics.spi.TestOutputRecord
Running org.apache.hadoop.metrics.ganglia.TestGangliaContext
Tests run: 5, Failures: 0, Errors: 0, Skipped: 0, Time elapsed: 0.245 sec - in org.apache.hadoop.metrics.ganglia.TestGangliaContext
Running org.apache.hadoop.metrics.TestMetricsServlet
Tests run: 3, Failures: 0, Errors: 0, Skipped: 0, Time elapsed: 0.154 sec - in org.apache.hadoop.metrics.TestMetricsServlet
Running org.apache.hadoop.net.TestSocketIOWithTimeout
Tests run: 1, Failures: 0, Errors: 0, Skipped: 0, Time elapsed: 5.592 sec - in org.apache.hadoop.net.TestSocketIOWithTimeout
Running org.apache.hadoop.net.TestSwitchMapping
Tests run: 5, Failures: 0, Errors: 0, Skipped: 0, Time elapsed: 0.772 sec - in org.apache.hadoop.net.TestSwitchMapping
Running org.apache.hadoop.net.TestStaticMapping
Tests run: 8, Failures: 0, Errors: 0, Skipped: 0, Time elapsed: 1.08 sec - in org.apache.hadoop.net.TestStaticMapping
Running org.apache.hadoop.net.TestNetUtils
Tests run: 40, Failures: 0, Errors: 0, Skipped: 0, Time elapsed: 3.978 sec - in org.apache.hadoop.net.TestNetUtils
Running org.apache.hadoop.net.TestClusterTopology
Tests run: 2, Failures: 0, Errors: 0, Skipped: 0, Time elapsed: 0.343 sec - in org.apache.hadoop.net.TestClusterTopology
Running org.apache.hadoop.net.TestDNS
Tests run: 12, Failures: 0, Errors: 0, Skipped: 0, Time elapsed: 0.445 sec - in org.apache.hadoop.net.TestDNS
Running org.apache.hadoop.net.unix.TestDomainSocket
Tests run: 17, Failures: 0, Errors: 0, Skipped: 0, Time elapsed: 3.039 sec - in org.apache.hadoop.net.unix.TestDomainSocket
Running org.apache.hadoop.net.unix.TestDomainSocketWatcher
Tests run: 6, Failures: 0, Errors: 0, Skipped: 0, Time elapsed: 0.757 sec - in org.apache.hadoop.net.unix.TestDomainSocketWatcher
Running org.apache.hadoop.net.TestScriptBasedMapping
Tests run: 4, Failures: 0, Errors: 0, Skipped: 0, Time elapsed: 0.858 sec - in org.apache.hadoop.net.TestScriptBasedMapping
Running org.apache.hadoop.net.TestTableMapping
Tests run: 6, Failures: 0, Errors: 0, Skipped: 0, Time elapsed: 1.066 sec - in org.apache.hadoop.net.TestTableMapping
Running org.apache.hadoop.net.TestNetworkTopologyWithNodeGroup
Tests run: 8, Failures: 0, Errors: 0, Skipped: 0, Time elapsed: 0.265 sec - in org.apache.hadoop.net.TestNetworkTopologyWithNodeGroup
Running org.apache.hadoop.net.TestScriptBasedMappingWithDependency
Tests run: 4, Failures: 0, Errors: 0, Skipped: 0, Time elapsed: 0.859 sec - in org.apache.hadoop.net.TestScriptBasedMappingWithDependency
Running org.apache.hadoop.cli.TestCLI
Tests run: 1, Failures: 0, Errors: 0, Skipped: 0, Time elapsed: 1.094 sec - in org.apache.hadoop.cli.TestCLI
Running org.apache.hadoop.service.TestServiceLifecycle
Tests run: 18, Failures: 0, Errors: 0, Skipped: 0, Time elapsed: 2.518 sec - in org.apache.hadoop.service.TestServiceLifecycle
Running org.apache.hadoop.service.TestCompositeService
Tests run: 18, Failures: 0, Errors: 0, Skipped: 0, Time elapsed: 0.32 sec - in org.apache.hadoop.service.TestCompositeService
Running org.apache.hadoop.service.TestGlobalStateChangeListener
Tests run: 5, Failures: 0, Errors: 0, Skipped: 0, Time elapsed: 0.342 sec - in org.apache.hadoop.service.TestGlobalStateChangeListener

Results :

Failed tests: 
  TestFsPermission.testDeprecatedUmask:706 expected:<302> but was:<18>

Tests in error: 
  TestZKFailoverController.testGracefulFailoverMultipleZKfcs:586 ยป ServiceFailed

Tests run: 3203, Failures: 1, Errors: 1, Skipped: 86

[INFO] ------------------------------------------------------------------------
[INFO] Reactor Summary:
[INFO] 
[INFO] Apache Hadoop Annotations ......................... SUCCESS [ 12.794 s]
[INFO] Apache Hadoop MiniKDC ............................. SUCCESS [ 31.706 s]
[INFO] Apache Hadoop Auth ................................ SUCCESS [04:37 min]
[INFO] Apache Hadoop Auth Examples ....................... SUCCESS [  5.787 s]
[INFO] Apache Hadoop Common .............................. FAILURE [29:44 min]
[INFO] Apache Hadoop NFS ................................. SKIPPED
[INFO] Apache Hadoop KMS ................................. SKIPPED
[INFO] Apache Hadoop Common Project ...................... SKIPPED
[INFO] ------------------------------------------------------------------------
[INFO] BUILD FAILURE
[INFO] ------------------------------------------------------------------------
[INFO] Total time: 35:14 min
[INFO] Finished at: 2015-11-25T08:58:12+00:00
[INFO] Final Memory: 84M/978M
[INFO] ------------------------------------------------------------------------
[ERROR] Failed to execute goal org.apache.maven.plugins:maven-surefire-plugin:2.17:test (default-test)
on project hadoop-common: There are test failures.
[ERROR] 
[ERROR] Please refer to <https://builds.apache.org/job/Hadoop-Common-trunk/ws/hadoop-common-project/hadoop-common/target/surefire-reports>
for the individual test results.
[ERROR] -> [Help 1]
[ERROR] 
[ERROR] To see the full stack trace of the errors, re-run Maven with the -e switch.
[ERROR] Re-run Maven using the -X switch to enable full debug logging.
[ERROR] 
[ERROR] For more information about the errors and possible solutions, please read the following
articles:
[ERROR] [Help 1] http://cwiki.apache.org/confluence/display/MAVEN/MojoFailureException
[ERROR] 
[ERROR] After correcting the problems, you can resume the build with the command
[ERROR]   mvn <goals> -rf :hadoop-common
result: 1

################
# mvn -eaf test -Pclover -DcloverLicenseLocation=/home/jenkins/tools/clover/latest/lib/clover.license
################
Build step 'Execute shell' marked build as failure
Archiving artifacts
Recording test results

Mime
View raw message