hadoop-common-dev mailing list archives

Site index · List index
Message view « Date » · « Thread »
Top « Date » · « Thread »
From Apache Jenkins Server <jenk...@builds.apache.org>
Subject Build failed in Jenkins: Hadoop-common-trunk-Java8 #651
Date Thu, 05 Nov 2015 16:53:47 GMT
See <https://builds.apache.org/job/Hadoop-common-trunk-Java8/651/changes>

Changes:

[kihwal] HDFS-4937. ReplicationMonitor can infinite-loop in

------------------------------------------
[...truncated 5905 lines...]
Java HotSpot(TM) 64-Bit Server VM warning: ignoring option MaxPermSize=768m; support was removed
in 8.0
Running org.apache.hadoop.security.TestLdapGroupsMappingWithPosixGroup
Tests run: 1, Failures: 0, Errors: 0, Skipped: 0, Time elapsed: 0.641 sec - in org.apache.hadoop.security.TestLdapGroupsMappingWithPosixGroup
Java HotSpot(TM) 64-Bit Server VM warning: ignoring option MaxPermSize=768m; support was removed
in 8.0
Running org.apache.hadoop.security.TestShellBasedIdMapping
Tests run: 7, Failures: 0, Errors: 0, Skipped: 0, Time elapsed: 2.669 sec - in org.apache.hadoop.security.TestShellBasedIdMapping
Java HotSpot(TM) 64-Bit Server VM warning: ignoring option MaxPermSize=768m; support was removed
in 8.0
Running org.apache.hadoop.security.TestDoAsEffectiveUser
Tests run: 9, Failures: 0, Errors: 0, Skipped: 0, Time elapsed: 1.321 sec - in org.apache.hadoop.security.TestDoAsEffectiveUser
Java HotSpot(TM) 64-Bit Server VM warning: ignoring option MaxPermSize=768m; support was removed
in 8.0
Running org.apache.hadoop.security.TestUGIWithExternalKdc
Tests run: 1, Failures: 0, Errors: 0, Skipped: 1, Time elapsed: 0.071 sec - in org.apache.hadoop.security.TestUGIWithExternalKdc
Java HotSpot(TM) 64-Bit Server VM warning: ignoring option MaxPermSize=768m; support was removed
in 8.0
Running org.apache.hadoop.security.TestJNIGroupsMapping
Tests run: 1, Failures: 0, Errors: 0, Skipped: 0, Time elapsed: 0.48 sec - in org.apache.hadoop.security.TestJNIGroupsMapping
Java HotSpot(TM) 64-Bit Server VM warning: ignoring option MaxPermSize=768m; support was removed
in 8.0
Running org.apache.hadoop.security.TestGroupsCaching
Tests run: 10, Failures: 0, Errors: 0, Skipped: 0, Time elapsed: 1.683 sec - in org.apache.hadoop.security.TestGroupsCaching
Java HotSpot(TM) 64-Bit Server VM warning: ignoring option MaxPermSize=768m; support was removed
in 8.0
Running org.apache.hadoop.security.alias.TestCredentialProviderFactory
Tests run: 6, Failures: 0, Errors: 0, Skipped: 0, Time elapsed: 1.153 sec - in org.apache.hadoop.security.alias.TestCredentialProviderFactory
Java HotSpot(TM) 64-Bit Server VM warning: ignoring option MaxPermSize=768m; support was removed
in 8.0
Running org.apache.hadoop.security.alias.TestCredentialProvider
Tests run: 2, Failures: 0, Errors: 0, Skipped: 0, Time elapsed: 0.089 sec - in org.apache.hadoop.security.alias.TestCredentialProvider
Java HotSpot(TM) 64-Bit Server VM warning: ignoring option MaxPermSize=768m; support was removed
in 8.0
Running org.apache.hadoop.security.alias.TestCredShell
Tests run: 9, Failures: 0, Errors: 0, Skipped: 0, Time elapsed: 1.079 sec - in org.apache.hadoop.security.alias.TestCredShell
Java HotSpot(TM) 64-Bit Server VM warning: ignoring option MaxPermSize=768m; support was removed
in 8.0
Running org.apache.hadoop.security.ssl.TestReloadingX509TrustManager
Tests run: 5, Failures: 0, Errors: 0, Skipped: 0, Time elapsed: 2.393 sec - in org.apache.hadoop.security.ssl.TestReloadingX509TrustManager
Java HotSpot(TM) 64-Bit Server VM warning: ignoring option MaxPermSize=768m; support was removed
in 8.0
Running org.apache.hadoop.security.ssl.TestSSLFactory
Tests run: 15, Failures: 0, Errors: 0, Skipped: 0, Time elapsed: 3.208 sec - in org.apache.hadoop.security.ssl.TestSSLFactory
Java HotSpot(TM) 64-Bit Server VM warning: ignoring option MaxPermSize=768m; support was removed
in 8.0
Running org.apache.hadoop.security.TestLdapGroupsMapping
Tests run: 5, Failures: 0, Errors: 0, Skipped: 0, Time elapsed: 1.299 sec - in org.apache.hadoop.security.TestLdapGroupsMapping
Java HotSpot(TM) 64-Bit Server VM warning: ignoring option MaxPermSize=768m; support was removed
in 8.0
Running org.apache.hadoop.security.TestUserFromEnv
Tests run: 1, Failures: 0, Errors: 0, Skipped: 0, Time elapsed: 0.475 sec - in org.apache.hadoop.security.TestUserFromEnv
Java HotSpot(TM) 64-Bit Server VM warning: ignoring option MaxPermSize=768m; support was removed
in 8.0
Running org.apache.hadoop.security.TestHttpCrossOriginFilterInitializer
Tests run: 1, Failures: 0, Errors: 0, Skipped: 0, Time elapsed: 0.316 sec - in org.apache.hadoop.security.TestHttpCrossOriginFilterInitializer
Java HotSpot(TM) 64-Bit Server VM warning: ignoring option MaxPermSize=768m; support was removed
in 8.0
Running org.apache.hadoop.security.http.TestCrossOriginFilter
Tests run: 9, Failures: 0, Errors: 0, Skipped: 0, Time elapsed: 0.451 sec - in org.apache.hadoop.security.http.TestCrossOriginFilter
Java HotSpot(TM) 64-Bit Server VM warning: ignoring option MaxPermSize=768m; support was removed
in 8.0
Running org.apache.hadoop.security.TestCredentials
Tests run: 4, Failures: 0, Errors: 0, Skipped: 0, Time elapsed: 0.62 sec - in org.apache.hadoop.security.TestCredentials
Java HotSpot(TM) 64-Bit Server VM warning: ignoring option MaxPermSize=768m; support was removed
in 8.0
Running org.apache.hadoop.security.TestNetgroupCache
Tests run: 3, Failures: 0, Errors: 0, Skipped: 0, Time elapsed: 0.076 sec - in org.apache.hadoop.security.TestNetgroupCache
Java HotSpot(TM) 64-Bit Server VM warning: ignoring option MaxPermSize=768m; support was removed
in 8.0
Running org.apache.hadoop.security.TestUGIWithSecurityOn
Tests run: 2, Failures: 0, Errors: 0, Skipped: 2, Time elapsed: 0.08 sec - in org.apache.hadoop.security.TestUGIWithSecurityOn
Java HotSpot(TM) 64-Bit Server VM warning: ignoring option MaxPermSize=768m; support was removed
in 8.0
Running org.apache.hadoop.security.authorize.TestAccessControlList
Tests run: 8, Failures: 0, Errors: 0, Skipped: 0, Time elapsed: 0.784 sec - in org.apache.hadoop.security.authorize.TestAccessControlList
Java HotSpot(TM) 64-Bit Server VM warning: ignoring option MaxPermSize=768m; support was removed
in 8.0
Running org.apache.hadoop.security.authorize.TestProxyUsers
Tests run: 17, Failures: 0, Errors: 0, Skipped: 0, Time elapsed: 0.781 sec - in org.apache.hadoop.security.authorize.TestProxyUsers
Java HotSpot(TM) 64-Bit Server VM warning: ignoring option MaxPermSize=768m; support was removed
in 8.0
Running org.apache.hadoop.security.authorize.TestProxyServers
Tests run: 1, Failures: 0, Errors: 0, Skipped: 0, Time elapsed: 0.411 sec - in org.apache.hadoop.security.authorize.TestProxyServers
Java HotSpot(TM) 64-Bit Server VM warning: ignoring option MaxPermSize=768m; support was removed
in 8.0
Running org.apache.hadoop.security.authorize.TestServiceAuthorization
Tests run: 7, Failures: 0, Errors: 0, Skipped: 0, Time elapsed: 0.989 sec - in org.apache.hadoop.security.authorize.TestServiceAuthorization
Java HotSpot(TM) 64-Bit Server VM warning: ignoring option MaxPermSize=768m; support was removed
in 8.0
Running org.apache.hadoop.security.TestCompositeGroupMapping
Tests run: 3, Failures: 0, Errors: 0, Skipped: 0, Time elapsed: 0.636 sec - in org.apache.hadoop.security.TestCompositeGroupMapping
Java HotSpot(TM) 64-Bit Server VM warning: ignoring option MaxPermSize=768m; support was removed
in 8.0
Running org.apache.hadoop.security.TestSecurityUtil
Tests run: 17, Failures: 0, Errors: 0, Skipped: 0, Time elapsed: 0.788 sec - in org.apache.hadoop.security.TestSecurityUtil
Java HotSpot(TM) 64-Bit Server VM warning: ignoring option MaxPermSize=768m; support was removed
in 8.0
Running org.apache.hadoop.security.TestUserGroupInformation
Tests run: 34, Failures: 0, Errors: 0, Skipped: 0, Time elapsed: 3.39 sec - in org.apache.hadoop.security.TestUserGroupInformation
Java HotSpot(TM) 64-Bit Server VM warning: ignoring option MaxPermSize=768m; support was removed
in 8.0
Running org.apache.hadoop.tracing.TestTraceUtils
Tests run: 3, Failures: 0, Errors: 0, Skipped: 0, Time elapsed: 0.471 sec - in org.apache.hadoop.tracing.TestTraceUtils
Java HotSpot(TM) 64-Bit Server VM warning: ignoring option MaxPermSize=768m; support was removed
in 8.0
Running org.apache.hadoop.http.lib.TestStaticUserWebFilter
Tests run: 3, Failures: 0, Errors: 0, Skipped: 0, Time elapsed: 0.563 sec - in org.apache.hadoop.http.lib.TestStaticUserWebFilter
Java HotSpot(TM) 64-Bit Server VM warning: ignoring option MaxPermSize=768m; support was removed
in 8.0
Running org.apache.hadoop.http.TestServletFilter
Tests run: 3, Failures: 0, Errors: 0, Skipped: 0, Time elapsed: 1.429 sec - in org.apache.hadoop.http.TestServletFilter
Java HotSpot(TM) 64-Bit Server VM warning: ignoring option MaxPermSize=768m; support was removed
in 8.0
Running org.apache.hadoop.http.TestHttpRequestLogAppender
Tests run: 1, Failures: 0, Errors: 0, Skipped: 0, Time elapsed: 0.071 sec - in org.apache.hadoop.http.TestHttpRequestLogAppender
Java HotSpot(TM) 64-Bit Server VM warning: ignoring option MaxPermSize=768m; support was removed
in 8.0
Running org.apache.hadoop.http.TestHtmlQuoting
Tests run: 4, Failures: 0, Errors: 0, Skipped: 0, Time elapsed: 0.292 sec - in org.apache.hadoop.http.TestHtmlQuoting
Java HotSpot(TM) 64-Bit Server VM warning: ignoring option MaxPermSize=768m; support was removed
in 8.0
Running org.apache.hadoop.http.TestPathFilter
Tests run: 1, Failures: 0, Errors: 0, Skipped: 0, Time elapsed: 0.965 sec - in org.apache.hadoop.http.TestPathFilter
Java HotSpot(TM) 64-Bit Server VM warning: ignoring option MaxPermSize=768m; support was removed
in 8.0
Running org.apache.hadoop.http.TestGlobalFilter
Tests run: 1, Failures: 0, Errors: 0, Skipped: 0, Time elapsed: 1.02 sec - in org.apache.hadoop.http.TestGlobalFilter
Java HotSpot(TM) 64-Bit Server VM warning: ignoring option MaxPermSize=768m; support was removed
in 8.0
Running org.apache.hadoop.http.TestHttpServerLifecycle
Tests run: 7, Failures: 0, Errors: 0, Skipped: 0, Time elapsed: 1.437 sec - in org.apache.hadoop.http.TestHttpServerLifecycle
Java HotSpot(TM) 64-Bit Server VM warning: ignoring option MaxPermSize=768m; support was removed
in 8.0
Running org.apache.hadoop.http.TestAuthenticationSessionCookie
Tests run: 2, Failures: 0, Errors: 0, Skipped: 0, Time elapsed: 1.884 sec - in org.apache.hadoop.http.TestAuthenticationSessionCookie
Java HotSpot(TM) 64-Bit Server VM warning: ignoring option MaxPermSize=768m; support was removed
in 8.0
Running org.apache.hadoop.http.TestHttpRequestLog
Tests run: 2, Failures: 0, Errors: 0, Skipped: 0, Time elapsed: 0.185 sec - in org.apache.hadoop.http.TestHttpRequestLog
Java HotSpot(TM) 64-Bit Server VM warning: ignoring option MaxPermSize=768m; support was removed
in 8.0
Running org.apache.hadoop.http.TestHttpServerWebapps
Tests run: 2, Failures: 0, Errors: 0, Skipped: 0, Time elapsed: 0.542 sec - in org.apache.hadoop.http.TestHttpServerWebapps
Java HotSpot(TM) 64-Bit Server VM warning: ignoring option MaxPermSize=768m; support was removed
in 8.0
Running org.apache.hadoop.http.TestHttpCookieFlag
Tests run: 2, Failures: 0, Errors: 0, Skipped: 0, Time elapsed: 1.71 sec - in org.apache.hadoop.http.TestHttpCookieFlag
Java HotSpot(TM) 64-Bit Server VM warning: ignoring option MaxPermSize=768m; support was removed
in 8.0
Running org.apache.hadoop.http.TestHttpServer
Tests run: 14, Failures: 0, Errors: 0, Skipped: 0, Time elapsed: 3.508 sec - in org.apache.hadoop.http.TestHttpServer
Java HotSpot(TM) 64-Bit Server VM warning: ignoring option MaxPermSize=768m; support was removed
in 8.0
Running org.apache.hadoop.http.TestSSLHttpServer
Tests run: 2, Failures: 0, Errors: 0, Skipped: 0, Time elapsed: 1.734 sec - in org.apache.hadoop.http.TestSSLHttpServer
Java HotSpot(TM) 64-Bit Server VM warning: ignoring option MaxPermSize=768m; support was removed
in 8.0
Running org.apache.hadoop.metrics.spi.TestOutputRecord
Tests run: 1, Failures: 0, Errors: 0, Skipped: 0, Time elapsed: 0.059 sec - in org.apache.hadoop.metrics.spi.TestOutputRecord
Java HotSpot(TM) 64-Bit Server VM warning: ignoring option MaxPermSize=768m; support was removed
in 8.0
Running org.apache.hadoop.metrics.ganglia.TestGangliaContext
Tests run: 5, Failures: 0, Errors: 0, Skipped: 0, Time elapsed: 0.17 sec - in org.apache.hadoop.metrics.ganglia.TestGangliaContext
Java HotSpot(TM) 64-Bit Server VM warning: ignoring option MaxPermSize=768m; support was removed
in 8.0
Running org.apache.hadoop.metrics.TestMetricsServlet
Tests run: 3, Failures: 0, Errors: 0, Skipped: 0, Time elapsed: 0.087 sec - in org.apache.hadoop.metrics.TestMetricsServlet
Java HotSpot(TM) 64-Bit Server VM warning: ignoring option MaxPermSize=768m; support was removed
in 8.0
Running org.apache.hadoop.net.TestSocketIOWithTimeout
Tests run: 1, Failures: 0, Errors: 0, Skipped: 0, Time elapsed: 5.346 sec - in org.apache.hadoop.net.TestSocketIOWithTimeout
Java HotSpot(TM) 64-Bit Server VM warning: ignoring option MaxPermSize=768m; support was removed
in 8.0
Running org.apache.hadoop.net.TestSwitchMapping
Tests run: 5, Failures: 0, Errors: 0, Skipped: 0, Time elapsed: 0.354 sec - in org.apache.hadoop.net.TestSwitchMapping
Java HotSpot(TM) 64-Bit Server VM warning: ignoring option MaxPermSize=768m; support was removed
in 8.0
Running org.apache.hadoop.net.TestStaticMapping
Tests run: 8, Failures: 0, Errors: 0, Skipped: 0, Time elapsed: 0.58 sec - in org.apache.hadoop.net.TestStaticMapping
Java HotSpot(TM) 64-Bit Server VM warning: ignoring option MaxPermSize=768m; support was removed
in 8.0
Running org.apache.hadoop.net.TestNetUtils
Tests run: 40, Failures: 0, Errors: 0, Skipped: 0, Time elapsed: 3.619 sec - in org.apache.hadoop.net.TestNetUtils
Java HotSpot(TM) 64-Bit Server VM warning: ignoring option MaxPermSize=768m; support was removed
in 8.0
Running org.apache.hadoop.net.TestClusterTopology
Tests run: 2, Failures: 0, Errors: 0, Skipped: 0, Time elapsed: 0.226 sec - in org.apache.hadoop.net.TestClusterTopology
Java HotSpot(TM) 64-Bit Server VM warning: ignoring option MaxPermSize=768m; support was removed
in 8.0
Running org.apache.hadoop.net.TestDNS
Tests run: 12, Failures: 0, Errors: 0, Skipped: 0, Time elapsed: 0.294 sec - in org.apache.hadoop.net.TestDNS
Java HotSpot(TM) 64-Bit Server VM warning: ignoring option MaxPermSize=768m; support was removed
in 8.0
Running org.apache.hadoop.net.unix.TestDomainSocket
Tests run: 17, Failures: 0, Errors: 0, Skipped: 0, Time elapsed: 2.893 sec - in org.apache.hadoop.net.unix.TestDomainSocket
Java HotSpot(TM) 64-Bit Server VM warning: ignoring option MaxPermSize=768m; support was removed
in 8.0
Running org.apache.hadoop.net.unix.TestDomainSocketWatcher
Tests run: 6, Failures: 0, Errors: 0, Skipped: 0, Time elapsed: 0.614 sec - in org.apache.hadoop.net.unix.TestDomainSocketWatcher
Java HotSpot(TM) 64-Bit Server VM warning: ignoring option MaxPermSize=768m; support was removed
in 8.0
Running org.apache.hadoop.net.TestScriptBasedMapping
Tests run: 4, Failures: 0, Errors: 0, Skipped: 0, Time elapsed: 0.769 sec - in org.apache.hadoop.net.TestScriptBasedMapping
Java HotSpot(TM) 64-Bit Server VM warning: ignoring option MaxPermSize=768m; support was removed
in 8.0
Running org.apache.hadoop.net.TestTableMapping
Tests run: 6, Failures: 0, Errors: 0, Skipped: 0, Time elapsed: 0.582 sec - in org.apache.hadoop.net.TestTableMapping
Java HotSpot(TM) 64-Bit Server VM warning: ignoring option MaxPermSize=768m; support was removed
in 8.0
Running org.apache.hadoop.net.TestNetworkTopologyWithNodeGroup
Tests run: 8, Failures: 0, Errors: 0, Skipped: 0, Time elapsed: 0.189 sec - in org.apache.hadoop.net.TestNetworkTopologyWithNodeGroup
Java HotSpot(TM) 64-Bit Server VM warning: ignoring option MaxPermSize=768m; support was removed
in 8.0
Running org.apache.hadoop.net.TestScriptBasedMappingWithDependency
Tests run: 4, Failures: 0, Errors: 0, Skipped: 0, Time elapsed: 0.793 sec - in org.apache.hadoop.net.TestScriptBasedMappingWithDependency
Java HotSpot(TM) 64-Bit Server VM warning: ignoring option MaxPermSize=768m; support was removed
in 8.0
Running org.apache.hadoop.cli.TestCLI
Tests run: 1, Failures: 0, Errors: 0, Skipped: 0, Time elapsed: 0.669 sec - in org.apache.hadoop.cli.TestCLI
Java HotSpot(TM) 64-Bit Server VM warning: ignoring option MaxPermSize=768m; support was removed
in 8.0
Running org.apache.hadoop.service.TestServiceLifecycle
Tests run: 18, Failures: 0, Errors: 0, Skipped: 0, Time elapsed: 2.364 sec - in org.apache.hadoop.service.TestServiceLifecycle
Java HotSpot(TM) 64-Bit Server VM warning: ignoring option MaxPermSize=768m; support was removed
in 8.0
Running org.apache.hadoop.service.TestCompositeService
Tests run: 18, Failures: 0, Errors: 0, Skipped: 0, Time elapsed: 0.239 sec - in org.apache.hadoop.service.TestCompositeService
Java HotSpot(TM) 64-Bit Server VM warning: ignoring option MaxPermSize=768m; support was removed
in 8.0
Running org.apache.hadoop.service.TestGlobalStateChangeListener
Tests run: 5, Failures: 0, Errors: 0, Skipped: 0, Time elapsed: 0.257 sec - in org.apache.hadoop.service.TestGlobalStateChangeListener

Results :

Tests in error: 
  TestZKFailoverController.testGracefulFailover:448->Object.wait:-2 »  test time...
  TestLocalFsFCStatistics>FCStatisticsBaseTest.testStatisticsThreadLocalDataCleanUp:143
» Timeout

Tests run: 3203, Failures: 0, Errors: 2, Skipped: 86

[INFO] ------------------------------------------------------------------------
[INFO] Reactor Summary:
[INFO] 
[INFO] Apache Hadoop Annotations ......................... SUCCESS [  6.382 s]
[INFO] Apache Hadoop MiniKDC ............................. SUCCESS [ 21.909 s]
[INFO] Apache Hadoop Auth ................................ SUCCESS [05:25 min]
[INFO] Apache Hadoop Auth Examples ....................... SUCCESS [  3.786 s]
[INFO] Apache Hadoop Common .............................. FAILURE [22:13 min]
[INFO] Apache Hadoop NFS ................................. SKIPPED
[INFO] Apache Hadoop KMS ................................. SKIPPED
[INFO] Apache Hadoop Common Project ...................... SKIPPED
[INFO] ------------------------------------------------------------------------
[INFO] BUILD FAILURE
[INFO] ------------------------------------------------------------------------
[INFO] Total time: 28:12 min
[INFO] Finished at: 2015-11-05T16:53:47+00:00
[INFO] Final Memory: 61M/322M
[INFO] ------------------------------------------------------------------------
[ERROR] Failed to execute goal org.apache.maven.plugins:maven-surefire-plugin:2.17:test (default-test)
on project hadoop-common: There are test failures.
[ERROR] 
[ERROR] Please refer to <https://builds.apache.org/job/Hadoop-common-trunk-Java8/ws/hadoop-common-project/hadoop-common/target/surefire-reports>
for the individual test results.
[ERROR] -> [Help 1]
org.apache.maven.lifecycle.LifecycleExecutionException: Failed to execute goal org.apache.maven.plugins:maven-surefire-plugin:2.17:test
(default-test) on project hadoop-common: There are test failures.

Please refer to <https://builds.apache.org/job/Hadoop-common-trunk-Java8/ws/hadoop-common-project/hadoop-common/target/surefire-reports>
for the individual test results.
	at org.apache.maven.lifecycle.internal.MojoExecutor.execute(MojoExecutor.java:212)
	at org.apache.maven.lifecycle.internal.MojoExecutor.execute(MojoExecutor.java:153)
	at org.apache.maven.lifecycle.internal.MojoExecutor.execute(MojoExecutor.java:145)
	at org.apache.maven.lifecycle.internal.LifecycleModuleBuilder.buildProject(LifecycleModuleBuilder.java:108)
	at org.apache.maven.lifecycle.internal.LifecycleModuleBuilder.buildProject(LifecycleModuleBuilder.java:76)
	at org.apache.maven.lifecycle.internal.builder.singlethreaded.SingleThreadedBuilder.build(SingleThreadedBuilder.java:51)
	at org.apache.maven.lifecycle.internal.LifecycleStarter.execute(LifecycleStarter.java:116)
	at org.apache.maven.DefaultMaven.doExecute(DefaultMaven.java:361)
	at org.apache.maven.DefaultMaven.execute(DefaultMaven.java:155)
	at org.apache.maven.cli.MavenCli.execute(MavenCli.java:584)
	at org.apache.maven.cli.MavenCli.doMain(MavenCli.java:213)
	at org.apache.maven.cli.MavenCli.main(MavenCli.java:157)
	at sun.reflect.NativeMethodAccessorImpl.invoke0(Native Method)
	at sun.reflect.NativeMethodAccessorImpl.invoke(NativeMethodAccessorImpl.java:62)
	at sun.reflect.DelegatingMethodAccessorImpl.invoke(DelegatingMethodAccessorImpl.java:43)
	at java.lang.reflect.Method.invoke(Method.java:483)
	at org.codehaus.plexus.classworlds.launcher.Launcher.launchEnhanced(Launcher.java:289)
	at org.codehaus.plexus.classworlds.launcher.Launcher.launch(Launcher.java:229)
	at org.codehaus.plexus.classworlds.launcher.Launcher.mainWithExitCode(Launcher.java:415)
	at org.codehaus.plexus.classworlds.launcher.Launcher.main(Launcher.java:356)
Caused by: org.apache.maven.plugin.MojoFailureException: There are test failures.

Please refer to <https://builds.apache.org/job/Hadoop-common-trunk-Java8/ws/hadoop-common-project/hadoop-common/target/surefire-reports>
for the individual test results.
	at org.apache.maven.plugin.surefire.SurefireHelper.reportExecution(SurefireHelper.java:82)
	at org.apache.maven.plugin.surefire.SurefirePlugin.handleSummary(SurefirePlugin.java:195)
	at org.apache.maven.plugin.surefire.AbstractSurefireMojo.executeAfterPreconditionsChecked(AbstractSurefireMojo.java:861)
	at org.apache.maven.plugin.surefire.AbstractSurefireMojo.execute(AbstractSurefireMojo.java:729)
	at org.apache.maven.plugin.DefaultBuildPluginManager.executeMojo(DefaultBuildPluginManager.java:133)
	at org.apache.maven.lifecycle.internal.MojoExecutor.execute(MojoExecutor.java:208)
	... 19 more
[ERROR] 
[ERROR] Re-run Maven using the -X switch to enable full debug logging.
[ERROR] 
[ERROR] For more information about the errors and possible solutions, please read the following
articles:
[ERROR] [Help 1] http://cwiki.apache.org/confluence/display/MAVEN/MojoFailureException
[ERROR] 
[ERROR] After correcting the problems, you can resume the build with the command
[ERROR]   mvn <goals> -rf :hadoop-common
Build step 'Execute shell' marked build as failure
Archiving artifacts
Recording test results

Mime
View raw message