hadoop-common-dev mailing list archives

Site index · List index
Message view « Date » · « Thread »
Top « Date » · « Thread »
From Apache Jenkins Server <jenk...@builds.apache.org>
Subject Build failed in Jenkins: Hadoop-common-trunk-Java8 #734
Date Tue, 24 Nov 2015 06:26:37 GMT
See <https://builds.apache.org/job/Hadoop-common-trunk-Java8/734/changes>

Changes:

[waltersu4549] CHANGES.txt: move HDFS-9423 to trunk

------------------------------------------
[...truncated 5781 lines...]
Tests run: 3, Failures: 0, Errors: 0, Skipped: 0, Time elapsed: 11.417 sec - in org.apache.hadoop.metrics2.impl.TestMetricsSourceAdapter
Java HotSpot(TM) 64-Bit Server VM warning: ignoring option MaxPermSize=768m; support was removed
in 8.0
Running org.apache.hadoop.metrics2.impl.TestMetricsCollectorImpl
Tests run: 2, Failures: 0, Errors: 0, Skipped: 0, Time elapsed: 0.266 sec - in org.apache.hadoop.metrics2.impl.TestMetricsCollectorImpl
Java HotSpot(TM) 64-Bit Server VM warning: ignoring option MaxPermSize=768m; support was removed
in 8.0
Running org.apache.hadoop.metrics2.impl.TestGangliaMetrics
Tests run: 2, Failures: 0, Errors: 0, Skipped: 0, Time elapsed: 0.427 sec - in org.apache.hadoop.metrics2.impl.TestGangliaMetrics
Java HotSpot(TM) 64-Bit Server VM warning: ignoring option MaxPermSize=768m; support was removed
in 8.0
Running org.apache.hadoop.metrics2.impl.TestMetricsConfig
Tests run: 3, Failures: 0, Errors: 0, Skipped: 0, Time elapsed: 0.308 sec - in org.apache.hadoop.metrics2.impl.TestMetricsConfig
Java HotSpot(TM) 64-Bit Server VM warning: ignoring option MaxPermSize=768m; support was removed
in 8.0
Running org.apache.hadoop.metrics2.impl.TestMetricsVisitor
Tests run: 1, Failures: 0, Errors: 0, Skipped: 0, Time elapsed: 0.353 sec - in org.apache.hadoop.metrics2.impl.TestMetricsVisitor
Java HotSpot(TM) 64-Bit Server VM warning: ignoring option MaxPermSize=768m; support was removed
in 8.0
Running org.apache.hadoop.cli.TestCLI
Tests run: 1, Failures: 0, Errors: 0, Skipped: 0, Time elapsed: 0.559 sec - in org.apache.hadoop.cli.TestCLI
Java HotSpot(TM) 64-Bit Server VM warning: ignoring option MaxPermSize=768m; support was removed
in 8.0
Running org.apache.hadoop.security.TestNetgroupCache
Tests run: 3, Failures: 0, Errors: 0, Skipped: 0, Time elapsed: 0.084 sec - in org.apache.hadoop.security.TestNetgroupCache
Java HotSpot(TM) 64-Bit Server VM warning: ignoring option MaxPermSize=768m; support was removed
in 8.0
Running org.apache.hadoop.security.TestCompositeGroupMapping
Tests run: 3, Failures: 0, Errors: 0, Skipped: 0, Time elapsed: 0.5 sec - in org.apache.hadoop.security.TestCompositeGroupMapping
Java HotSpot(TM) 64-Bit Server VM warning: ignoring option MaxPermSize=768m; support was removed
in 8.0
Running org.apache.hadoop.security.TestUGILoginFromKeytab
Tests run: 1, Failures: 0, Errors: 0, Skipped: 0, Time elapsed: 4.286 sec - in org.apache.hadoop.security.TestUGILoginFromKeytab
Java HotSpot(TM) 64-Bit Server VM warning: ignoring option MaxPermSize=768m; support was removed
in 8.0
Running org.apache.hadoop.security.http.TestCrossOriginFilter
Tests run: 9, Failures: 0, Errors: 0, Skipped: 0, Time elapsed: 0.419 sec - in org.apache.hadoop.security.http.TestCrossOriginFilter
Java HotSpot(TM) 64-Bit Server VM warning: ignoring option MaxPermSize=768m; support was removed
in 8.0
Running org.apache.hadoop.security.TestSecurityUtil
Tests run: 17, Failures: 0, Errors: 0, Skipped: 0, Time elapsed: 0.75 sec - in org.apache.hadoop.security.TestSecurityUtil
Java HotSpot(TM) 64-Bit Server VM warning: ignoring option MaxPermSize=768m; support was removed
in 8.0
Running org.apache.hadoop.security.TestHttpCrossOriginFilterInitializer
Tests run: 1, Failures: 0, Errors: 0, Skipped: 0, Time elapsed: 0.321 sec - in org.apache.hadoop.security.TestHttpCrossOriginFilterInitializer
Java HotSpot(TM) 64-Bit Server VM warning: ignoring option MaxPermSize=768m; support was removed
in 8.0
Running org.apache.hadoop.security.TestLdapGroupsMappingWithPosixGroup
Tests run: 1, Failures: 0, Errors: 0, Skipped: 0, Time elapsed: 0.557 sec - in org.apache.hadoop.security.TestLdapGroupsMappingWithPosixGroup
Java HotSpot(TM) 64-Bit Server VM warning: ignoring option MaxPermSize=768m; support was removed
in 8.0
Running org.apache.hadoop.security.TestGroupsCaching
Tests run: 10, Failures: 0, Errors: 0, Skipped: 0, Time elapsed: 1.613 sec - in org.apache.hadoop.security.TestGroupsCaching
Java HotSpot(TM) 64-Bit Server VM warning: ignoring option MaxPermSize=768m; support was removed
in 8.0
Running org.apache.hadoop.security.authorize.TestProxyUsers
Tests run: 17, Failures: 0, Errors: 0, Skipped: 0, Time elapsed: 0.686 sec - in org.apache.hadoop.security.authorize.TestProxyUsers
Java HotSpot(TM) 64-Bit Server VM warning: ignoring option MaxPermSize=768m; support was removed
in 8.0
Running org.apache.hadoop.security.authorize.TestServiceAuthorization
Tests run: 7, Failures: 0, Errors: 0, Skipped: 0, Time elapsed: 0.784 sec - in org.apache.hadoop.security.authorize.TestServiceAuthorization
Java HotSpot(TM) 64-Bit Server VM warning: ignoring option MaxPermSize=768m; support was removed
in 8.0
Running org.apache.hadoop.security.authorize.TestProxyServers
Tests run: 1, Failures: 0, Errors: 0, Skipped: 0, Time elapsed: 0.348 sec - in org.apache.hadoop.security.authorize.TestProxyServers
Java HotSpot(TM) 64-Bit Server VM warning: ignoring option MaxPermSize=768m; support was removed
in 8.0
Running org.apache.hadoop.security.authorize.TestAccessControlList
Tests run: 8, Failures: 0, Errors: 0, Skipped: 0, Time elapsed: 0.674 sec - in org.apache.hadoop.security.authorize.TestAccessControlList
Java HotSpot(TM) 64-Bit Server VM warning: ignoring option MaxPermSize=768m; support was removed
in 8.0
Running org.apache.hadoop.security.TestProxyUserFromEnv
Tests run: 1, Failures: 0, Errors: 0, Skipped: 0, Time elapsed: 0.457 sec - in org.apache.hadoop.security.TestProxyUserFromEnv
Java HotSpot(TM) 64-Bit Server VM warning: ignoring option MaxPermSize=768m; support was removed
in 8.0
Running org.apache.hadoop.security.TestCredentials
Tests run: 4, Failures: 0, Errors: 0, Skipped: 0, Time elapsed: 0.65 sec - in org.apache.hadoop.security.TestCredentials
Java HotSpot(TM) 64-Bit Server VM warning: ignoring option MaxPermSize=768m; support was removed
in 8.0
Running org.apache.hadoop.security.TestWhitelistBasedResolver
Tests run: 3, Failures: 0, Errors: 0, Skipped: 0, Time elapsed: 0.401 sec - in org.apache.hadoop.security.TestWhitelistBasedResolver
Java HotSpot(TM) 64-Bit Server VM warning: ignoring option MaxPermSize=768m; support was removed
in 8.0
Running org.apache.hadoop.security.TestLdapGroupsMapping
Tests run: 5, Failures: 0, Errors: 0, Skipped: 0, Time elapsed: 1.162 sec - in org.apache.hadoop.security.TestLdapGroupsMapping
Java HotSpot(TM) 64-Bit Server VM warning: ignoring option MaxPermSize=768m; support was removed
in 8.0
Running org.apache.hadoop.security.TestDoAsEffectiveUser
Tests run: 9, Failures: 0, Errors: 0, Skipped: 0, Time elapsed: 1.165 sec - in org.apache.hadoop.security.TestDoAsEffectiveUser
Java HotSpot(TM) 64-Bit Server VM warning: ignoring option MaxPermSize=768m; support was removed
in 8.0
Running org.apache.hadoop.security.ssl.TestSSLFactory
Tests run: 15, Failures: 0, Errors: 0, Skipped: 0, Time elapsed: 3.035 sec - in org.apache.hadoop.security.ssl.TestSSLFactory
Java HotSpot(TM) 64-Bit Server VM warning: ignoring option MaxPermSize=768m; support was removed
in 8.0
Running org.apache.hadoop.security.ssl.TestReloadingX509TrustManager
Tests run: 5, Failures: 0, Errors: 0, Skipped: 0, Time elapsed: 2.404 sec - in org.apache.hadoop.security.ssl.TestReloadingX509TrustManager
Java HotSpot(TM) 64-Bit Server VM warning: ignoring option MaxPermSize=768m; support was removed
in 8.0
Running org.apache.hadoop.security.TestUserGroupInformation
Tests run: 34, Failures: 0, Errors: 0, Skipped: 0, Time elapsed: 3.204 sec - in org.apache.hadoop.security.TestUserGroupInformation
Java HotSpot(TM) 64-Bit Server VM warning: ignoring option MaxPermSize=768m; support was removed
in 8.0
Running org.apache.hadoop.security.TestJNIGroupsMapping
Tests run: 1, Failures: 0, Errors: 0, Skipped: 0, Time elapsed: 0.463 sec - in org.apache.hadoop.security.TestJNIGroupsMapping
Java HotSpot(TM) 64-Bit Server VM warning: ignoring option MaxPermSize=768m; support was removed
in 8.0
Running org.apache.hadoop.security.TestUGIWithSecurityOn
Tests run: 2, Failures: 0, Errors: 0, Skipped: 2, Time elapsed: 0.078 sec - in org.apache.hadoop.security.TestUGIWithSecurityOn
Java HotSpot(TM) 64-Bit Server VM warning: ignoring option MaxPermSize=768m; support was removed
in 8.0
Running org.apache.hadoop.security.token.delegation.TestDelegationToken
Tests run: 15, Failures: 0, Errors: 0, Skipped: 0, Time elapsed: 31.443 sec - in org.apache.hadoop.security.token.delegation.TestDelegationToken
Java HotSpot(TM) 64-Bit Server VM warning: ignoring option MaxPermSize=768m; support was removed
in 8.0
Running org.apache.hadoop.security.token.delegation.web.TestWebDelegationToken
Tests run: 12, Failures: 0, Errors: 0, Skipped: 0, Time elapsed: 8.165 sec - in org.apache.hadoop.security.token.delegation.web.TestWebDelegationToken
Java HotSpot(TM) 64-Bit Server VM warning: ignoring option MaxPermSize=768m; support was removed
in 8.0
Running org.apache.hadoop.security.token.delegation.web.TestDelegationTokenAuthenticationHandlerWithMocks
Tests run: 2, Failures: 0, Errors: 0, Skipped: 0, Time elapsed: 1.261 sec - in org.apache.hadoop.security.token.delegation.web.TestDelegationTokenAuthenticationHandlerWithMocks
Java HotSpot(TM) 64-Bit Server VM warning: ignoring option MaxPermSize=768m; support was removed
in 8.0
Running org.apache.hadoop.security.token.delegation.web.TestDelegationTokenManager
Tests run: 2, Failures: 0, Errors: 0, Skipped: 0, Time elapsed: 0.736 sec - in org.apache.hadoop.security.token.delegation.web.TestDelegationTokenManager
Java HotSpot(TM) 64-Bit Server VM warning: ignoring option MaxPermSize=768m; support was removed
in 8.0
Running org.apache.hadoop.security.token.delegation.TestZKDelegationTokenSecretManager
Tests run: 6, Failures: 0, Errors: 0, Skipped: 0, Time elapsed: 45.304 sec - in org.apache.hadoop.security.token.delegation.TestZKDelegationTokenSecretManager
Java HotSpot(TM) 64-Bit Server VM warning: ignoring option MaxPermSize=768m; support was removed
in 8.0
Running org.apache.hadoop.security.token.TestToken
Tests run: 3, Failures: 0, Errors: 0, Skipped: 0, Time elapsed: 0.522 sec - in org.apache.hadoop.security.token.TestToken
Java HotSpot(TM) 64-Bit Server VM warning: ignoring option MaxPermSize=768m; support was removed
in 8.0
Running org.apache.hadoop.security.TestUserFromEnv
Tests run: 1, Failures: 0, Errors: 0, Skipped: 0, Time elapsed: 0.443 sec - in org.apache.hadoop.security.TestUserFromEnv
Java HotSpot(TM) 64-Bit Server VM warning: ignoring option MaxPermSize=768m; support was removed
in 8.0
Running org.apache.hadoop.security.alias.TestCredentialProvider
Tests run: 2, Failures: 0, Errors: 0, Skipped: 0, Time elapsed: 0.084 sec - in org.apache.hadoop.security.alias.TestCredentialProvider
Java HotSpot(TM) 64-Bit Server VM warning: ignoring option MaxPermSize=768m; support was removed
in 8.0
Running org.apache.hadoop.security.alias.TestCredentialProviderFactory
Tests run: 6, Failures: 0, Errors: 0, Skipped: 0, Time elapsed: 1.026 sec - in org.apache.hadoop.security.alias.TestCredentialProviderFactory
Java HotSpot(TM) 64-Bit Server VM warning: ignoring option MaxPermSize=768m; support was removed
in 8.0
Running org.apache.hadoop.security.alias.TestCredShell
Tests run: 9, Failures: 0, Errors: 0, Skipped: 0, Time elapsed: 1.021 sec - in org.apache.hadoop.security.alias.TestCredShell
Java HotSpot(TM) 64-Bit Server VM warning: ignoring option MaxPermSize=768m; support was removed
in 8.0
Running org.apache.hadoop.security.TestShellBasedIdMapping
Tests run: 7, Failures: 0, Errors: 0, Skipped: 0, Time elapsed: 2.54 sec - in org.apache.hadoop.security.TestShellBasedIdMapping
Java HotSpot(TM) 64-Bit Server VM warning: ignoring option MaxPermSize=768m; support was removed
in 8.0
Running org.apache.hadoop.security.TestGroupFallback
Tests run: 4, Failures: 0, Errors: 0, Skipped: 0, Time elapsed: 0.51 sec - in org.apache.hadoop.security.TestGroupFallback
Java HotSpot(TM) 64-Bit Server VM warning: ignoring option MaxPermSize=768m; support was removed
in 8.0
Running org.apache.hadoop.security.TestAuthenticationFilter
Tests run: 1, Failures: 0, Errors: 0, Skipped: 0, Time elapsed: 0.462 sec - in org.apache.hadoop.security.TestAuthenticationFilter
Java HotSpot(TM) 64-Bit Server VM warning: ignoring option MaxPermSize=768m; support was removed
in 8.0
Running org.apache.hadoop.security.TestUGIWithExternalKdc
Tests run: 1, Failures: 0, Errors: 0, Skipped: 1, Time elapsed: 0.113 sec - in org.apache.hadoop.security.TestUGIWithExternalKdc
Java HotSpot(TM) 64-Bit Server VM warning: ignoring option MaxPermSize=768m; support was removed
in 8.0
Running org.apache.hadoop.crypto.TestCryptoStreamsWithJceAesCtrCryptoCodec
Tests run: 14, Failures: 0, Errors: 0, Skipped: 0, Time elapsed: 21.767 sec - in org.apache.hadoop.crypto.TestCryptoStreamsWithJceAesCtrCryptoCodec
Java HotSpot(TM) 64-Bit Server VM warning: ignoring option MaxPermSize=768m; support was removed
in 8.0
Running org.apache.hadoop.crypto.TestCryptoStreamsWithOpensslAesCtrCryptoCodec
Tests run: 14, Failures: 0, Errors: 0, Skipped: 0, Time elapsed: 20.692 sec - in org.apache.hadoop.crypto.TestCryptoStreamsWithOpensslAesCtrCryptoCodec
Java HotSpot(TM) 64-Bit Server VM warning: ignoring option MaxPermSize=768m; support was removed
in 8.0
Running org.apache.hadoop.crypto.TestCryptoCodec
Tests run: 3, Failures: 0, Errors: 0, Skipped: 0, Time elapsed: 13.554 sec - in org.apache.hadoop.crypto.TestCryptoCodec
Java HotSpot(TM) 64-Bit Server VM warning: ignoring option MaxPermSize=768m; support was removed
in 8.0
Running org.apache.hadoop.crypto.TestOpensslCipher
Tests run: 3, Failures: 0, Errors: 0, Skipped: 0, Time elapsed: 0.173 sec - in org.apache.hadoop.crypto.TestOpensslCipher
Java HotSpot(TM) 64-Bit Server VM warning: ignoring option MaxPermSize=768m; support was removed
in 8.0
Running org.apache.hadoop.crypto.TestCryptoStreamsNormal
Tests run: 14, Failures: 0, Errors: 0, Skipped: 8, Time elapsed: 6.62 sec - in org.apache.hadoop.crypto.TestCryptoStreamsNormal
Java HotSpot(TM) 64-Bit Server VM warning: ignoring option MaxPermSize=768m; support was removed
in 8.0
Running org.apache.hadoop.crypto.random.TestOpensslSecureRandom
Tests run: 5, Failures: 0, Errors: 0, Skipped: 0, Time elapsed: 0.175 sec - in org.apache.hadoop.crypto.random.TestOpensslSecureRandom
Java HotSpot(TM) 64-Bit Server VM warning: ignoring option MaxPermSize=768m; support was removed
in 8.0
Running org.apache.hadoop.crypto.random.TestOsSecureRandom
Tests run: 6, Failures: 0, Errors: 0, Skipped: 0, Time elapsed: 0.426 sec - in org.apache.hadoop.crypto.random.TestOsSecureRandom
Java HotSpot(TM) 64-Bit Server VM warning: ignoring option MaxPermSize=768m; support was removed
in 8.0
Running org.apache.hadoop.crypto.TestCryptoStreams
Tests run: 14, Failures: 0, Errors: 0, Skipped: 0, Time elapsed: 20.056 sec - in org.apache.hadoop.crypto.TestCryptoStreams
Java HotSpot(TM) 64-Bit Server VM warning: ignoring option MaxPermSize=768m; support was removed
in 8.0
Running org.apache.hadoop.crypto.key.TestCachingKeyProvider
Tests run: 5, Failures: 0, Errors: 0, Skipped: 0, Time elapsed: 2.039 sec - in org.apache.hadoop.crypto.key.TestCachingKeyProvider
Java HotSpot(TM) 64-Bit Server VM warning: ignoring option MaxPermSize=768m; support was removed
in 8.0
Running org.apache.hadoop.crypto.key.kms.TestLoadBalancingKMSClientProvider
Tests run: 4, Failures: 0, Errors: 0, Skipped: 0, Time elapsed: 0.75 sec - in org.apache.hadoop.crypto.key.kms.TestLoadBalancingKMSClientProvider
Java HotSpot(TM) 64-Bit Server VM warning: ignoring option MaxPermSize=768m; support was removed
in 8.0
Running org.apache.hadoop.crypto.key.TestKeyProviderFactory
Tests run: 8, Failures: 0, Errors: 0, Skipped: 0, Time elapsed: 1.134 sec - in org.apache.hadoop.crypto.key.TestKeyProviderFactory
Java HotSpot(TM) 64-Bit Server VM warning: ignoring option MaxPermSize=768m; support was removed
in 8.0
Running org.apache.hadoop.crypto.key.TestKeyProvider
Tests run: 8, Failures: 0, Errors: 0, Skipped: 0, Time elapsed: 0.649 sec - in org.apache.hadoop.crypto.key.TestKeyProvider
Java HotSpot(TM) 64-Bit Server VM warning: ignoring option MaxPermSize=768m; support was removed
in 8.0
Running org.apache.hadoop.crypto.key.TestKeyProviderDelegationTokenExtension
Tests run: 1, Failures: 0, Errors: 0, Skipped: 0, Time elapsed: 0.593 sec - in org.apache.hadoop.crypto.key.TestKeyProviderDelegationTokenExtension
Java HotSpot(TM) 64-Bit Server VM warning: ignoring option MaxPermSize=768m; support was removed
in 8.0
Running org.apache.hadoop.crypto.key.TestValueQueue
Tests run: 8, Failures: 0, Errors: 0, Skipped: 0, Time elapsed: 1.155 sec - in org.apache.hadoop.crypto.key.TestValueQueue
Java HotSpot(TM) 64-Bit Server VM warning: ignoring option MaxPermSize=768m; support was removed
in 8.0
Running org.apache.hadoop.crypto.key.TestKeyProviderCryptoExtension
Tests run: 2, Failures: 0, Errors: 0, Skipped: 0, Time elapsed: 0.83 sec - in org.apache.hadoop.crypto.key.TestKeyProviderCryptoExtension
Java HotSpot(TM) 64-Bit Server VM warning: ignoring option MaxPermSize=768m; support was removed
in 8.0
Running org.apache.hadoop.crypto.key.TestKeyShell
Tests run: 9, Failures: 0, Errors: 0, Skipped: 0, Time elapsed: 1.193 sec - in org.apache.hadoop.crypto.key.TestKeyShell
Java HotSpot(TM) 64-Bit Server VM warning: ignoring option MaxPermSize=768m; support was removed
in 8.0
Running org.apache.hadoop.crypto.TestCryptoStreamsForLocalFS
Tests run: 14, Failures: 0, Errors: 0, Skipped: 5, Time elapsed: 11.519 sec - in org.apache.hadoop.crypto.TestCryptoStreamsForLocalFS

Results :

Failed tests: 
  TestFsPermission.testDeprecatedUmask:706 expected:<302> but was:<18>

Tests run: 3203, Failures: 1, Errors: 0, Skipped: 86

[INFO] ------------------------------------------------------------------------
[INFO] Reactor Summary:
[INFO] 
[INFO] Apache Hadoop Annotations ......................... SUCCESS [  7.268 s]
[INFO] Apache Hadoop MiniKDC ............................. SUCCESS [ 23.721 s]
[INFO] Apache Hadoop Auth ................................ SUCCESS [03:40 min]
[INFO] Apache Hadoop Auth Examples ....................... SUCCESS [  3.153 s]
[INFO] Apache Hadoop Common .............................. FAILURE [20:48 min]
[INFO] Apache Hadoop NFS ................................. SKIPPED
[INFO] Apache Hadoop KMS ................................. SKIPPED
[INFO] Apache Hadoop Common Project ...................... SKIPPED
[INFO] ------------------------------------------------------------------------
[INFO] BUILD FAILURE
[INFO] ------------------------------------------------------------------------
[INFO] Total time: 25:03 min
[INFO] Finished at: 2015-11-24T06:26:31+00:00
[INFO] Final Memory: 61M/301M
[INFO] ------------------------------------------------------------------------
[ERROR] Failed to execute goal org.apache.maven.plugins:maven-surefire-plugin:2.17:test (default-test)
on project hadoop-common: There are test failures.
[ERROR] 
[ERROR] Please refer to <https://builds.apache.org/job/Hadoop-common-trunk-Java8/ws/hadoop-common-project/hadoop-common/target/surefire-reports>
for the individual test results.
[ERROR] -> [Help 1]
org.apache.maven.lifecycle.LifecycleExecutionException: Failed to execute goal org.apache.maven.plugins:maven-surefire-plugin:2.17:test
(default-test) on project hadoop-common: There are test failures.

Please refer to <https://builds.apache.org/job/Hadoop-common-trunk-Java8/ws/hadoop-common-project/hadoop-common/target/surefire-reports>
for the individual test results.
	at org.apache.maven.lifecycle.internal.MojoExecutor.execute(MojoExecutor.java:212)
	at org.apache.maven.lifecycle.internal.MojoExecutor.execute(MojoExecutor.java:153)
	at org.apache.maven.lifecycle.internal.MojoExecutor.execute(MojoExecutor.java:145)
	at org.apache.maven.lifecycle.internal.LifecycleModuleBuilder.buildProject(LifecycleModuleBuilder.java:108)
	at org.apache.maven.lifecycle.internal.LifecycleModuleBuilder.buildProject(LifecycleModuleBuilder.java:76)
	at org.apache.maven.lifecycle.internal.builder.singlethreaded.SingleThreadedBuilder.build(SingleThreadedBuilder.java:51)
	at org.apache.maven.lifecycle.internal.LifecycleStarter.execute(LifecycleStarter.java:116)
	at org.apache.maven.DefaultMaven.doExecute(DefaultMaven.java:361)
	at org.apache.maven.DefaultMaven.execute(DefaultMaven.java:155)
	at org.apache.maven.cli.MavenCli.execute(MavenCli.java:584)
	at org.apache.maven.cli.MavenCli.doMain(MavenCli.java:213)
	at org.apache.maven.cli.MavenCli.main(MavenCli.java:157)
	at sun.reflect.NativeMethodAccessorImpl.invoke0(Native Method)
	at sun.reflect.NativeMethodAccessorImpl.invoke(NativeMethodAccessorImpl.java:62)
	at sun.reflect.DelegatingMethodAccessorImpl.invoke(DelegatingMethodAccessorImpl.java:43)
	at java.lang.reflect.Method.invoke(Method.java:483)
	at org.codehaus.plexus.classworlds.launcher.Launcher.launchEnhanced(Launcher.java:289)
	at org.codehaus.plexus.classworlds.launcher.Launcher.launch(Launcher.java:229)
	at org.codehaus.plexus.classworlds.launcher.Launcher.mainWithExitCode(Launcher.java:415)
	at org.codehaus.plexus.classworlds.launcher.Launcher.main(Launcher.java:356)
Caused by: org.apache.maven.plugin.MojoFailureException: There are test failures.

Please refer to <https://builds.apache.org/job/Hadoop-common-trunk-Java8/ws/hadoop-common-project/hadoop-common/target/surefire-reports>
for the individual test results.
	at org.apache.maven.plugin.surefire.SurefireHelper.reportExecution(SurefireHelper.java:82)
	at org.apache.maven.plugin.surefire.SurefirePlugin.handleSummary(SurefirePlugin.java:195)
	at org.apache.maven.plugin.surefire.AbstractSurefireMojo.executeAfterPreconditionsChecked(AbstractSurefireMojo.java:861)
	at org.apache.maven.plugin.surefire.AbstractSurefireMojo.execute(AbstractSurefireMojo.java:729)
	at org.apache.maven.plugin.DefaultBuildPluginManager.executeMojo(DefaultBuildPluginManager.java:133)
	at org.apache.maven.lifecycle.internal.MojoExecutor.execute(MojoExecutor.java:208)
	... 19 more
[ERROR] 
[ERROR] Re-run Maven using the -X switch to enable full debug logging.
[ERROR] 
[ERROR] For more information about the errors and possible solutions, please read the following
articles:
[ERROR] [Help 1] http://cwiki.apache.org/confluence/display/MAVEN/MojoFailureException
[ERROR] 
[ERROR] After correcting the problems, you can resume the build with the command
[ERROR]   mvn <goals> -rf :hadoop-common
Build step 'Execute shell' marked build as failure
Archiving artifacts
Recording test results

Mime
View raw message