hadoop-common-dev mailing list archives

Site index · List index
Message view « Date » · « Thread »
Top « Date » · « Thread »
From Apache Jenkins Server <jenk...@builds.apache.org>
Subject Build failed in Jenkins: Hadoop-Common-trunk #2052
Date Sat, 28 Nov 2015 06:00:58 GMT
See <https://builds.apache.org/job/Hadoop-Common-trunk/2052/changes>

Changes:

[aw] HADOOP-11505. Various native parts use bswap incorrectly and unportably

------------------------------------------
[...truncated 9045 lines...]
Generating <https://builds.apache.org/job/Hadoop-Common-trunk/ws/hadoop-common-project/hadoop-nfs/target/org/apache/hadoop/nfs/nfs3/response/class-use/READ3Response.html...>
Generating <https://builds.apache.org/job/Hadoop-Common-trunk/ws/hadoop-common-project/hadoop-nfs/target/org/apache/hadoop/nfs/nfs3/response/class-use/READDIR3Response.html...>
Generating <https://builds.apache.org/job/Hadoop-Common-trunk/ws/hadoop-common-project/hadoop-nfs/target/org/apache/hadoop/nfs/nfs3/response/class-use/READDIR3Response.Entry3.html...>
Generating <https://builds.apache.org/job/Hadoop-Common-trunk/ws/hadoop-common-project/hadoop-nfs/target/org/apache/hadoop/nfs/nfs3/response/class-use/READDIR3Response.DirList3.html...>
Generating <https://builds.apache.org/job/Hadoop-Common-trunk/ws/hadoop-common-project/hadoop-nfs/target/org/apache/hadoop/nfs/nfs3/response/class-use/READLINK3Response.html...>
Generating <https://builds.apache.org/job/Hadoop-Common-trunk/ws/hadoop-common-project/hadoop-nfs/target/org/apache/hadoop/nfs/nfs3/response/class-use/SYMLINK3Response.html...>
Generating <https://builds.apache.org/job/Hadoop-Common-trunk/ws/hadoop-common-project/hadoop-nfs/target/org/apache/hadoop/nfs/nfs3/response/class-use/RENAME3Response.html...>
Generating <https://builds.apache.org/job/Hadoop-Common-trunk/ws/hadoop-common-project/hadoop-nfs/target/org/apache/hadoop/nfs/nfs3/response/class-use/CREATE3Response.html...>
Generating <https://builds.apache.org/job/Hadoop-Common-trunk/ws/hadoop-common-project/hadoop-nfs/target/org/apache/hadoop/nfs/nfs3/response/class-use/MKDIR3Response.html...>
Generating <https://builds.apache.org/job/Hadoop-Common-trunk/ws/hadoop-common-project/hadoop-nfs/target/org/apache/hadoop/nfs/nfs3/response/class-use/ACCESS3Response.html...>
Generating <https://builds.apache.org/job/Hadoop-Common-trunk/ws/hadoop-common-project/hadoop-nfs/target/org/apache/hadoop/nfs/nfs3/response/class-use/REMOVE3Response.html...>
Generating <https://builds.apache.org/job/Hadoop-Common-trunk/ws/hadoop-common-project/hadoop-nfs/target/org/apache/hadoop/nfs/nfs3/response/class-use/WccData.html...>
Generating <https://builds.apache.org/job/Hadoop-Common-trunk/ws/hadoop-common-project/hadoop-nfs/target/org/apache/hadoop/nfs/nfs3/response/class-use/WRITE3Response.html...>
Generating <https://builds.apache.org/job/Hadoop-Common-trunk/ws/hadoop-common-project/hadoop-nfs/target/org/apache/hadoop/nfs/nfs3/response/class-use/PATHCONF3Response.html...>
Generating <https://builds.apache.org/job/Hadoop-Common-trunk/ws/hadoop-common-project/hadoop-nfs/target/org/apache/hadoop/nfs/nfs3/response/class-use/LINK3Response.html...>
Generating <https://builds.apache.org/job/Hadoop-Common-trunk/ws/hadoop-common-project/hadoop-nfs/target/org/apache/hadoop/nfs/nfs3/response/class-use/WccAttr.html...>
Generating <https://builds.apache.org/job/Hadoop-Common-trunk/ws/hadoop-common-project/hadoop-nfs/target/org/apache/hadoop/nfs/nfs3/response/class-use/FSSTAT3Response.html...>
Generating <https://builds.apache.org/job/Hadoop-Common-trunk/ws/hadoop-common-project/hadoop-nfs/target/org/apache/hadoop/nfs/nfs3/response/class-use/FSINFO3Response.html...>
Generating <https://builds.apache.org/job/Hadoop-Common-trunk/ws/hadoop-common-project/hadoop-nfs/target/org/apache/hadoop/nfs/nfs3/class-use/Nfs3Interface.html...>
Generating <https://builds.apache.org/job/Hadoop-Common-trunk/ws/hadoop-common-project/hadoop-nfs/target/org/apache/hadoop/nfs/nfs3/class-use/Nfs3Base.html...>
Generating <https://builds.apache.org/job/Hadoop-Common-trunk/ws/hadoop-common-project/hadoop-nfs/target/org/apache/hadoop/nfs/nfs3/class-use/Nfs3FileAttributes.html...>
Generating <https://builds.apache.org/job/Hadoop-Common-trunk/ws/hadoop-common-project/hadoop-nfs/target/org/apache/hadoop/nfs/nfs3/class-use/Nfs3FileAttributes.Specdata3.html...>
Generating <https://builds.apache.org/job/Hadoop-Common-trunk/ws/hadoop-common-project/hadoop-nfs/target/org/apache/hadoop/nfs/nfs3/class-use/Nfs3Constant.html...>
Generating <https://builds.apache.org/job/Hadoop-Common-trunk/ws/hadoop-common-project/hadoop-nfs/target/org/apache/hadoop/nfs/nfs3/class-use/Nfs3Constant.NFSPROC3.html...>
Generating <https://builds.apache.org/job/Hadoop-Common-trunk/ws/hadoop-common-project/hadoop-nfs/target/org/apache/hadoop/nfs/nfs3/class-use/Nfs3Constant.WriteStableHow.html...>
Generating <https://builds.apache.org/job/Hadoop-Common-trunk/ws/hadoop-common-project/hadoop-nfs/target/org/apache/hadoop/nfs/nfs3/class-use/Nfs3Status.html...>
Generating <https://builds.apache.org/job/Hadoop-Common-trunk/ws/hadoop-common-project/hadoop-nfs/target/org/apache/hadoop/nfs/nfs3/class-use/FileHandle.html...>
Generating <https://builds.apache.org/job/Hadoop-Common-trunk/ws/hadoop-common-project/hadoop-nfs/target/org/apache/hadoop/oncrpc/class-use/RpcUtil.html...>
Generating <https://builds.apache.org/job/Hadoop-Common-trunk/ws/hadoop-common-project/hadoop-nfs/target/org/apache/hadoop/oncrpc/class-use/RegistrationClient.html...>
Generating <https://builds.apache.org/job/Hadoop-Common-trunk/ws/hadoop-common-project/hadoop-nfs/target/org/apache/hadoop/oncrpc/class-use/SimpleTcpClient.html...>
Generating <https://builds.apache.org/job/Hadoop-Common-trunk/ws/hadoop-common-project/hadoop-nfs/target/org/apache/hadoop/oncrpc/class-use/RpcMessage.html...>
Generating <https://builds.apache.org/job/Hadoop-Common-trunk/ws/hadoop-common-project/hadoop-nfs/target/org/apache/hadoop/oncrpc/class-use/RpcMessage.Type.html...>
Generating <https://builds.apache.org/job/Hadoop-Common-trunk/ws/hadoop-common-project/hadoop-nfs/target/org/apache/hadoop/oncrpc/class-use/RpcCall.html...>
Generating <https://builds.apache.org/job/Hadoop-Common-trunk/ws/hadoop-common-project/hadoop-nfs/target/org/apache/hadoop/oncrpc/class-use/RpcResponse.html...>
Generating <https://builds.apache.org/job/Hadoop-Common-trunk/ws/hadoop-common-project/hadoop-nfs/target/org/apache/hadoop/oncrpc/class-use/RpcReply.html...>
Generating <https://builds.apache.org/job/Hadoop-Common-trunk/ws/hadoop-common-project/hadoop-nfs/target/org/apache/hadoop/oncrpc/class-use/RpcReply.ReplyState.html...>
Generating <https://builds.apache.org/job/Hadoop-Common-trunk/ws/hadoop-common-project/hadoop-nfs/target/org/apache/hadoop/oncrpc/class-use/SimpleTcpServer.html...>
Generating <https://builds.apache.org/job/Hadoop-Common-trunk/ws/hadoop-common-project/hadoop-nfs/target/org/apache/hadoop/oncrpc/class-use/RpcProgram.html...>
Generating <https://builds.apache.org/job/Hadoop-Common-trunk/ws/hadoop-common-project/hadoop-nfs/target/org/apache/hadoop/oncrpc/class-use/SimpleTcpClientHandler.html...>
Generating <https://builds.apache.org/job/Hadoop-Common-trunk/ws/hadoop-common-project/hadoop-nfs/target/org/apache/hadoop/oncrpc/class-use/SimpleUdpClient.html...>
Generating <https://builds.apache.org/job/Hadoop-Common-trunk/ws/hadoop-common-project/hadoop-nfs/target/org/apache/hadoop/oncrpc/class-use/SimpleUdpServer.html...>
Generating <https://builds.apache.org/job/Hadoop-Common-trunk/ws/hadoop-common-project/hadoop-nfs/target/org/apache/hadoop/oncrpc/class-use/RpcDeniedReply.html...>
Generating <https://builds.apache.org/job/Hadoop-Common-trunk/ws/hadoop-common-project/hadoop-nfs/target/org/apache/hadoop/oncrpc/class-use/RpcDeniedReply.RejectState.html...>
Generating <https://builds.apache.org/job/Hadoop-Common-trunk/ws/hadoop-common-project/hadoop-nfs/target/org/apache/hadoop/oncrpc/class-use/RpcCallCache.html...>
Generating <https://builds.apache.org/job/Hadoop-Common-trunk/ws/hadoop-common-project/hadoop-nfs/target/org/apache/hadoop/oncrpc/class-use/RpcCallCache.CacheEntry.html...>
Generating <https://builds.apache.org/job/Hadoop-Common-trunk/ws/hadoop-common-project/hadoop-nfs/target/org/apache/hadoop/oncrpc/class-use/RpcCallCache.ClientRequest.html...>
Generating <https://builds.apache.org/job/Hadoop-Common-trunk/ws/hadoop-common-project/hadoop-nfs/target/org/apache/hadoop/oncrpc/class-use/XDR.html...>
Generating <https://builds.apache.org/job/Hadoop-Common-trunk/ws/hadoop-common-project/hadoop-nfs/target/org/apache/hadoop/oncrpc/class-use/XDR.State.html...>
Generating <https://builds.apache.org/job/Hadoop-Common-trunk/ws/hadoop-common-project/hadoop-nfs/target/org/apache/hadoop/oncrpc/class-use/RpcAcceptedReply.html...>
Generating <https://builds.apache.org/job/Hadoop-Common-trunk/ws/hadoop-common-project/hadoop-nfs/target/org/apache/hadoop/oncrpc/class-use/RpcAcceptedReply.AcceptState.html...>
Generating <https://builds.apache.org/job/Hadoop-Common-trunk/ws/hadoop-common-project/hadoop-nfs/target/org/apache/hadoop/oncrpc/class-use/RpcInfo.html...>
Generating <https://builds.apache.org/job/Hadoop-Common-trunk/ws/hadoop-common-project/hadoop-nfs/target/org/apache/hadoop/oncrpc/security/class-use/VerifierGSS.html...>
Generating <https://builds.apache.org/job/Hadoop-Common-trunk/ws/hadoop-common-project/hadoop-nfs/target/org/apache/hadoop/oncrpc/security/class-use/Verifier.html...>
Generating <https://builds.apache.org/job/Hadoop-Common-trunk/ws/hadoop-common-project/hadoop-nfs/target/org/apache/hadoop/oncrpc/security/class-use/SysSecurityHandler.html...>
Generating <https://builds.apache.org/job/Hadoop-Common-trunk/ws/hadoop-common-project/hadoop-nfs/target/org/apache/hadoop/oncrpc/security/class-use/Credentials.html...>
Generating <https://builds.apache.org/job/Hadoop-Common-trunk/ws/hadoop-common-project/hadoop-nfs/target/org/apache/hadoop/oncrpc/security/class-use/CredentialsNone.html...>
Generating <https://builds.apache.org/job/Hadoop-Common-trunk/ws/hadoop-common-project/hadoop-nfs/target/org/apache/hadoop/oncrpc/security/class-use/CredentialsSys.html...>
Generating <https://builds.apache.org/job/Hadoop-Common-trunk/ws/hadoop-common-project/hadoop-nfs/target/org/apache/hadoop/oncrpc/security/class-use/SecurityHandler.html...>
Generating <https://builds.apache.org/job/Hadoop-Common-trunk/ws/hadoop-common-project/hadoop-nfs/target/org/apache/hadoop/oncrpc/security/class-use/RpcAuthInfo.html...>
Generating <https://builds.apache.org/job/Hadoop-Common-trunk/ws/hadoop-common-project/hadoop-nfs/target/org/apache/hadoop/oncrpc/security/class-use/RpcAuthInfo.AuthFlavor.html...>
Generating <https://builds.apache.org/job/Hadoop-Common-trunk/ws/hadoop-common-project/hadoop-nfs/target/org/apache/hadoop/oncrpc/security/class-use/CredentialsGSS.html...>
Generating <https://builds.apache.org/job/Hadoop-Common-trunk/ws/hadoop-common-project/hadoop-nfs/target/org/apache/hadoop/oncrpc/security/class-use/VerifierNone.html...>
Generating <https://builds.apache.org/job/Hadoop-Common-trunk/ws/hadoop-common-project/hadoop-nfs/target/org/apache/hadoop/mount/class-use/MountEntry.html...>
Generating <https://builds.apache.org/job/Hadoop-Common-trunk/ws/hadoop-common-project/hadoop-nfs/target/org/apache/hadoop/mount/class-use/MountdBase.html...>
Generating <https://builds.apache.org/job/Hadoop-Common-trunk/ws/hadoop-common-project/hadoop-nfs/target/org/apache/hadoop/mount/class-use/MountResponse.html...>
Generating <https://builds.apache.org/job/Hadoop-Common-trunk/ws/hadoop-common-project/hadoop-nfs/target/org/apache/hadoop/mount/class-use/MountInterface.html...>
Generating <https://builds.apache.org/job/Hadoop-Common-trunk/ws/hadoop-common-project/hadoop-nfs/target/org/apache/hadoop/mount/class-use/MountInterface.MNTPROC.html...>
Generating <https://builds.apache.org/job/Hadoop-Common-trunk/ws/hadoop-common-project/hadoop-nfs/target/org/apache/hadoop/mount/package-use.html...>
Generating <https://builds.apache.org/job/Hadoop-Common-trunk/ws/hadoop-common-project/hadoop-nfs/target/org/apache/hadoop/nfs/package-use.html...>
Generating <https://builds.apache.org/job/Hadoop-Common-trunk/ws/hadoop-common-project/hadoop-nfs/target/org/apache/hadoop/nfs/nfs3/package-use.html...>
Generating <https://builds.apache.org/job/Hadoop-Common-trunk/ws/hadoop-common-project/hadoop-nfs/target/org/apache/hadoop/nfs/nfs3/request/package-use.html...>
Generating <https://builds.apache.org/job/Hadoop-Common-trunk/ws/hadoop-common-project/hadoop-nfs/target/org/apache/hadoop/nfs/nfs3/response/package-use.html...>
Generating <https://builds.apache.org/job/Hadoop-Common-trunk/ws/hadoop-common-project/hadoop-nfs/target/org/apache/hadoop/oncrpc/package-use.html...>
Generating <https://builds.apache.org/job/Hadoop-Common-trunk/ws/hadoop-common-project/hadoop-nfs/target/org/apache/hadoop/oncrpc/security/package-use.html...>
Generating <https://builds.apache.org/job/Hadoop-Common-trunk/ws/hadoop-common-project/hadoop-nfs/target/org/apache/hadoop/portmap/package-use.html...>
Building index for all the packages and classes...
Generating <https://builds.apache.org/job/Hadoop-Common-trunk/ws/hadoop-common-project/hadoop-nfs/target/overview-tree.html...>
Generating <https://builds.apache.org/job/Hadoop-Common-trunk/ws/hadoop-common-project/hadoop-nfs/target/index-all.html...>
Generating <https://builds.apache.org/job/Hadoop-Common-trunk/ws/hadoop-common-project/hadoop-nfs/target/deprecated-list.html...>
Building index for all classes...
Generating <https://builds.apache.org/job/Hadoop-Common-trunk/ws/hadoop-common-project/hadoop-nfs/target/allclasses-frame.html...>
Generating <https://builds.apache.org/job/Hadoop-Common-trunk/ws/hadoop-common-project/hadoop-nfs/target/allclasses-noframe.html...>
Generating <https://builds.apache.org/job/Hadoop-Common-trunk/ws/hadoop-common-project/hadoop-nfs/target/index.html...>
Generating <https://builds.apache.org/job/Hadoop-Common-trunk/ws/hadoop-common-project/hadoop-nfs/target/overview-summary.html...>
Generating <https://builds.apache.org/job/Hadoop-Common-trunk/ws/hadoop-common-project/hadoop-nfs/target/help-doc.html...>
[INFO] Building jar: <https://builds.apache.org/job/Hadoop-Common-trunk/ws/hadoop-common-project/hadoop-nfs/target/hadoop-nfs-3.0.0-SNAPSHOT-javadoc.jar>
[INFO] 
[INFO] --- maven-assembly-plugin:2.4:single (dist) @ hadoop-nfs ---
[INFO] Reading assembly descriptor: ../../hadoop-assemblies/src/main/resources/assemblies/hadoop-nfs-dist.xml
[WARNING] The following patterns were never triggered in this artifact exclusion filter:
o  'org.apache.hadoop:hadoop-common'
o  'org.apache.hadoop:hadoop-hdfs'
o  'org.hsqldb:hsqldb'

[INFO] Copying files to <https://builds.apache.org/job/Hadoop-Common-trunk/ws/hadoop-common-project/hadoop-nfs/target/hadoop-nfs-3.0.0-SNAPSHOT>
[INFO]                                                                         
[INFO] ------------------------------------------------------------------------
[INFO] Building Apache Hadoop KMS 3.0.0-SNAPSHOT
[INFO] ------------------------------------------------------------------------
[INFO] 
[INFO] --- maven-clean-plugin:2.5:clean (default-clean) @ hadoop-kms ---
[INFO] Deleting <https://builds.apache.org/job/Hadoop-Common-trunk/ws/hadoop-common-project/hadoop-kms/target>
[INFO] 
[INFO] --- findbugs-maven-plugin:3.0.0:findbugs (default-cli) @ hadoop-kms ---
[INFO] 
[INFO] --- maven-checkstyle-plugin:2.15:checkstyle (default-cli) @ hadoop-kms ---
[INFO] There are 45 errors reported by Checkstyle 6.6 with checkstyle/checkstyle.xml ruleset.
[WARNING] Unable to locate Source XRef to link to - DISABLED
[INFO] 
[INFO] --- maven-antrun-plugin:1.7:run (create-testdirs) @ hadoop-kms ---
[INFO] Executing tasks

main:
    [mkdir] Created dir: <https://builds.apache.org/job/Hadoop-Common-trunk/ws/hadoop-common-project/hadoop-kms/target/test-dir>
[INFO] Executed tasks
[INFO] 
[INFO] --- maven-resources-plugin:2.6:resources (default-resources) @ hadoop-kms ---
[INFO] Using 'UTF-8' encoding to copy filtered resources.
[INFO] skip non existing resourceDirectory <https://builds.apache.org/job/Hadoop-Common-trunk/ws/hadoop-common-project/hadoop-kms/src/main/resources>
[INFO] 
[INFO] --- maven-compiler-plugin:3.1:compile (default-compile) @ hadoop-kms ---
[INFO] Changes detected - recompiling the module!
[INFO] Compiling 14 source files to <https://builds.apache.org/job/Hadoop-Common-trunk/ws/hadoop-common-project/hadoop-kms/target/classes>
[INFO] 
[INFO] --- maven-antrun-plugin:1.7:run (create-web-xmls) @ hadoop-kms ---
[INFO] Executing tasks

main:
    [mkdir] Created dir: <https://builds.apache.org/job/Hadoop-Common-trunk/ws/hadoop-common-project/hadoop-kms/target/test-classes/kms-webapp>
     [copy] Copying 1 file to <https://builds.apache.org/job/Hadoop-Common-trunk/ws/hadoop-common-project/hadoop-kms/target/test-classes/kms-webapp>
[INFO] Executed tasks
[INFO] 
[INFO] --- maven-resources-plugin:2.6:testResources (default-testResources) @ hadoop-kms ---
[INFO] Using 'UTF-8' encoding to copy filtered resources.
[INFO] Copying 3 resources
[INFO] 
[INFO] --- maven-compiler-plugin:3.1:testCompile (default-testCompile) @ hadoop-kms ---
[INFO] Changes detected - recompiling the module!
[INFO] Compiling 6 source files to <https://builds.apache.org/job/Hadoop-Common-trunk/ws/hadoop-common-project/hadoop-kms/target/test-classes>
[INFO] 
[INFO] --- maven-surefire-plugin:2.17:test (default-test) @ hadoop-kms ---
[WARNING] The parameter forkMode is deprecated since version 2.14. Use forkCount and reuseForks
instead.
[INFO] Surefire report directory: <https://builds.apache.org/job/Hadoop-Common-trunk/ws/hadoop-common-project/hadoop-kms/target/surefire-reports>

-------------------------------------------------------
 T E S T S
-------------------------------------------------------

-------------------------------------------------------
 T E S T S
-------------------------------------------------------
Running org.apache.hadoop.crypto.key.kms.server.TestKMSWithZK
Tests run: 1, Failures: 0, Errors: 0, Skipped: 0, Time elapsed: 7.687 sec - in org.apache.hadoop.crypto.key.kms.server.TestKMSWithZK
Running org.apache.hadoop.crypto.key.kms.server.TestKeyAuthorizationKeyProvider
Tests run: 3, Failures: 0, Errors: 0, Skipped: 0, Time elapsed: 1.847 sec - in org.apache.hadoop.crypto.key.kms.server.TestKeyAuthorizationKeyProvider
Running org.apache.hadoop.crypto.key.kms.server.TestKMSAudit
Tests run: 2, Failures: 0, Errors: 0, Skipped: 0, Time elapsed: 6.796 sec - in org.apache.hadoop.crypto.key.kms.server.TestKMSAudit
Running org.apache.hadoop.crypto.key.kms.server.TestKMS
Tests run: 21, Failures: 0, Errors: 1, Skipped: 0, Time elapsed: 71.026 sec <<< FAILURE!
- in org.apache.hadoop.crypto.key.kms.server.TestKMS
testKMSWithZKDTSM(org.apache.hadoop.crypto.key.kms.server.TestKMS)  Time elapsed: 1.998 sec
 <<< ERROR!
java.io.IOException: org.apache.hadoop.security.authentication.client.AuthenticationException:
GSSException: No valid credentials provided (Mechanism level: Cannot get a KDC reply)
	at sun.security.krb5.KdcComm.send(KdcComm.java:250)
	at sun.security.krb5.KdcComm.send(KdcComm.java:191)
	at sun.security.krb5.KrbTgsReq.send(KrbTgsReq.java:187)
	at sun.security.krb5.KrbTgsReq.sendAndGetCreds(KrbTgsReq.java:202)
	at sun.security.krb5.internal.CredentialsUtil.serviceCreds(CredentialsUtil.java:311)
	at sun.security.krb5.internal.CredentialsUtil.acquireServiceCreds(CredentialsUtil.java:115)
	at sun.security.krb5.Credentials.acquireServiceCreds(Credentials.java:449)
	at sun.security.jgss.krb5.Krb5Context.initSecContext(Krb5Context.java:641)
	at sun.security.jgss.GSSContextImpl.initSecContext(GSSContextImpl.java:248)
	at sun.security.jgss.GSSContextImpl.initSecContext(GSSContextImpl.java:179)
	at org.apache.hadoop.security.authentication.client.KerberosAuthenticator$1.run(KerberosAuthenticator.java:311)
	at org.apache.hadoop.security.authentication.client.KerberosAuthenticator$1.run(KerberosAuthenticator.java:287)
	at java.security.AccessController.doPrivileged(Native Method)
	at javax.security.auth.Subject.doAs(Subject.java:415)
	at org.apache.hadoop.security.authentication.client.KerberosAuthenticator.doSpnegoSequence(KerberosAuthenticator.java:287)
	at org.apache.hadoop.security.authentication.client.KerberosAuthenticator.authenticate(KerberosAuthenticator.java:205)
	at org.apache.hadoop.security.token.delegation.web.DelegationTokenAuthenticator.authenticate(DelegationTokenAuthenticator.java:128)
	at org.apache.hadoop.security.authentication.client.AuthenticatedURL.openConnection(AuthenticatedURL.java:215)
	at org.apache.hadoop.security.token.delegation.web.DelegationTokenAuthenticatedURL.openConnection(DelegationTokenAuthenticatedURL.java:322)
	at org.apache.hadoop.crypto.key.kms.KMSClientProvider$1.run(KMSClientProvider.java:483)
	at org.apache.hadoop.crypto.key.kms.KMSClientProvider$1.run(KMSClientProvider.java:478)
	at java.security.AccessController.doPrivileged(Native Method)
	at javax.security.auth.Subject.doAs(Subject.java:415)
	at org.apache.hadoop.security.UserGroupInformation.doAs(UserGroupInformation.java:1669)
	at org.apache.hadoop.crypto.key.kms.KMSClientProvider.createConnection(KMSClientProvider.java:478)
	at org.apache.hadoop.crypto.key.kms.KMSClientProvider.createKeyInternal(KMSClientProvider.java:677)
	at org.apache.hadoop.crypto.key.kms.KMSClientProvider.createKey(KMSClientProvider.java:695)
	at org.apache.hadoop.crypto.key.kms.LoadBalancingKMSClientProvider$10.call(LoadBalancingKMSClientProvider.java:259)
	at org.apache.hadoop.crypto.key.kms.LoadBalancingKMSClientProvider$10.call(LoadBalancingKMSClientProvider.java:256)
	at org.apache.hadoop.crypto.key.kms.LoadBalancingKMSClientProvider.doOp(LoadBalancingKMSClientProvider.java:94)
	at org.apache.hadoop.crypto.key.kms.LoadBalancingKMSClientProvider.createKey(LoadBalancingKMSClientProvider.java:256)
	at org.apache.hadoop.crypto.key.kms.server.TestKMS$13$1.run(TestKMS.java:1783)
	at org.apache.hadoop.crypto.key.kms.server.TestKMS$13$1.run(TestKMS.java:1779)
	at java.security.AccessController.doPrivileged(Native Method)
	at javax.security.auth.Subject.doAs(Subject.java:415)
	at org.apache.hadoop.security.UserGroupInformation.doAs(UserGroupInformation.java:1669)
	at org.apache.hadoop.crypto.key.kms.server.TestKMS.doAs(TestKMS.java:266)
	at org.apache.hadoop.crypto.key.kms.server.TestKMS.access$100(TestKMS.java:75)

Running org.apache.hadoop.crypto.key.kms.server.TestKMSACLs
Tests run: 3, Failures: 0, Errors: 0, Skipped: 0, Time elapsed: 0.829 sec - in org.apache.hadoop.crypto.key.kms.server.TestKMSACLs

Results :

Tests in error: 
  TestKMS.testKMSWithZKDTSM:1714->doKMSWithZK:1796->runServer:112->runServer:130->access$100:75->doAs:266
ยป IO

Tests run: 30, Failures: 0, Errors: 1, Skipped: 0

[INFO] ------------------------------------------------------------------------
[INFO] Reactor Summary:
[INFO] 
[INFO] Apache Hadoop Annotations ......................... SUCCESS [ 10.911 s]
[INFO] Apache Hadoop MiniKDC ............................. SUCCESS [ 29.399 s]
[INFO] Apache Hadoop Auth ................................ SUCCESS [04:13 min]
[INFO] Apache Hadoop Auth Examples ....................... SUCCESS [  4.941 s]
[INFO] Apache Hadoop Common .............................. SUCCESS [32:06 min]
[INFO] Apache Hadoop NFS ................................. SUCCESS [ 17.729 s]
[INFO] Apache Hadoop KMS ................................. FAILURE [01:31 min]
[INFO] Apache Hadoop Common Project ...................... SKIPPED
[INFO] ------------------------------------------------------------------------
[INFO] BUILD FAILURE
[INFO] ------------------------------------------------------------------------
[INFO] Total time: 38:55 min
[INFO] Finished at: 2015-11-28T06:00:27+00:00
[INFO] Final Memory: 102M/873M
[INFO] ------------------------------------------------------------------------
[ERROR] Failed to execute goal org.apache.maven.plugins:maven-surefire-plugin:2.17:test (default-test)
on project hadoop-kms: There are test failures.
[ERROR] 
[ERROR] Please refer to <https://builds.apache.org/job/Hadoop-Common-trunk/ws/hadoop-common-project/hadoop-kms/target/surefire-reports>
for the individual test results.
[ERROR] -> [Help 1]
[ERROR] 
[ERROR] To see the full stack trace of the errors, re-run Maven with the -e switch.
[ERROR] Re-run Maven using the -X switch to enable full debug logging.
[ERROR] 
[ERROR] For more information about the errors and possible solutions, please read the following
articles:
[ERROR] [Help 1] http://cwiki.apache.org/confluence/display/MAVEN/MojoFailureException
[ERROR] 
[ERROR] After correcting the problems, you can resume the build with the command
[ERROR]   mvn <goals> -rf :hadoop-kms
result: 1

################
# mvn -eaf test -Pclover -DcloverLicenseLocation=/home/jenkins/tools/clover/latest/lib/clover.license
################
Build step 'Execute shell' marked build as failure
Archiving artifacts
Recording test results

Mime
View raw message