hadoop-common-dev mailing list archives

Site index · List index
Message view « Date » · « Thread »
Top « Date » · « Thread »
From Apache Jenkins Server <jenk...@builds.apache.org>
Subject Build failed in Jenkins: Hadoop-Common-trunk #1796
Date Mon, 05 Oct 2015 21:04:10 GMT
See <https://builds.apache.org/job/Hadoop-Common-trunk/1796/changes>

Changes:

[cmccabe] HDFS-9155. OEV should treat .XML files as XML even when the file name

------------------------------------------
[...truncated 5231 lines...]
Running org.apache.hadoop.fs.TestSymlinkLocalFSFileContext
Tests run: 63, Failures: 0, Errors: 0, Skipped: 3, Time elapsed: 3.001 sec - in org.apache.hadoop.fs.TestSymlinkLocalFSFileContext
Running org.apache.hadoop.fs.TestDelegateToFileSystem
Tests run: 2, Failures: 0, Errors: 0, Skipped: 0, Time elapsed: 0.52 sec - in org.apache.hadoop.fs.TestDelegateToFileSystem
Running org.apache.hadoop.fs.TestDelegationTokenRenewer
Tests run: 5, Failures: 0, Errors: 0, Skipped: 0, Time elapsed: 5.834 sec - in org.apache.hadoop.fs.TestDelegationTokenRenewer
Running org.apache.hadoop.fs.TestHarFileSystem
Tests run: 4, Failures: 0, Errors: 0, Skipped: 0, Time elapsed: 0.814 sec - in org.apache.hadoop.fs.TestHarFileSystem
Running org.apache.hadoop.fs.TestTruncatedInputBug
Tests run: 1, Failures: 0, Errors: 0, Skipped: 0, Time elapsed: 0.827 sec - in org.apache.hadoop.fs.TestTruncatedInputBug
Running org.apache.hadoop.fs.TestFileSystemInitialization
Tests run: 1, Failures: 0, Errors: 0, Skipped: 0, Time elapsed: 0.686 sec - in org.apache.hadoop.fs.TestFileSystemInitialization
Running org.apache.hadoop.fs.TestFsShell
Tests run: 3, Failures: 0, Errors: 0, Skipped: 0, Time elapsed: 0.995 sec - in org.apache.hadoop.fs.TestFsShell
Running org.apache.hadoop.fs.TestFileContextResolveAfs
Tests run: 1, Failures: 0, Errors: 0, Skipped: 0, Time elapsed: 0.905 sec - in org.apache.hadoop.fs.TestFileContextResolveAfs
Running org.apache.hadoop.fs.TestBlockLocation
Tests run: 2, Failures: 0, Errors: 0, Skipped: 0, Time elapsed: 0.09 sec - in org.apache.hadoop.fs.TestBlockLocation
Running org.apache.hadoop.fs.TestFsShellCopy
Tests run: 16, Failures: 0, Errors: 0, Skipped: 4, Time elapsed: 1.452 sec - in org.apache.hadoop.fs.TestFsShellCopy
Running org.apache.hadoop.fs.permission.TestAcl
Tests run: 6, Failures: 0, Errors: 0, Skipped: 0, Time elapsed: 0.231 sec - in org.apache.hadoop.fs.permission.TestAcl
Running org.apache.hadoop.fs.permission.TestFsPermission
Tests run: 8, Failures: 0, Errors: 0, Skipped: 0, Time elapsed: 0.795 sec - in org.apache.hadoop.fs.permission.TestFsPermission
Running org.apache.hadoop.fs.sftp.TestSFTPFileSystem
Tests run: 9, Failures: 0, Errors: 0, Skipped: 0, Time elapsed: 7.002 sec - in org.apache.hadoop.fs.sftp.TestSFTPFileSystem
Running org.apache.hadoop.fs.TestFileContextDeleteOnExit
Tests run: 1, Failures: 0, Errors: 0, Skipped: 0, Time elapsed: 0.851 sec - in org.apache.hadoop.fs.TestFileContextDeleteOnExit
Running org.apache.hadoop.fs.TestFcLocalFsUtil
Tests run: 2, Failures: 0, Errors: 0, Skipped: 0, Time elapsed: 0.917 sec - in org.apache.hadoop.fs.TestFcLocalFsUtil
Running org.apache.hadoop.fs.TestStat
Tests run: 5, Failures: 0, Errors: 0, Skipped: 0, Time elapsed: 0.887 sec - in org.apache.hadoop.fs.TestStat
Running org.apache.hadoop.fs.shell.TestCopy
Tests run: 5, Failures: 0, Errors: 0, Skipped: 0, Time elapsed: 1.22 sec - in org.apache.hadoop.fs.shell.TestCopy
Running org.apache.hadoop.fs.shell.TestTextCommand
Tests run: 4, Failures: 0, Errors: 0, Skipped: 0, Time elapsed: 1.396 sec - in org.apache.hadoop.fs.shell.TestTextCommand
Running org.apache.hadoop.fs.shell.TestCopyPreserveFlag
Tests run: 8, Failures: 0, Errors: 0, Skipped: 0, Time elapsed: 1.003 sec - in org.apache.hadoop.fs.shell.TestCopyPreserveFlag
Running org.apache.hadoop.fs.shell.TestAclCommands
Tests run: 7, Failures: 0, Errors: 0, Skipped: 0, Time elapsed: 1.085 sec - in org.apache.hadoop.fs.shell.TestAclCommands
Running org.apache.hadoop.fs.shell.find.TestFind
Tests run: 24, Failures: 0, Errors: 0, Skipped: 0, Time elapsed: 2.122 sec - in org.apache.hadoop.fs.shell.find.TestFind
Running org.apache.hadoop.fs.shell.find.TestPrint0
Tests run: 1, Failures: 0, Errors: 0, Skipped: 0, Time elapsed: 1.108 sec - in org.apache.hadoop.fs.shell.find.TestPrint0
Running org.apache.hadoop.fs.shell.find.TestPrint
Tests run: 1, Failures: 0, Errors: 0, Skipped: 0, Time elapsed: 1.163 sec - in org.apache.hadoop.fs.shell.find.TestPrint
Running org.apache.hadoop.fs.shell.find.TestAnd
Tests run: 10, Failures: 0, Errors: 0, Skipped: 0, Time elapsed: 0.393 sec - in org.apache.hadoop.fs.shell.find.TestAnd
Running org.apache.hadoop.fs.shell.find.TestResult
Tests run: 18, Failures: 0, Errors: 0, Skipped: 0, Time elapsed: 0.133 sec - in org.apache.hadoop.fs.shell.find.TestResult
Running org.apache.hadoop.fs.shell.find.TestIname
Tests run: 6, Failures: 0, Errors: 0, Skipped: 0, Time elapsed: 1.177 sec - in org.apache.hadoop.fs.shell.find.TestIname
Running org.apache.hadoop.fs.shell.find.TestName
Tests run: 6, Failures: 0, Errors: 0, Skipped: 0, Time elapsed: 1.208 sec - in org.apache.hadoop.fs.shell.find.TestName
Running org.apache.hadoop.fs.shell.find.TestFilterExpression
Tests run: 11, Failures: 0, Errors: 0, Skipped: 0, Time elapsed: 0.407 sec - in org.apache.hadoop.fs.shell.find.TestFilterExpression
Running org.apache.hadoop.fs.shell.TestPathExceptions
Tests run: 4, Failures: 0, Errors: 0, Skipped: 0, Time elapsed: 0.088 sec - in org.apache.hadoop.fs.shell.TestPathExceptions
Running org.apache.hadoop.fs.shell.TestCommandFactory
Tests run: 2, Failures: 0, Errors: 0, Skipped: 0, Time elapsed: 0.232 sec - in org.apache.hadoop.fs.shell.TestCommandFactory
Running org.apache.hadoop.fs.shell.TestLs
Tests run: 33, Failures: 0, Errors: 0, Skipped: 0, Time elapsed: 1.609 sec - in org.apache.hadoop.fs.shell.TestLs
Running org.apache.hadoop.fs.shell.TestMove
Tests run: 1, Failures: 0, Errors: 0, Skipped: 0, Time elapsed: 1.074 sec - in org.apache.hadoop.fs.shell.TestMove
Running org.apache.hadoop.fs.shell.TestXAttrCommands
Tests run: 2, Failures: 0, Errors: 0, Skipped: 0, Time elapsed: 0.619 sec - in org.apache.hadoop.fs.shell.TestXAttrCommands
Running org.apache.hadoop.fs.shell.TestPathData
Tests run: 11, Failures: 0, Errors: 0, Skipped: 0, Time elapsed: 1.184 sec - in org.apache.hadoop.fs.shell.TestPathData
Running org.apache.hadoop.fs.shell.TestCount
Tests run: 22, Failures: 0, Errors: 0, Skipped: 0, Time elapsed: 1.146 sec - in org.apache.hadoop.fs.shell.TestCount
Running org.apache.hadoop.fs.contract.rawlocal.TestRawlocalContractRename
Tests run: 7, Failures: 0, Errors: 0, Skipped: 0, Time elapsed: 1.205 sec - in org.apache.hadoop.fs.contract.rawlocal.TestRawlocalContractRename
Running org.apache.hadoop.fs.contract.rawlocal.TestRawlocalContractAppend
Tests run: 5, Failures: 0, Errors: 0, Skipped: 5, Time elapsed: 1.008 sec - in org.apache.hadoop.fs.contract.rawlocal.TestRawlocalContractAppend
Running org.apache.hadoop.fs.contract.rawlocal.TestRawlocalContractDelete
Tests run: 8, Failures: 0, Errors: 0, Skipped: 0, Time elapsed: 1.118 sec - in org.apache.hadoop.fs.contract.rawlocal.TestRawlocalContractDelete
Running org.apache.hadoop.fs.contract.rawlocal.TestRawlocalContractGetFileStatus
Tests run: 1, Failures: 0, Errors: 0, Skipped: 0, Time elapsed: 0.853 sec - in org.apache.hadoop.fs.contract.rawlocal.TestRawlocalContractGetFileStatus
Running org.apache.hadoop.fs.contract.rawlocal.TestRawlocalContractSetTimes
Tests run: 1, Failures: 0, Errors: 0, Skipped: 0, Time elapsed: 0.866 sec - in org.apache.hadoop.fs.contract.rawlocal.TestRawlocalContractSetTimes
Running org.apache.hadoop.fs.contract.rawlocal.TestRawlocalContractSeek
Tests run: 10, Failures: 0, Errors: 0, Skipped: 0, Time elapsed: 1.414 sec - in org.apache.hadoop.fs.contract.rawlocal.TestRawlocalContractSeek
Running org.apache.hadoop.fs.contract.rawlocal.TestRawlocalContractOpen
Tests run: 6, Failures: 0, Errors: 0, Skipped: 0, Time elapsed: 1.223 sec - in org.apache.hadoop.fs.contract.rawlocal.TestRawlocalContractOpen
Running org.apache.hadoop.fs.contract.rawlocal.TestRawlocalContractMkdir
Tests run: 5, Failures: 0, Errors: 0, Skipped: 0, Time elapsed: 1.022 sec - in org.apache.hadoop.fs.contract.rawlocal.TestRawlocalContractMkdir
Running org.apache.hadoop.fs.contract.rawlocal.TestRawLocalContractUnderlyingFileBehavior
Tests run: 1, Failures: 0, Errors: 0, Skipped: 0, Time elapsed: 0.236 sec - in org.apache.hadoop.fs.contract.rawlocal.TestRawLocalContractUnderlyingFileBehavior
Running org.apache.hadoop.fs.contract.rawlocal.TestRawlocalContractCreate
Tests run: 6, Failures: 0, Errors: 0, Skipped: 0, Time elapsed: 1.058 sec - in org.apache.hadoop.fs.contract.rawlocal.TestRawlocalContractCreate
Running org.apache.hadoop.fs.contract.ftp.TestFTPContractCreate
Tests run: 6, Failures: 0, Errors: 0, Skipped: 6, Time elapsed: 0.707 sec - in org.apache.hadoop.fs.contract.ftp.TestFTPContractCreate
Running org.apache.hadoop.fs.contract.ftp.TestFTPContractDelete
Tests run: 8, Failures: 0, Errors: 0, Skipped: 8, Time elapsed: 0.79 sec - in org.apache.hadoop.fs.contract.ftp.TestFTPContractDelete
Running org.apache.hadoop.fs.contract.ftp.TestFTPContractRename
Tests run: 6, Failures: 0, Errors: 0, Skipped: 6, Time elapsed: 0.728 sec - in org.apache.hadoop.fs.contract.ftp.TestFTPContractRename
Running org.apache.hadoop.fs.contract.ftp.TestFTPContractMkdir
Tests run: 5, Failures: 0, Errors: 0, Skipped: 5, Time elapsed: 0.673 sec - in org.apache.hadoop.fs.contract.ftp.TestFTPContractMkdir
Running org.apache.hadoop.fs.contract.ftp.TestFTPContractOpen
Tests run: 6, Failures: 0, Errors: 0, Skipped: 6, Time elapsed: 0.869 sec - in org.apache.hadoop.fs.contract.ftp.TestFTPContractOpen
Running org.apache.hadoop.fs.contract.localfs.TestLocalFSContractAppend
Tests run: 5, Failures: 0, Errors: 0, Skipped: 5, Time elapsed: 0.954 sec - in org.apache.hadoop.fs.contract.localfs.TestLocalFSContractAppend
Running org.apache.hadoop.fs.contract.localfs.TestLocalFSContractGetFileStatus
Tests run: 1, Failures: 0, Errors: 0, Skipped: 0, Time elapsed: 0.879 sec - in org.apache.hadoop.fs.contract.localfs.TestLocalFSContractGetFileStatus
Running org.apache.hadoop.fs.contract.localfs.TestLocalFSContractOpen
Tests run: 6, Failures: 0, Errors: 0, Skipped: 0, Time elapsed: 1.235 sec - in org.apache.hadoop.fs.contract.localfs.TestLocalFSContractOpen
Running org.apache.hadoop.fs.contract.localfs.TestLocalFSContractLoaded
Tests run: 2, Failures: 0, Errors: 0, Skipped: 0, Time elapsed: 0.908 sec - in org.apache.hadoop.fs.contract.localfs.TestLocalFSContractLoaded
Running org.apache.hadoop.fs.contract.localfs.TestLocalFSContractDelete
Tests run: 8, Failures: 0, Errors: 0, Skipped: 0, Time elapsed: 1.1 sec - in org.apache.hadoop.fs.contract.localfs.TestLocalFSContractDelete
Running org.apache.hadoop.fs.contract.localfs.TestLocalFSContractMkdir
Tests run: 5, Failures: 0, Errors: 0, Skipped: 0, Time elapsed: 1.043 sec - in org.apache.hadoop.fs.contract.localfs.TestLocalFSContractMkdir
Running org.apache.hadoop.fs.contract.localfs.TestLocalFSContractRename
Tests run: 6, Failures: 0, Errors: 0, Skipped: 0, Time elapsed: 1.078 sec - in org.apache.hadoop.fs.contract.localfs.TestLocalFSContractRename
Running org.apache.hadoop.fs.contract.localfs.TestLocalFSContractCreate
Tests run: 6, Failures: 0, Errors: 0, Skipped: 0, Time elapsed: 1.115 sec - in org.apache.hadoop.fs.contract.localfs.TestLocalFSContractCreate
Running org.apache.hadoop.fs.contract.localfs.TestLocalFSContractSetTimes
Tests run: 1, Failures: 0, Errors: 0, Skipped: 0, Time elapsed: 0.825 sec - in org.apache.hadoop.fs.contract.localfs.TestLocalFSContractSetTimes
Running org.apache.hadoop.fs.contract.localfs.TestLocalFSContractSeek
Tests run: 10, Failures: 0, Errors: 0, Skipped: 0, Time elapsed: 1.435 sec - in org.apache.hadoop.fs.contract.localfs.TestLocalFSContractSeek
Running org.apache.hadoop.fs.TestContentSummary
Tests run: 13, Failures: 0, Errors: 0, Skipped: 0, Time elapsed: 0.479 sec - in org.apache.hadoop.fs.TestContentSummary
Running org.apache.hadoop.fs.TestTrash
Tests run: 4, Failures: 0, Errors: 0, Skipped: 0, Time elapsed: 21.249 sec - in org.apache.hadoop.fs.TestTrash
Running org.apache.hadoop.fs.TestLocalFSFileContextCreateMkdir
Tests run: 8, Failures: 0, Errors: 0, Skipped: 0, Time elapsed: 1.101 sec - in org.apache.hadoop.fs.TestLocalFSFileContextCreateMkdir
Running org.apache.hadoop.fs.TestLocalFsFCStatistics
Tests run: 3, Failures: 0, Errors: 0, Skipped: 0, Time elapsed: 1.036 sec - in org.apache.hadoop.fs.TestLocalFsFCStatistics
Running org.apache.hadoop.fs.TestFileStatus
Tests run: 11, Failures: 0, Errors: 0, Skipped: 0, Time elapsed: 0.258 sec - in org.apache.hadoop.fs.TestFileStatus
Running org.apache.hadoop.fs.TestCommandFormat
Tests run: 10, Failures: 0, Errors: 0, Skipped: 0, Time elapsed: 0.088 sec - in org.apache.hadoop.fs.TestCommandFormat
Running org.apache.hadoop.jmx.TestJMXJsonServlet
Tests run: 1, Failures: 0, Errors: 0, Skipped: 0, Time elapsed: 1.175 sec - in org.apache.hadoop.jmx.TestJMXJsonServlet
Running org.apache.hadoop.http.TestGlobalFilter
Tests run: 1, Failures: 0, Errors: 0, Skipped: 0, Time elapsed: 1.094 sec - in org.apache.hadoop.http.TestGlobalFilter
Running org.apache.hadoop.http.TestPathFilter
Tests run: 1, Failures: 0, Errors: 0, Skipped: 0, Time elapsed: 1.051 sec - in org.apache.hadoop.http.TestPathFilter
Running org.apache.hadoop.http.TestHttpCookieFlag
Tests run: 2, Failures: 0, Errors: 0, Skipped: 0, Time elapsed: 2.009 sec - in org.apache.hadoop.http.TestHttpCookieFlag
Running org.apache.hadoop.http.TestHttpRequestLogAppender
Tests run: 1, Failures: 0, Errors: 0, Skipped: 0, Time elapsed: 0.072 sec - in org.apache.hadoop.http.TestHttpRequestLogAppender
Running org.apache.hadoop.http.TestHtmlQuoting
Tests run: 4, Failures: 0, Errors: 0, Skipped: 0, Time elapsed: 0.333 sec - in org.apache.hadoop.http.TestHtmlQuoting
Running org.apache.hadoop.http.TestHttpRequestLog
Tests run: 2, Failures: 0, Errors: 0, Skipped: 0, Time elapsed: 0.223 sec - in org.apache.hadoop.http.TestHttpRequestLog
Running org.apache.hadoop.http.TestHttpServerWebapps
Tests run: 2, Failures: 0, Errors: 0, Skipped: 0, Time elapsed: 0.691 sec - in org.apache.hadoop.http.TestHttpServerWebapps
Running org.apache.hadoop.http.TestHttpServerLifecycle
Tests run: 7, Failures: 0, Errors: 0, Skipped: 0, Time elapsed: 1.53 sec - in org.apache.hadoop.http.TestHttpServerLifecycle
Running org.apache.hadoop.http.TestAuthenticationSessionCookie
Tests run: 2, Failures: 0, Errors: 0, Skipped: 0, Time elapsed: 2.215 sec - in org.apache.hadoop.http.TestAuthenticationSessionCookie
Running org.apache.hadoop.http.TestHttpServer
Tests run: 14, Failures: 0, Errors: 0, Skipped: 0, Time elapsed: 4.038 sec - in org.apache.hadoop.http.TestHttpServer
Running org.apache.hadoop.http.lib.TestStaticUserWebFilter
Tests run: 3, Failures: 0, Errors: 0, Skipped: 0, Time elapsed: 0.705 sec - in org.apache.hadoop.http.lib.TestStaticUserWebFilter
Running org.apache.hadoop.http.TestServletFilter
Tests run: 3, Failures: 0, Errors: 0, Skipped: 0, Time elapsed: 1.436 sec - in org.apache.hadoop.http.TestServletFilter
Running org.apache.hadoop.http.TestSSLHttpServer
Tests run: 2, Failures: 0, Errors: 0, Skipped: 0, Time elapsed: 2.024 sec - in org.apache.hadoop.http.TestSSLHttpServer
Running org.apache.hadoop.metrics2.sink.TestFileSink
Tests run: 1, Failures: 0, Errors: 0, Skipped: 0, Time elapsed: 0.555 sec - in org.apache.hadoop.metrics2.sink.TestFileSink
Running org.apache.hadoop.metrics2.sink.ganglia.TestGangliaSink
Tests run: 4, Failures: 0, Errors: 0, Skipped: 0, Time elapsed: 0.311 sec - in org.apache.hadoop.metrics2.sink.ganglia.TestGangliaSink
Running org.apache.hadoop.metrics2.util.TestSampleStat
Tests run: 1, Failures: 0, Errors: 0, Skipped: 0, Time elapsed: 0.078 sec - in org.apache.hadoop.metrics2.util.TestSampleStat
Running org.apache.hadoop.metrics2.util.TestSampleQuantiles
Tests run: 3, Failures: 0, Errors: 0, Skipped: 0, Time elapsed: 0.75 sec - in org.apache.hadoop.metrics2.util.TestSampleQuantiles
Running org.apache.hadoop.metrics2.util.TestMetricsCache
Tests run: 4, Failures: 0, Errors: 0, Skipped: 0, Time elapsed: 2.1 sec - in org.apache.hadoop.metrics2.util.TestMetricsCache
Running org.apache.hadoop.metrics2.impl.TestMetricsSourceAdapter
Tests run: 2, Failures: 0, Errors: 0, Skipped: 0, Time elapsed: 1.483 sec - in org.apache.hadoop.metrics2.impl.TestMetricsSourceAdapter
Running org.apache.hadoop.metrics2.impl.TestSinkQueue
Tests run: 8, Failures: 0, Errors: 0, Skipped: 0, Time elapsed: 0.533 sec - in org.apache.hadoop.metrics2.impl.TestSinkQueue
Running org.apache.hadoop.metrics2.impl.TestMetricsCollectorImpl
Tests run: 2, Failures: 0, Errors: 0, Skipped: 0, Time elapsed: 0.287 sec - in org.apache.hadoop.metrics2.impl.TestMetricsCollectorImpl
Running org.apache.hadoop.metrics2.impl.TestMetricsVisitor
Tests run: 1, Failures: 0, Errors: 0, Skipped: 0, Time elapsed: 0.433 sec - in org.apache.hadoop.metrics2.impl.TestMetricsVisitor
Running org.apache.hadoop.metrics2.impl.TestStatsDMetrics
Tests run: 2, Failures: 0, Errors: 0, Skipped: 0, Time elapsed: 0.389 sec - in org.apache.hadoop.metrics2.impl.TestStatsDMetrics
Running org.apache.hadoop.metrics2.impl.TestGraphiteMetrics
Tests run: 5, Failures: 0, Errors: 0, Skipped: 0, Time elapsed: 0.463 sec - in org.apache.hadoop.metrics2.impl.TestGraphiteMetrics
Running org.apache.hadoop.metrics2.impl.TestMetricsConfig
Tests run: 3, Failures: 0, Errors: 0, Skipped: 0, Time elapsed: 0.338 sec - in org.apache.hadoop.metrics2.impl.TestMetricsConfig
Running org.apache.hadoop.metrics2.impl.TestMetricsSystemImpl
Tests run: 12, Failures: 0, Errors: 0, Skipped: 0, Time elapsed: 1.914 sec - in org.apache.hadoop.metrics2.impl.TestMetricsSystemImpl
Running org.apache.hadoop.metrics2.impl.TestGangliaMetrics
Tests run: 2, Failures: 0, Errors: 0, Skipped: 0, Time elapsed: 0.509 sec - in org.apache.hadoop.metrics2.impl.TestGangliaMetrics
Running org.apache.hadoop.metrics2.source.TestJvmMetrics
Tests run: 1, Failures: 0, Errors: 0, Skipped: 0, Time elapsed: 0.641 sec - in org.apache.hadoop.metrics2.source.TestJvmMetrics
Running org.apache.hadoop.metrics2.filter.TestPatternFilter
Tests run: 5, Failures: 0, Errors: 0, Skipped: 0, Time elapsed: 0.454 sec - in org.apache.hadoop.metrics2.filter.TestPatternFilter
Running org.apache.hadoop.metrics2.lib.TestMetricsAnnotations
Tests run: 9, Failures: 0, Errors: 0, Skipped: 0, Time elapsed: 0.551 sec - in org.apache.hadoop.metrics2.lib.TestMetricsAnnotations
Running org.apache.hadoop.metrics2.lib.TestUniqNames
Tests run: 2, Failures: 0, Errors: 0, Skipped: 0, Time elapsed: 0.083 sec - in org.apache.hadoop.metrics2.lib.TestUniqNames
Running org.apache.hadoop.metrics2.lib.TestInterns
Tests run: 4, Failures: 0, Errors: 0, Skipped: 0, Time elapsed: 0.265 sec - in org.apache.hadoop.metrics2.lib.TestInterns
Running org.apache.hadoop.metrics2.lib.TestMetricsRegistry
Tests run: 3, Failures: 0, Errors: 0, Skipped: 0, Time elapsed: 0.458 sec - in org.apache.hadoop.metrics2.lib.TestMetricsRegistry
Running org.apache.hadoop.metrics2.lib.TestMutableMetrics
Tests run: 5, Failures: 0, Errors: 0, Skipped: 0, Time elapsed: 28.523 sec - in org.apache.hadoop.metrics2.lib.TestMutableMetrics

Results :

Failed tests: 
  TestRPC.testRPCInterruptedSimple:886 Interruption did not cause IPC to fail

Tests run: 3155, Failures: 1, Errors: 0, Skipped: 86

[INFO] ------------------------------------------------------------------------
[INFO] Reactor Summary:
[INFO] 
[INFO] Apache Hadoop Annotations ......................... SUCCESS [  9.654 s]
[INFO] Apache Hadoop MiniKDC ............................. SUCCESS [ 22.863 s]
[INFO] Apache Hadoop Auth ................................ SUCCESS [05:33 min]
[INFO] Apache Hadoop Auth Examples ....................... SUCCESS [  4.172 s]
[INFO] Apache Hadoop Common .............................. FAILURE [23:38 min]
[INFO] Apache Hadoop NFS ................................. SKIPPED
[INFO] Apache Hadoop KMS ................................. SKIPPED
[INFO] Apache Hadoop Common Project ...................... SKIPPED
[INFO] ------------------------------------------------------------------------
[INFO] BUILD FAILURE
[INFO] ------------------------------------------------------------------------
[INFO] Total time: 29:50 min
[INFO] Finished at: 2015-10-05T21:04:34+00:00
[INFO] Final Memory: 82M/1003M
[INFO] ------------------------------------------------------------------------
[ERROR] Failed to execute goal org.apache.maven.plugins:maven-surefire-plugin:2.17:test (default-test)
on project hadoop-common: There are test failures.
[ERROR] 
[ERROR] Please refer to <https://builds.apache.org/job/Hadoop-Common-trunk/ws/hadoop-common-project/hadoop-common/target/surefire-reports>
for the individual test results.
[ERROR] -> [Help 1]
[ERROR] 
[ERROR] To see the full stack trace of the errors, re-run Maven with the -e switch.
[ERROR] Re-run Maven using the -X switch to enable full debug logging.
[ERROR] 
[ERROR] For more information about the errors and possible solutions, please read the following
articles:
[ERROR] [Help 1] http://cwiki.apache.org/confluence/display/MAVEN/MojoFailureException
[ERROR] 
[ERROR] After correcting the problems, you can resume the build with the command
[ERROR]   mvn <goals> -rf :hadoop-common
result: 1

################
# mvn -eaf test -Pclover -DcloverLicenseLocation=/home/jenkins/tools/clover/latest/lib/clover.license
################
Build step 'Execute shell' marked build as failure
Archiving artifacts
Recording test results

Mime
View raw message