hadoop-common-dev mailing list archives

Site index · List index
Message view « Date » · « Thread »
Top « Date » · « Thread »
From Apache Jenkins Server <jenk...@builds.apache.org>
Subject Build failed in Jenkins: Hadoop-common-trunk-Java8 #609
Date Tue, 27 Oct 2015 02:35:42 GMT
See <https://builds.apache.org/job/Hadoop-common-trunk-Java8/609/changes>

Changes:

[wang] HDFS-9284. fsck command should not print exception trace when file not

[lei] HDFS-9291. Fix TestInterDatanodeProtocol to be FsDataset-agnostic. (lei)

[wang] HDFS-8945. Update the description about replica placement in HDFS

[arp] HDFS-9305. Delayed heartbeat processing causes storm of subsequent

[lei] HDFS-9292. Make TestFileConcorruption independent to underlying

[wangda] YARN-4169. Fix racing condition of TestNodeStatusUpdaterForLabels.

[wangda] YARN-3216. Max-AM-Resource-Percentage should respect node labels. (Sunil

[aajisaka] YARN-4300. [JDK8] Fix javadoc errors caused by wrong tags. (aajisaka)

------------------------------------------
[...truncated 9613 lines...]
[WARNING] ^
[WARNING] <https://builds.apache.org/job/Hadoop-common-trunk-Java8/ws/hadoop-common-project/hadoop-nfs/src/main/java/org/apache/hadoop/nfs/nfs3/response/NFS3Response.java>:47:
warning: no @return
[WARNING] public XDR serialize(XDR out, int xid, Verifier verifier) {
[WARNING] ^
[WARNING] <https://builds.apache.org/job/Hadoop-common-trunk-Java8/ws/hadoop-common-project/hadoop-nfs/src/main/java/org/apache/hadoop/nfs/nfs3/request/NFS3Request.java>:44:
warning: no @param for xdr
[WARNING] public abstract void serialize(XDR xdr);
[WARNING] ^
[WARNING] <https://builds.apache.org/job/Hadoop-common-trunk-Java8/ws/hadoop-common-project/hadoop-nfs/src/main/java/org/apache/hadoop/mount/MountdBase.java>:51:
warning: no description for @param
[WARNING] * @param program
[WARNING] ^
[WARNING] <https://builds.apache.org/job/Hadoop-common-trunk-Java8/ws/hadoop-common-project/hadoop-nfs/src/main/java/org/apache/hadoop/mount/MountdBase.java>:52:
warning: no description for @throws
[WARNING] * @throws IOException
[WARNING] ^
[WARNING] <https://builds.apache.org/job/Hadoop-common-trunk-Java8/ws/hadoop-common-project/hadoop-nfs/src/main/java/org/apache/hadoop/mount/MountInterface.java>:56:
warning: no @param for out
[WARNING] public XDR nullOp(XDR out, int xid, InetAddress client);
[WARNING] ^
[WARNING] <https://builds.apache.org/job/Hadoop-common-trunk-Java8/ws/hadoop-common-project/hadoop-nfs/src/main/java/org/apache/hadoop/mount/MountInterface.java>:56:
warning: no @param for xid
[WARNING] public XDR nullOp(XDR out, int xid, InetAddress client);
[WARNING] ^
[WARNING] <https://builds.apache.org/job/Hadoop-common-trunk-Java8/ws/hadoop-common-project/hadoop-nfs/src/main/java/org/apache/hadoop/mount/MountInterface.java>:56:
warning: no @param for client
[WARNING] public XDR nullOp(XDR out, int xid, InetAddress client);
[WARNING] ^
[WARNING] <https://builds.apache.org/job/Hadoop-common-trunk-Java8/ws/hadoop-common-project/hadoop-nfs/src/main/java/org/apache/hadoop/mount/MountInterface.java>:56:
warning: no @return
[WARNING] public XDR nullOp(XDR out, int xid, InetAddress client);
[WARNING] ^
[WARNING] <https://builds.apache.org/job/Hadoop-common-trunk-Java8/ws/hadoop-common-project/hadoop-nfs/src/main/java/org/apache/hadoop/mount/MountInterface.java>:59:
warning: no @param for xdr
[WARNING] public XDR mnt(XDR xdr, XDR out, int xid, InetAddress client);
[WARNING] ^
[WARNING] <https://builds.apache.org/job/Hadoop-common-trunk-Java8/ws/hadoop-common-project/hadoop-nfs/src/main/java/org/apache/hadoop/mount/MountInterface.java>:59:
warning: no @param for out
[WARNING] public XDR mnt(XDR xdr, XDR out, int xid, InetAddress client);
[WARNING] ^
[WARNING] <https://builds.apache.org/job/Hadoop-common-trunk-Java8/ws/hadoop-common-project/hadoop-nfs/src/main/java/org/apache/hadoop/mount/MountInterface.java>:59:
warning: no @param for xid
[WARNING] public XDR mnt(XDR xdr, XDR out, int xid, InetAddress client);
[WARNING] ^
[WARNING] <https://builds.apache.org/job/Hadoop-common-trunk-Java8/ws/hadoop-common-project/hadoop-nfs/src/main/java/org/apache/hadoop/mount/MountInterface.java>:59:
warning: no @param for client
[WARNING] public XDR mnt(XDR xdr, XDR out, int xid, InetAddress client);
[WARNING] ^
[WARNING] <https://builds.apache.org/job/Hadoop-common-trunk-Java8/ws/hadoop-common-project/hadoop-nfs/src/main/java/org/apache/hadoop/mount/MountInterface.java>:59:
warning: no @return
[WARNING] public XDR mnt(XDR xdr, XDR out, int xid, InetAddress client);
[WARNING] ^
[WARNING] <https://builds.apache.org/job/Hadoop-common-trunk-Java8/ws/hadoop-common-project/hadoop-nfs/src/main/java/org/apache/hadoop/mount/MountInterface.java>:62:
warning: no @param for out
[WARNING] public XDR dump(XDR out, int xid, InetAddress client);
[WARNING] ^
[WARNING] <https://builds.apache.org/job/Hadoop-common-trunk-Java8/ws/hadoop-common-project/hadoop-nfs/src/main/java/org/apache/hadoop/mount/MountInterface.java>:62:
warning: no @param for xid
[WARNING] public XDR dump(XDR out, int xid, InetAddress client);
[WARNING] ^
[WARNING] <https://builds.apache.org/job/Hadoop-common-trunk-Java8/ws/hadoop-common-project/hadoop-nfs/src/main/java/org/apache/hadoop/mount/MountInterface.java>:62:
warning: no @param for client
[WARNING] public XDR dump(XDR out, int xid, InetAddress client);
[WARNING] ^
[WARNING] <https://builds.apache.org/job/Hadoop-common-trunk-Java8/ws/hadoop-common-project/hadoop-nfs/src/main/java/org/apache/hadoop/mount/MountInterface.java>:62:
warning: no @return
[WARNING] public XDR dump(XDR out, int xid, InetAddress client);
[WARNING] ^
[WARNING] <https://builds.apache.org/job/Hadoop-common-trunk-Java8/ws/hadoop-common-project/hadoop-nfs/src/main/java/org/apache/hadoop/mount/MountInterface.java>:65:
warning: no @param for xdr
[WARNING] public XDR umnt(XDR xdr, XDR out, int xid, InetAddress client);
[WARNING] ^
[WARNING] <https://builds.apache.org/job/Hadoop-common-trunk-Java8/ws/hadoop-common-project/hadoop-nfs/src/main/java/org/apache/hadoop/mount/MountInterface.java>:65:
warning: no @param for out
[WARNING] public XDR umnt(XDR xdr, XDR out, int xid, InetAddress client);
[WARNING] ^
[WARNING] <https://builds.apache.org/job/Hadoop-common-trunk-Java8/ws/hadoop-common-project/hadoop-nfs/src/main/java/org/apache/hadoop/mount/MountInterface.java>:65:
warning: no @param for xid
[WARNING] public XDR umnt(XDR xdr, XDR out, int xid, InetAddress client);
[WARNING] ^
[WARNING] <https://builds.apache.org/job/Hadoop-common-trunk-Java8/ws/hadoop-common-project/hadoop-nfs/src/main/java/org/apache/hadoop/mount/MountInterface.java>:65:
warning: no @param for client
[WARNING] public XDR umnt(XDR xdr, XDR out, int xid, InetAddress client);
[WARNING] ^
[WARNING] <https://builds.apache.org/job/Hadoop-common-trunk-Java8/ws/hadoop-common-project/hadoop-nfs/src/main/java/org/apache/hadoop/mount/MountInterface.java>:65:
warning: no @return
[WARNING] public XDR umnt(XDR xdr, XDR out, int xid, InetAddress client);
[WARNING] ^
[WARNING] <https://builds.apache.org/job/Hadoop-common-trunk-Java8/ws/hadoop-common-project/hadoop-nfs/src/main/java/org/apache/hadoop/mount/MountInterface.java>:68:
warning: no @param for out
[WARNING] public XDR umntall(XDR out, int xid, InetAddress client);
[WARNING] ^
[WARNING] <https://builds.apache.org/job/Hadoop-common-trunk-Java8/ws/hadoop-common-project/hadoop-nfs/src/main/java/org/apache/hadoop/mount/MountInterface.java>:68:
warning: no @param for xid
[WARNING] public XDR umntall(XDR out, int xid, InetAddress client);
[WARNING] ^
[WARNING] <https://builds.apache.org/job/Hadoop-common-trunk-Java8/ws/hadoop-common-project/hadoop-nfs/src/main/java/org/apache/hadoop/mount/MountInterface.java>:68:
warning: no @param for client
[WARNING] public XDR umntall(XDR out, int xid, InetAddress client);
[WARNING] ^
[WARNING] <https://builds.apache.org/job/Hadoop-common-trunk-Java8/ws/hadoop-common-project/hadoop-nfs/src/main/java/org/apache/hadoop/mount/MountInterface.java>:68:
warning: no @return
[WARNING] public XDR umntall(XDR out, int xid, InetAddress client);
[WARNING] ^
[WARNING] <https://builds.apache.org/job/Hadoop-common-trunk-Java8/ws/hadoop-common-project/hadoop-nfs/src/main/java/org/apache/hadoop/mount/MountInterface.java>:47:
warning: no @param for value
[WARNING] public static MNTPROC fromValue(int value) {
[WARNING] ^
[WARNING] <https://builds.apache.org/job/Hadoop-common-trunk-Java8/ws/hadoop-common-project/hadoop-nfs/src/main/java/org/apache/hadoop/mount/MountResponse.java>:40:
warning: no @param for status
[WARNING] public static XDR writeMNTResponse(int status, XDR xdr, int xid,
[WARNING] ^
[WARNING] <https://builds.apache.org/job/Hadoop-common-trunk-Java8/ws/hadoop-common-project/hadoop-nfs/src/main/java/org/apache/hadoop/mount/MountResponse.java>:40:
warning: no @param for xdr
[WARNING] public static XDR writeMNTResponse(int status, XDR xdr, int xid,
[WARNING] ^
[INFO] Building jar: <https://builds.apache.org/job/Hadoop-common-trunk-Java8/ws/hadoop-common-project/hadoop-nfs/target/hadoop-nfs-3.0.0-SNAPSHOT-javadoc.jar>
[INFO] 
[INFO] --- maven-assembly-plugin:2.4:single (dist) @ hadoop-nfs ---
[INFO] Reading assembly descriptor: ../../hadoop-assemblies/src/main/resources/assemblies/hadoop-nfs-dist.xml
[WARNING] The following patterns were never triggered in this artifact exclusion filter:
o  'org.apache.hadoop:hadoop-common'
o  'org.apache.hadoop:hadoop-hdfs'
o  'org.hsqldb:hsqldb'

[INFO] Copying files to <https://builds.apache.org/job/Hadoop-common-trunk-Java8/ws/hadoop-common-project/hadoop-nfs/target/hadoop-nfs-3.0.0-SNAPSHOT>
[INFO]                                                                         
[INFO] ------------------------------------------------------------------------
[INFO] Building Apache Hadoop KMS 3.0.0-SNAPSHOT
[INFO] ------------------------------------------------------------------------
[INFO] 
[INFO] --- maven-clean-plugin:2.5:clean (default-clean) @ hadoop-kms ---
[INFO] Deleting <https://builds.apache.org/job/Hadoop-common-trunk-Java8/ws/hadoop-common-project/hadoop-kms/target>
[INFO] 
[INFO] --- maven-antrun-plugin:1.7:run (create-testdirs) @ hadoop-kms ---
[INFO] Executing tasks

main:
    [mkdir] Created dir: <https://builds.apache.org/job/Hadoop-common-trunk-Java8/ws/hadoop-common-project/hadoop-kms/target/test-dir>
[INFO] Executed tasks
[INFO] 
[INFO] --- maven-resources-plugin:2.6:resources (default-resources) @ hadoop-kms ---
[INFO] Using 'UTF-8' encoding to copy filtered resources.
[INFO] skip non existing resourceDirectory <https://builds.apache.org/job/Hadoop-common-trunk-Java8/ws/hadoop-common-project/hadoop-kms/src/main/resources>
[INFO] 
[INFO] --- maven-compiler-plugin:3.1:compile (default-compile) @ hadoop-kms ---
[INFO] Changes detected - recompiling the module!
[INFO] Compiling 14 source files to <https://builds.apache.org/job/Hadoop-common-trunk-Java8/ws/hadoop-common-project/hadoop-kms/target/classes>
[INFO] 
[INFO] --- maven-antrun-plugin:1.7:run (create-web-xmls) @ hadoop-kms ---
[INFO] Executing tasks

main:
    [mkdir] Created dir: <https://builds.apache.org/job/Hadoop-common-trunk-Java8/ws/hadoop-common-project/hadoop-kms/target/test-classes/kms-webapp>
     [copy] Copying 1 file to <https://builds.apache.org/job/Hadoop-common-trunk-Java8/ws/hadoop-common-project/hadoop-kms/target/test-classes/kms-webapp>
[INFO] Executed tasks
[INFO] 
[INFO] --- maven-resources-plugin:2.6:testResources (default-testResources) @ hadoop-kms ---
[INFO] Using 'UTF-8' encoding to copy filtered resources.
[INFO] Copying 3 resources
[INFO] 
[INFO] --- maven-compiler-plugin:3.1:testCompile (default-testCompile) @ hadoop-kms ---
[INFO] Changes detected - recompiling the module!
[INFO] Compiling 6 source files to <https://builds.apache.org/job/Hadoop-common-trunk-Java8/ws/hadoop-common-project/hadoop-kms/target/test-classes>
[INFO] 
[INFO] --- maven-surefire-plugin:2.17:test (default-test) @ hadoop-kms ---
[WARNING] The parameter forkMode is deprecated since version 2.14. Use forkCount and reuseForks
instead.
[INFO] Surefire report directory: <https://builds.apache.org/job/Hadoop-common-trunk-Java8/ws/hadoop-common-project/hadoop-kms/target/surefire-reports>

-------------------------------------------------------
 T E S T S
-------------------------------------------------------

-------------------------------------------------------
 T E S T S
-------------------------------------------------------
Java HotSpot(TM) 64-Bit Server VM warning: ignoring option MaxPermSize=768m; support was removed
in 8.0
Running org.apache.hadoop.crypto.key.kms.server.TestKMS
Tests run: 21, Failures: 1, Errors: 0, Skipped: 0, Time elapsed: 67.838 sec <<< FAILURE!
- in org.apache.hadoop.crypto.key.kms.server.TestKMS
testKMSProvider(org.apache.hadoop.crypto.key.kms.server.TestKMS)  Time elapsed: 1.377 sec
 <<< FAILURE!
java.lang.AssertionError: Values should be different. Actual: k6@0
	at org.junit.Assert.fail(Assert.java:88)
	at org.junit.Assert.failEquals(Assert.java:185)
	at org.junit.Assert.assertNotEquals(Assert.java:161)
	at org.junit.Assert.assertNotEquals(Assert.java:175)
	at org.apache.hadoop.crypto.key.kms.server.TestKMS$2.call(TestKMS.java:649)
	at org.apache.hadoop.crypto.key.kms.server.TestKMS$2.call(TestKMS.java:413)
	at org.apache.hadoop.crypto.key.kms.server.TestKMS.runServer(TestKMS.java:130)
	at org.apache.hadoop.crypto.key.kms.server.TestKMS.runServer(TestKMS.java:112)
	at org.apache.hadoop.crypto.key.kms.server.TestKMS.testKMSProvider(TestKMS.java:413)

Java HotSpot(TM) 64-Bit Server VM warning: ignoring option MaxPermSize=768m; support was removed
in 8.0
Running org.apache.hadoop.crypto.key.kms.server.TestKMSAudit
Tests run: 2, Failures: 0, Errors: 0, Skipped: 0, Time elapsed: 6.665 sec - in org.apache.hadoop.crypto.key.kms.server.TestKMSAudit
Java HotSpot(TM) 64-Bit Server VM warning: ignoring option MaxPermSize=768m; support was removed
in 8.0
Running org.apache.hadoop.crypto.key.kms.server.TestKeyAuthorizationKeyProvider
Tests run: 3, Failures: 0, Errors: 0, Skipped: 0, Time elapsed: 1.644 sec - in org.apache.hadoop.crypto.key.kms.server.TestKeyAuthorizationKeyProvider
Java HotSpot(TM) 64-Bit Server VM warning: ignoring option MaxPermSize=768m; support was removed
in 8.0
Running org.apache.hadoop.crypto.key.kms.server.TestKMSWithZK
Tests run: 1, Failures: 0, Errors: 0, Skipped: 0, Time elapsed: 7.324 sec - in org.apache.hadoop.crypto.key.kms.server.TestKMSWithZK
Java HotSpot(TM) 64-Bit Server VM warning: ignoring option MaxPermSize=768m; support was removed
in 8.0
Running org.apache.hadoop.crypto.key.kms.server.TestKMSACLs
Tests run: 3, Failures: 0, Errors: 0, Skipped: 0, Time elapsed: 0.779 sec - in org.apache.hadoop.crypto.key.kms.server.TestKMSACLs

Results :

Failed tests: 
  TestKMS.testKMSProvider:413->runServer:112->runServer:130 Values should be different.
Actual: k6@0

Tests run: 30, Failures: 1, Errors: 0, Skipped: 0

[INFO] ------------------------------------------------------------------------
[INFO] Reactor Summary:
[INFO] 
[INFO] Apache Hadoop Annotations ......................... SUCCESS [  9.031 s]
[INFO] Apache Hadoop MiniKDC ............................. SUCCESS [ 29.687 s]
[INFO] Apache Hadoop Auth ................................ SUCCESS [05:47 min]
[INFO] Apache Hadoop Auth Examples ....................... SUCCESS [  4.873 s]
[INFO] Apache Hadoop Common .............................. SUCCESS [31:14 min]
[INFO] Apache Hadoop NFS ................................. SUCCESS [ 18.546 s]
[INFO] Apache Hadoop KMS ................................. FAILURE [01:27 min]
[INFO] Apache Hadoop Common Project ...................... SKIPPED
[INFO] ------------------------------------------------------------------------
[INFO] BUILD FAILURE
[INFO] ------------------------------------------------------------------------
[INFO] Total time: 39:33 min
[INFO] Finished at: 2015-10-27T02:36:18+00:00
[INFO] Final Memory: 80M/264M
[INFO] ------------------------------------------------------------------------
[ERROR] Failed to execute goal org.apache.maven.plugins:maven-surefire-plugin:2.17:test (default-test)
on project hadoop-kms: There are test failures.
[ERROR] 
[ERROR] Please refer to <https://builds.apache.org/job/Hadoop-common-trunk-Java8/ws/hadoop-common-project/hadoop-kms/target/surefire-reports>
for the individual test results.
[ERROR] -> [Help 1]
org.apache.maven.lifecycle.LifecycleExecutionException: Failed to execute goal org.apache.maven.plugins:maven-surefire-plugin:2.17:test
(default-test) on project hadoop-kms: There are test failures.

Please refer to <https://builds.apache.org/job/Hadoop-common-trunk-Java8/ws/hadoop-common-project/hadoop-kms/target/surefire-reports>
for the individual test results.
	at org.apache.maven.lifecycle.internal.MojoExecutor.execute(MojoExecutor.java:212)
	at org.apache.maven.lifecycle.internal.MojoExecutor.execute(MojoExecutor.java:153)
	at org.apache.maven.lifecycle.internal.MojoExecutor.execute(MojoExecutor.java:145)
	at org.apache.maven.lifecycle.internal.LifecycleModuleBuilder.buildProject(LifecycleModuleBuilder.java:108)
	at org.apache.maven.lifecycle.internal.LifecycleModuleBuilder.buildProject(LifecycleModuleBuilder.java:76)
	at org.apache.maven.lifecycle.internal.builder.singlethreaded.SingleThreadedBuilder.build(SingleThreadedBuilder.java:51)
	at org.apache.maven.lifecycle.internal.LifecycleStarter.execute(LifecycleStarter.java:116)
	at org.apache.maven.DefaultMaven.doExecute(DefaultMaven.java:361)
	at org.apache.maven.DefaultMaven.execute(DefaultMaven.java:155)
	at org.apache.maven.cli.MavenCli.execute(MavenCli.java:584)
	at org.apache.maven.cli.MavenCli.doMain(MavenCli.java:213)
	at org.apache.maven.cli.MavenCli.main(MavenCli.java:157)
	at sun.reflect.NativeMethodAccessorImpl.invoke0(Native Method)
	at sun.reflect.NativeMethodAccessorImpl.invoke(NativeMethodAccessorImpl.java:62)
	at sun.reflect.DelegatingMethodAccessorImpl.invoke(DelegatingMethodAccessorImpl.java:43)
	at java.lang.reflect.Method.invoke(Method.java:483)
	at org.codehaus.plexus.classworlds.launcher.Launcher.launchEnhanced(Launcher.java:289)
	at org.codehaus.plexus.classworlds.launcher.Launcher.launch(Launcher.java:229)
	at org.codehaus.plexus.classworlds.launcher.Launcher.mainWithExitCode(Launcher.java:415)
	at org.codehaus.plexus.classworlds.launcher.Launcher.main(Launcher.java:356)
Caused by: org.apache.maven.plugin.MojoFailureException: There are test failures.

Please refer to <https://builds.apache.org/job/Hadoop-common-trunk-Java8/ws/hadoop-common-project/hadoop-kms/target/surefire-reports>
for the individual test results.
	at org.apache.maven.plugin.surefire.SurefireHelper.reportExecution(SurefireHelper.java:82)
	at org.apache.maven.plugin.surefire.SurefirePlugin.handleSummary(SurefirePlugin.java:195)
	at org.apache.maven.plugin.surefire.AbstractSurefireMojo.executeAfterPreconditionsChecked(AbstractSurefireMojo.java:861)
	at org.apache.maven.plugin.surefire.AbstractSurefireMojo.execute(AbstractSurefireMojo.java:729)
	at org.apache.maven.plugin.DefaultBuildPluginManager.executeMojo(DefaultBuildPluginManager.java:133)
	at org.apache.maven.lifecycle.internal.MojoExecutor.execute(MojoExecutor.java:208)
	... 19 more
[ERROR] 
[ERROR] Re-run Maven using the -X switch to enable full debug logging.
[ERROR] 
[ERROR] For more information about the errors and possible solutions, please read the following
articles:
[ERROR] [Help 1] http://cwiki.apache.org/confluence/display/MAVEN/MojoFailureException
[ERROR] 
[ERROR] After correcting the problems, you can resume the build with the command
[ERROR]   mvn <goals> -rf :hadoop-kms
Build step 'Execute shell' marked build as failure
Archiving artifacts
Recording test results

Mime
View raw message