hadoop-common-dev mailing list archives

Site index · List index
Message view « Date » · « Thread »
Top « Date » · « Thread »
From Apache Jenkins Server <jenk...@builds.apache.org>
Subject Build failed in Jenkins: Hadoop-Common-trunk #1887
Date Wed, 21 Oct 2015 23:13:12 GMT
See <https://builds.apache.org/job/Hadoop-Common-trunk/1887/changes>

Changes:

[jing9] HDFS-9070. Allow fsck display pending replica location information for

[jlowe] MAPREDUCE-6518. Set SO_KEEPALIVE on shuffle connections. Contributed by

[jing9] Move HDFS-9070 to trunk section in CHANGES.txt

[wang] HDFS-9225. Fix intermittent test failure of

[wang] HDFS-9278. Fix preferredBlockSize typo in OIV XML output. Contributed by

[wang] HADOOP-10406. TestIPC.testIpcWithReaderQueuing may fail. Contributed by

------------------------------------------
[...truncated 5401 lines...]
Running org.apache.hadoop.metrics2.lib.TestMetricsAnnotations
Tests run: 9, Failures: 0, Errors: 0, Skipped: 0, Time elapsed: 0.534 sec - in org.apache.hadoop.metrics2.lib.TestMetricsAnnotations
Running org.apache.hadoop.metrics2.lib.TestUniqNames
Tests run: 2, Failures: 0, Errors: 0, Skipped: 0, Time elapsed: 0.097 sec - in org.apache.hadoop.metrics2.lib.TestUniqNames
Running org.apache.hadoop.metrics2.lib.TestInterns
Tests run: 4, Failures: 0, Errors: 0, Skipped: 0, Time elapsed: 0.239 sec - in org.apache.hadoop.metrics2.lib.TestInterns
Running org.apache.hadoop.metrics2.source.TestJvmMetrics
Tests run: 1, Failures: 0, Errors: 0, Skipped: 0, Time elapsed: 0.577 sec - in org.apache.hadoop.metrics2.source.TestJvmMetrics
Running org.apache.hadoop.metrics2.filter.TestPatternFilter
Tests run: 5, Failures: 0, Errors: 0, Skipped: 0, Time elapsed: 0.467 sec - in org.apache.hadoop.metrics2.filter.TestPatternFilter
Running org.apache.hadoop.conf.TestConfigurationSubclass
Tests run: 3, Failures: 0, Errors: 0, Skipped: 0, Time elapsed: 0.46 sec - in org.apache.hadoop.conf.TestConfigurationSubclass
Running org.apache.hadoop.conf.TestGetInstances
Tests run: 1, Failures: 0, Errors: 0, Skipped: 0, Time elapsed: 0.377 sec - in org.apache.hadoop.conf.TestGetInstances
Running org.apache.hadoop.conf.TestConfigurationDeprecation
Tests run: 9, Failures: 0, Errors: 0, Skipped: 0, Time elapsed: 10.356 sec - in org.apache.hadoop.conf.TestConfigurationDeprecation
Running org.apache.hadoop.conf.TestDeprecatedKeys
Tests run: 3, Failures: 0, Errors: 0, Skipped: 0, Time elapsed: 0.675 sec - in org.apache.hadoop.conf.TestDeprecatedKeys
Running org.apache.hadoop.conf.TestConfiguration
Tests run: 62, Failures: 0, Errors: 0, Skipped: 0, Time elapsed: 4.734 sec - in org.apache.hadoop.conf.TestConfiguration
Running org.apache.hadoop.conf.TestReconfiguration
Tests run: 5, Failures: 0, Errors: 0, Skipped: 0, Time elapsed: 2.507 sec - in org.apache.hadoop.conf.TestReconfiguration
Running org.apache.hadoop.conf.TestConfServlet
Tests run: 3, Failures: 0, Errors: 0, Skipped: 0, Time elapsed: 0.757 sec - in org.apache.hadoop.conf.TestConfServlet
Running org.apache.hadoop.test.TestJUnitSetup
Tests run: 1, Failures: 0, Errors: 0, Skipped: 0, Time elapsed: 0.187 sec - in org.apache.hadoop.test.TestJUnitSetup
Running org.apache.hadoop.test.TestMultithreadedTestUtil
Tests run: 4, Failures: 0, Errors: 0, Skipped: 0, Time elapsed: 3.197 sec - in org.apache.hadoop.test.TestMultithreadedTestUtil
Running org.apache.hadoop.test.TestTimedOutTestsListener
Tests run: 1, Failures: 0, Errors: 0, Skipped: 0, Time elapsed: 0.254 sec - in org.apache.hadoop.test.TestTimedOutTestsListener
Running org.apache.hadoop.metrics.TestMetricsServlet
Tests run: 3, Failures: 0, Errors: 0, Skipped: 0, Time elapsed: 0.101 sec - in org.apache.hadoop.metrics.TestMetricsServlet
Running org.apache.hadoop.metrics.spi.TestOutputRecord
Tests run: 1, Failures: 0, Errors: 0, Skipped: 0, Time elapsed: 0.056 sec - in org.apache.hadoop.metrics.spi.TestOutputRecord
Running org.apache.hadoop.metrics.ganglia.TestGangliaContext
Tests run: 5, Failures: 0, Errors: 0, Skipped: 0, Time elapsed: 0.213 sec - in org.apache.hadoop.metrics.ganglia.TestGangliaContext
Running org.apache.hadoop.net.TestNetUtils
Tests run: 40, Failures: 0, Errors: 0, Skipped: 0, Time elapsed: 3.794 sec - in org.apache.hadoop.net.TestNetUtils
Running org.apache.hadoop.net.TestDNS
Tests run: 12, Failures: 0, Errors: 0, Skipped: 0, Time elapsed: 0.494 sec - in org.apache.hadoop.net.TestDNS
Running org.apache.hadoop.net.TestSocketIOWithTimeout
Tests run: 1, Failures: 0, Errors: 0, Skipped: 0, Time elapsed: 5.432 sec - in org.apache.hadoop.net.TestSocketIOWithTimeout
Running org.apache.hadoop.net.TestNetworkTopologyWithNodeGroup
Tests run: 8, Failures: 0, Errors: 0, Skipped: 0, Time elapsed: 0.207 sec - in org.apache.hadoop.net.TestNetworkTopologyWithNodeGroup
Running org.apache.hadoop.net.TestClusterTopology
Tests run: 2, Failures: 0, Errors: 0, Skipped: 0, Time elapsed: 0.272 sec - in org.apache.hadoop.net.TestClusterTopology
Running org.apache.hadoop.net.TestScriptBasedMappingWithDependency
Tests run: 4, Failures: 0, Errors: 0, Skipped: 0, Time elapsed: 0.92 sec - in org.apache.hadoop.net.TestScriptBasedMappingWithDependency
Running org.apache.hadoop.net.TestTableMapping
Tests run: 6, Failures: 0, Errors: 0, Skipped: 0, Time elapsed: 0.664 sec - in org.apache.hadoop.net.TestTableMapping
Running org.apache.hadoop.net.TestScriptBasedMapping
Tests run: 4, Failures: 0, Errors: 0, Skipped: 0, Time elapsed: 0.634 sec - in org.apache.hadoop.net.TestScriptBasedMapping
Running org.apache.hadoop.net.unix.TestDomainSocketWatcher
Tests run: 6, Failures: 0, Errors: 0, Skipped: 0, Time elapsed: 0.662 sec - in org.apache.hadoop.net.unix.TestDomainSocketWatcher
Running org.apache.hadoop.net.unix.TestDomainSocket
Tests run: 17, Failures: 0, Errors: 0, Skipped: 0, Time elapsed: 2.966 sec - in org.apache.hadoop.net.unix.TestDomainSocket
Running org.apache.hadoop.net.TestSwitchMapping
Tests run: 5, Failures: 0, Errors: 0, Skipped: 0, Time elapsed: 0.456 sec - in org.apache.hadoop.net.TestSwitchMapping
Running org.apache.hadoop.net.TestStaticMapping
Tests run: 8, Failures: 0, Errors: 0, Skipped: 0, Time elapsed: 0.954 sec - in org.apache.hadoop.net.TestStaticMapping
Running org.apache.hadoop.cli.TestCLI
Tests run: 1, Failures: 0, Errors: 0, Skipped: 0, Time elapsed: 0.715 sec - in org.apache.hadoop.cli.TestCLI
Running org.apache.hadoop.io.TestSortedMapWritable
Tests run: 4, Failures: 0, Errors: 0, Skipped: 0, Time elapsed: 0.228 sec - in org.apache.hadoop.io.TestSortedMapWritable
Running org.apache.hadoop.io.TestIOUtils
Tests run: 12, Failures: 0, Errors: 0, Skipped: 0, Time elapsed: 0.516 sec - in org.apache.hadoop.io.TestIOUtils
Running org.apache.hadoop.io.TestSequenceFile
Tests run: 8, Failures: 0, Errors: 0, Skipped: 0, Time elapsed: 10.309 sec - in org.apache.hadoop.io.TestSequenceFile
Running org.apache.hadoop.io.TestEnumSetWritable
Tests run: 6, Failures: 0, Errors: 0, Skipped: 0, Time elapsed: 0.558 sec - in org.apache.hadoop.io.TestEnumSetWritable
Running org.apache.hadoop.io.TestWritableName
Tests run: 4, Failures: 0, Errors: 0, Skipped: 0, Time elapsed: 0.188 sec - in org.apache.hadoop.io.TestWritableName
Running org.apache.hadoop.io.TestBoundedByteArrayOutputStream
Tests run: 2, Failures: 0, Errors: 0, Skipped: 0, Time elapsed: 0.072 sec - in org.apache.hadoop.io.TestBoundedByteArrayOutputStream
Running org.apache.hadoop.io.TestSequenceFileAppend
Tests run: 4, Failures: 0, Errors: 0, Skipped: 0, Time elapsed: 1.025 sec - in org.apache.hadoop.io.TestSequenceFileAppend
Running org.apache.hadoop.io.TestBytesWritable
Tests run: 6, Failures: 0, Errors: 0, Skipped: 0, Time elapsed: 0.215 sec - in org.apache.hadoop.io.TestBytesWritable
Running org.apache.hadoop.io.TestSequenceFileSerialization
Tests run: 1, Failures: 0, Errors: 0, Skipped: 0, Time elapsed: 0.921 sec - in org.apache.hadoop.io.TestSequenceFileSerialization
Running org.apache.hadoop.io.TestDataByteBuffers
Tests run: 5, Failures: 0, Errors: 0, Skipped: 0, Time elapsed: 0.418 sec - in org.apache.hadoop.io.TestDataByteBuffers
Running org.apache.hadoop.io.file.tfile.TestTFileComparators
Tests run: 3, Failures: 0, Errors: 0, Skipped: 0, Time elapsed: 0.87 sec - in org.apache.hadoop.io.file.tfile.TestTFileComparators
Running org.apache.hadoop.io.file.tfile.TestTFileSeek
Tests run: 1, Failures: 0, Errors: 0, Skipped: 0, Time elapsed: 3.177 sec - in org.apache.hadoop.io.file.tfile.TestTFileSeek
Running org.apache.hadoop.io.file.tfile.TestTFileLzoCodecsByteArrays
Tests run: 25, Failures: 0, Errors: 0, Skipped: 0, Time elapsed: 0.392 sec - in org.apache.hadoop.io.file.tfile.TestTFileLzoCodecsByteArrays
Running org.apache.hadoop.io.file.tfile.TestTFileLzoCodecsStreams
Tests run: 19, Failures: 0, Errors: 0, Skipped: 0, Time elapsed: 0.358 sec - in org.apache.hadoop.io.file.tfile.TestTFileLzoCodecsStreams
Running org.apache.hadoop.io.file.tfile.TestTFileUnsortedByteArrays
Tests run: 4, Failures: 0, Errors: 0, Skipped: 0, Time elapsed: 1.003 sec - in org.apache.hadoop.io.file.tfile.TestTFileUnsortedByteArrays
Running org.apache.hadoop.io.file.tfile.TestTFileStreams
Tests run: 19, Failures: 0, Errors: 0, Skipped: 0, Time elapsed: 1.937 sec - in org.apache.hadoop.io.file.tfile.TestTFileStreams
Running org.apache.hadoop.io.file.tfile.TestTFile
Tests run: 3, Failures: 0, Errors: 0, Skipped: 0, Time elapsed: 1.448 sec - in org.apache.hadoop.io.file.tfile.TestTFile
Running org.apache.hadoop.io.file.tfile.TestTFileNoneCodecsJClassComparatorByteArrays
Tests run: 25, Failures: 0, Errors: 0, Skipped: 0, Time elapsed: 1.577 sec - in org.apache.hadoop.io.file.tfile.TestTFileNoneCodecsJClassComparatorByteArrays
Running org.apache.hadoop.io.file.tfile.TestTFileJClassComparatorByteArrays
Tests run: 25, Failures: 0, Errors: 0, Skipped: 0, Time elapsed: 2.765 sec - in org.apache.hadoop.io.file.tfile.TestTFileJClassComparatorByteArrays
Running org.apache.hadoop.io.file.tfile.TestTFileNoneCodecsStreams
Tests run: 19, Failures: 0, Errors: 0, Skipped: 0, Time elapsed: 1.903 sec - in org.apache.hadoop.io.file.tfile.TestTFileNoneCodecsStreams
Running org.apache.hadoop.io.file.tfile.TestTFileSplit
Tests run: 1, Failures: 0, Errors: 0, Skipped: 0, Time elapsed: 4.67 sec - in org.apache.hadoop.io.file.tfile.TestTFileSplit
Running org.apache.hadoop.io.file.tfile.TestTFileComparator2
Tests run: 1, Failures: 0, Errors: 0, Skipped: 0, Time elapsed: 1.743 sec - in org.apache.hadoop.io.file.tfile.TestTFileComparator2
Running org.apache.hadoop.io.file.tfile.TestTFileNoneCodecsByteArrays
Tests run: 25, Failures: 0, Errors: 0, Skipped: 0, Time elapsed: 1.576 sec - in org.apache.hadoop.io.file.tfile.TestTFileNoneCodecsByteArrays
Running org.apache.hadoop.io.file.tfile.TestTFileByteArrays
Tests run: 25, Failures: 0, Errors: 0, Skipped: 0, Time elapsed: 2.908 sec - in org.apache.hadoop.io.file.tfile.TestTFileByteArrays
Running org.apache.hadoop.io.file.tfile.TestTFileSeqFileComparison
Tests run: 1, Failures: 0, Errors: 0, Skipped: 0, Time elapsed: 4.246 sec - in org.apache.hadoop.io.file.tfile.TestTFileSeqFileComparison
Running org.apache.hadoop.io.file.tfile.TestVLong
Tests run: 9, Failures: 0, Errors: 0, Skipped: 0, Time elapsed: 1.863 sec - in org.apache.hadoop.io.file.tfile.TestVLong
Running org.apache.hadoop.io.TestTextNonUTF8
Tests run: 1, Failures: 0, Errors: 0, Skipped: 0, Time elapsed: 0.175 sec - in org.apache.hadoop.io.TestTextNonUTF8
Running org.apache.hadoop.io.TestArrayWritable
Tests run: 4, Failures: 0, Errors: 0, Skipped: 0, Time elapsed: 0.207 sec - in org.apache.hadoop.io.TestArrayWritable
Running org.apache.hadoop.io.erasurecode.rawcoder.TestXORRawCoder
Tests run: 6, Failures: 0, Errors: 0, Skipped: 0, Time elapsed: 0.213 sec - in org.apache.hadoop.io.erasurecode.rawcoder.TestXORRawCoder
Running org.apache.hadoop.io.erasurecode.rawcoder.TestRSRawCoder
Tests run: 15, Failures: 0, Errors: 0, Skipped: 0, Time elapsed: 0.292 sec - in org.apache.hadoop.io.erasurecode.rawcoder.TestRSRawCoder
Running org.apache.hadoop.io.erasurecode.TestECSchema
Tests run: 1, Failures: 0, Errors: 0, Skipped: 0, Time elapsed: 0.074 sec - in org.apache.hadoop.io.erasurecode.TestECSchema
Running org.apache.hadoop.io.erasurecode.coder.TestXORCoder
Tests run: 2, Failures: 0, Errors: 0, Skipped: 0, Time elapsed: 0.22 sec - in org.apache.hadoop.io.erasurecode.coder.TestXORCoder
Running org.apache.hadoop.io.erasurecode.coder.TestRSErasureCoder
Tests run: 10, Failures: 0, Errors: 0, Skipped: 0, Time elapsed: 0.88 sec - in org.apache.hadoop.io.erasurecode.coder.TestRSErasureCoder
Running org.apache.hadoop.io.TestMapWritable
Tests run: 5, Failures: 0, Errors: 0, Skipped: 0, Time elapsed: 0.203 sec - in org.apache.hadoop.io.TestMapWritable
Running org.apache.hadoop.io.TestText
Tests run: 18, Failures: 0, Errors: 0, Skipped: 0, Time elapsed: 0.786 sec - in org.apache.hadoop.io.TestText
Running org.apache.hadoop.io.TestBooleanWritable
Tests run: 2, Failures: 0, Errors: 0, Skipped: 0, Time elapsed: 0.207 sec - in org.apache.hadoop.io.TestBooleanWritable
Running org.apache.hadoop.io.compress.zlib.TestZlibCompressorDecompressor
Tests run: 9, Failures: 0, Errors: 0, Skipped: 0, Time elapsed: 1.152 sec - in org.apache.hadoop.io.compress.zlib.TestZlibCompressorDecompressor
Running org.apache.hadoop.io.compress.TestCompressionStreamReuse
Tests run: 3, Failures: 0, Errors: 0, Skipped: 0, Time elapsed: 4.59 sec - in org.apache.hadoop.io.compress.TestCompressionStreamReuse
Running org.apache.hadoop.io.compress.lz4.TestLz4CompressorDecompressor
Tests run: 13, Failures: 0, Errors: 0, Skipped: 0, Time elapsed: 0.383 sec - in org.apache.hadoop.io.compress.lz4.TestLz4CompressorDecompressor
Running org.apache.hadoop.io.compress.TestCodecFactory
Tests run: 1, Failures: 0, Errors: 0, Skipped: 0, Time elapsed: 0.627 sec - in org.apache.hadoop.io.compress.TestCodecFactory
Running org.apache.hadoop.io.compress.TestCodec
Tests run: 25, Failures: 0, Errors: 0, Skipped: 0, Time elapsed: 153.125 sec - in org.apache.hadoop.io.compress.TestCodec
Running org.apache.hadoop.io.compress.bzip2.TestBzip2CompressorDecompressor
Tests run: 2, Failures: 0, Errors: 0, Skipped: 2, Time elapsed: 0.439 sec - in org.apache.hadoop.io.compress.bzip2.TestBzip2CompressorDecompressor
Running org.apache.hadoop.io.compress.TestCompressorDecompressor
Tests run: 2, Failures: 0, Errors: 0, Skipped: 0, Time elapsed: 0.712 sec - in org.apache.hadoop.io.compress.TestCompressorDecompressor
Running org.apache.hadoop.io.compress.TestCodecPool
Tests run: 6, Failures: 0, Errors: 0, Skipped: 0, Time elapsed: 0.466 sec - in org.apache.hadoop.io.compress.TestCodecPool
Running org.apache.hadoop.io.compress.snappy.TestSnappyCompressorDecompressor
Tests run: 14, Failures: 0, Errors: 0, Skipped: 0, Time elapsed: 0.453 sec - in org.apache.hadoop.io.compress.snappy.TestSnappyCompressorDecompressor
Running org.apache.hadoop.io.compress.TestBlockDecompressorStream
Tests run: 2, Failures: 0, Errors: 0, Skipped: 0, Time elapsed: 0.09 sec - in org.apache.hadoop.io.compress.TestBlockDecompressorStream
Running org.apache.hadoop.io.compress.TestCompressorStream
Tests run: 1, Failures: 0, Errors: 0, Skipped: 0, Time elapsed: 0.093 sec - in org.apache.hadoop.io.compress.TestCompressorStream
Running org.apache.hadoop.io.TestMD5Hash
Tests run: 2, Failures: 0, Errors: 0, Skipped: 0, Time elapsed: 0.227 sec - in org.apache.hadoop.io.TestMD5Hash
Running org.apache.hadoop.io.TestSecureIOUtils
Tests run: 4, Failures: 0, Errors: 0, Skipped: 0, Time elapsed: 0.867 sec - in org.apache.hadoop.io.TestSecureIOUtils
Running org.apache.hadoop.io.TestMapFile
Tests run: 21, Failures: 0, Errors: 0, Skipped: 0, Time elapsed: 1.606 sec - in org.apache.hadoop.io.TestMapFile
Running org.apache.hadoop.io.TestGenericWritable
Tests run: 5, Failures: 0, Errors: 0, Skipped: 0, Time elapsed: 0.564 sec - in org.apache.hadoop.io.TestGenericWritable
Running org.apache.hadoop.io.nativeio.TestNativeIO
Tests run: 20, Failures: 0, Errors: 0, Skipped: 0, Time elapsed: 7.162 sec - in org.apache.hadoop.io.nativeio.TestNativeIO
Running org.apache.hadoop.io.nativeio.TestSharedFileDescriptorFactory
Tests run: 3, Failures: 0, Errors: 0, Skipped: 0, Time elapsed: 0.406 sec - in org.apache.hadoop.io.nativeio.TestSharedFileDescriptorFactory
Running org.apache.hadoop.io.TestDefaultStringifier
Tests run: 4, Failures: 0, Errors: 0, Skipped: 0, Time elapsed: 0.432 sec - in org.apache.hadoop.io.TestDefaultStringifier
Running org.apache.hadoop.io.TestArrayPrimitiveWritable
Tests run: 3, Failures: 0, Errors: 0, Skipped: 0, Time elapsed: 0.194 sec - in org.apache.hadoop.io.TestArrayPrimitiveWritable
Running org.apache.hadoop.io.TestUTF8
Tests run: 8, Failures: 0, Errors: 0, Skipped: 0, Time elapsed: 0.902 sec - in org.apache.hadoop.io.TestUTF8
Running org.apache.hadoop.io.TestBloomMapFile
Tests run: 7, Failures: 0, Errors: 0, Skipped: 0, Time elapsed: 1.925 sec - in org.apache.hadoop.io.TestBloomMapFile
Running org.apache.hadoop.io.retry.TestRetryProxy
Tests run: 11, Failures: 0, Errors: 0, Skipped: 0, Time elapsed: 1.225 sec - in org.apache.hadoop.io.retry.TestRetryProxy
Running org.apache.hadoop.io.retry.TestDefaultRetryPolicy
Tests run: 3, Failures: 0, Errors: 0, Skipped: 0, Time elapsed: 0.552 sec - in org.apache.hadoop.io.retry.TestDefaultRetryPolicy
Running org.apache.hadoop.io.retry.TestFailoverProxy
Tests run: 9, Failures: 0, Errors: 0, Skipped: 0, Time elapsed: 11.295 sec - in org.apache.hadoop.io.retry.TestFailoverProxy
Running org.apache.hadoop.io.TestVersionedWritable
Tests run: 3, Failures: 0, Errors: 0, Skipped: 0, Time elapsed: 0.175 sec - in org.apache.hadoop.io.TestVersionedWritable
Running org.apache.hadoop.io.TestObjectWritableProtos
Tests run: 3, Failures: 0, Errors: 0, Skipped: 0, Time elapsed: 0.351 sec - in org.apache.hadoop.io.TestObjectWritableProtos
Running org.apache.hadoop.io.TestSequenceFileSync
Tests run: 1, Failures: 0, Errors: 0, Skipped: 0, Time elapsed: 1.097 sec - in org.apache.hadoop.io.TestSequenceFileSync
Running org.apache.hadoop.io.serializer.TestSerializationFactory
Tests run: 5, Failures: 0, Errors: 0, Skipped: 0, Time elapsed: 0.607 sec - in org.apache.hadoop.io.serializer.TestSerializationFactory
Running org.apache.hadoop.io.serializer.avro.TestAvroSerialization
Tests run: 5, Failures: 0, Errors: 0, Skipped: 0, Time elapsed: 0.721 sec - in org.apache.hadoop.io.serializer.avro.TestAvroSerialization
Running org.apache.hadoop.io.serializer.TestWritableSerialization
Tests run: 3, Failures: 0, Errors: 0, Skipped: 0, Time elapsed: 0.455 sec - in org.apache.hadoop.io.serializer.TestWritableSerialization
Running org.apache.hadoop.io.TestWritable
Tests run: 7, Failures: 0, Errors: 0, Skipped: 0, Time elapsed: 0.587 sec - in org.apache.hadoop.io.TestWritable
Running org.apache.hadoop.io.TestWritableUtils
Tests run: 1, Failures: 0, Errors: 0, Skipped: 0, Time elapsed: 0.187 sec - in org.apache.hadoop.io.TestWritableUtils
Running org.apache.hadoop.io.TestArrayFile
Tests run: 3, Failures: 0, Errors: 0, Skipped: 0, Time elapsed: 3.347 sec - in org.apache.hadoop.io.TestArrayFile
Running org.apache.hadoop.io.TestSetFile
Tests run: 2, Failures: 0, Errors: 0, Skipped: 0, Time elapsed: 2.306 sec - in org.apache.hadoop.io.TestSetFile

Results :

Tests in error: 
  TestZKFailoverController.testGracefulFailover:448->Object.wait:-2 ยป  test time...

Tests run: 3180, Failures: 0, Errors: 1, Skipped: 86

[INFO] ------------------------------------------------------------------------
[INFO] Reactor Summary:
[INFO] 
[INFO] Apache Hadoop Annotations ......................... SUCCESS [  8.653 s]
[INFO] Apache Hadoop MiniKDC ............................. SUCCESS [ 22.982 s]
[INFO] Apache Hadoop Auth ................................ SUCCESS [05:33 min]
[INFO] Apache Hadoop Auth Examples ....................... SUCCESS [  3.950 s]
[INFO] Apache Hadoop Common .............................. FAILURE [23:54 min]
[INFO] Apache Hadoop NFS ................................. SKIPPED
[INFO] Apache Hadoop KMS ................................. SKIPPED
[INFO] Apache Hadoop Common Project ...................... SKIPPED
[INFO] ------------------------------------------------------------------------
[INFO] BUILD FAILURE
[INFO] ------------------------------------------------------------------------
[INFO] Total time: 30:04 min
[INFO] Finished at: 2015-10-21T23:13:56+00:00
[INFO] Final Memory: 81M/991M
[INFO] ------------------------------------------------------------------------
[ERROR] Failed to execute goal org.apache.maven.plugins:maven-surefire-plugin:2.17:test (default-test)
on project hadoop-common: There are test failures.
[ERROR] 
[ERROR] Please refer to <https://builds.apache.org/job/Hadoop-Common-trunk/ws/hadoop-common-project/hadoop-common/target/surefire-reports>
for the individual test results.
[ERROR] -> [Help 1]
[ERROR] 
[ERROR] To see the full stack trace of the errors, re-run Maven with the -e switch.
[ERROR] Re-run Maven using the -X switch to enable full debug logging.
[ERROR] 
[ERROR] For more information about the errors and possible solutions, please read the following
articles:
[ERROR] [Help 1] http://cwiki.apache.org/confluence/display/MAVEN/MojoFailureException
[ERROR] 
[ERROR] After correcting the problems, you can resume the build with the command
[ERROR]   mvn <goals> -rf :hadoop-common
result: 1

################
# mvn -eaf test -Pclover -DcloverLicenseLocation=/home/jenkins/tools/clover/latest/lib/clover.license
################
Build step 'Execute shell' marked build as failure
Archiving artifacts
Recording test results

Mime
View raw message