hadoop-common-dev mailing list archives

Site index · List index
Message view « Date » · « Thread »
Top « Date » · « Thread »
From Apache Jenkins Server <jenk...@builds.apache.org>
Subject Build failed in Jenkins: Hadoop-common-trunk-Java8 #627
Date Fri, 30 Oct 2015 15:54:40 GMT
See <https://builds.apache.org/job/Hadoop-common-trunk-Java8/627/changes>

Changes:

[kihwal] HDFS-4937. ReplicationMonitor can infinite-loop in

[kihwal] fix CHANGES.txt

[jlowe] Creating 2.6.3 entries in CHANGES.txt files.

[jlowe] Update CHANGES.txt to reflect commit of MR-6273 to branch-2.6

------------------------------------------
[...truncated 9662 lines...]
[WARNING] ^
[WARNING] <https://builds.apache.org/job/Hadoop-common-trunk-Java8/ws/hadoop-common-project/hadoop-nfs/src/main/java/org/apache/hadoop/nfs/nfs3/Nfs3Interface.java>:33:
warning: no @param for info
[WARNING] public NFS3Response getattr(XDR xdr, RpcInfo info);
[WARNING] ^
[WARNING] <https://builds.apache.org/job/Hadoop-common-trunk-Java8/ws/hadoop-common-project/hadoop-nfs/src/main/java/org/apache/hadoop/nfs/nfs3/Nfs3Interface.java>:33:
warning: no @return
[WARNING] public NFS3Response getattr(XDR xdr, RpcInfo info);
[WARNING] ^
[WARNING] <https://builds.apache.org/job/Hadoop-common-trunk-Java8/ws/hadoop-common-project/hadoop-nfs/src/main/java/org/apache/hadoop/nfs/nfs3/Nfs3Interface.java>:36:
warning: no @param for xdr
[WARNING] public NFS3Response setattr(XDR xdr, RpcInfo info);
[WARNING] ^
[WARNING] <https://builds.apache.org/job/Hadoop-common-trunk-Java8/ws/hadoop-common-project/hadoop-nfs/src/main/java/org/apache/hadoop/nfs/nfs3/Nfs3Interface.java>:36:
warning: no @param for info
[WARNING] public NFS3Response setattr(XDR xdr, RpcInfo info);
[WARNING] ^
[WARNING] <https://builds.apache.org/job/Hadoop-common-trunk-Java8/ws/hadoop-common-project/hadoop-nfs/src/main/java/org/apache/hadoop/nfs/nfs3/Nfs3Interface.java>:36:
warning: no @return
[WARNING] public NFS3Response setattr(XDR xdr, RpcInfo info);
[WARNING] ^
[WARNING] <https://builds.apache.org/job/Hadoop-common-trunk-Java8/ws/hadoop-common-project/hadoop-nfs/src/main/java/org/apache/hadoop/nfs/nfs3/Nfs3Interface.java>:39:
warning: no @param for xdr
[WARNING] public NFS3Response lookup(XDR xdr, RpcInfo info);
[WARNING] ^
[WARNING] <https://builds.apache.org/job/Hadoop-common-trunk-Java8/ws/hadoop-common-project/hadoop-nfs/src/main/java/org/apache/hadoop/nfs/nfs3/Nfs3Interface.java>:39:
warning: no @param for info
[WARNING] public NFS3Response lookup(XDR xdr, RpcInfo info);
[WARNING] ^
[WARNING] <https://builds.apache.org/job/Hadoop-common-trunk-Java8/ws/hadoop-common-project/hadoop-nfs/src/main/java/org/apache/hadoop/nfs/nfs3/Nfs3Interface.java>:39:
warning: no @return
[WARNING] public NFS3Response lookup(XDR xdr, RpcInfo info);
[WARNING] ^
[WARNING] <https://builds.apache.org/job/Hadoop-common-trunk-Java8/ws/hadoop-common-project/hadoop-nfs/src/main/java/org/apache/hadoop/nfs/nfs3/Nfs3Interface.java>:42:
warning: no @param for xdr
[WARNING] public NFS3Response access(XDR xdr, RpcInfo info);
[WARNING] ^
[WARNING] <https://builds.apache.org/job/Hadoop-common-trunk-Java8/ws/hadoop-common-project/hadoop-nfs/src/main/java/org/apache/hadoop/nfs/nfs3/Nfs3Interface.java>:42:
warning: no @param for info
[WARNING] public NFS3Response access(XDR xdr, RpcInfo info);
[WARNING] ^
[WARNING] <https://builds.apache.org/job/Hadoop-common-trunk-Java8/ws/hadoop-common-project/hadoop-nfs/src/main/java/org/apache/hadoop/nfs/nfs3/Nfs3Interface.java>:42:
warning: no @return
[WARNING] public NFS3Response access(XDR xdr, RpcInfo info);
[WARNING] ^
[WARNING] <https://builds.apache.org/job/Hadoop-common-trunk-Java8/ws/hadoop-common-project/hadoop-nfs/src/main/java/org/apache/hadoop/nfs/nfs3/Nfs3Interface.java>:45:
warning: no @param for xdr
[WARNING] public NFS3Response readlink(XDR xdr, RpcInfo info);
[WARNING] ^
[WARNING] <https://builds.apache.org/job/Hadoop-common-trunk-Java8/ws/hadoop-common-project/hadoop-nfs/src/main/java/org/apache/hadoop/nfs/nfs3/Nfs3Interface.java>:45:
warning: no @param for info
[WARNING] public NFS3Response readlink(XDR xdr, RpcInfo info);
[WARNING] ^
[WARNING] <https://builds.apache.org/job/Hadoop-common-trunk-Java8/ws/hadoop-common-project/hadoop-nfs/src/main/java/org/apache/hadoop/nfs/nfs3/Nfs3Interface.java>:45:
warning: no @return
[WARNING] public NFS3Response readlink(XDR xdr, RpcInfo info);
[WARNING] ^
[INFO] Building jar: <https://builds.apache.org/job/Hadoop-common-trunk-Java8/ws/hadoop-common-project/hadoop-nfs/target/hadoop-nfs-3.0.0-SNAPSHOT-javadoc.jar>
[INFO] 
[INFO] --- maven-assembly-plugin:2.4:single (dist) @ hadoop-nfs ---
[INFO] Reading assembly descriptor: ../../hadoop-assemblies/src/main/resources/assemblies/hadoop-nfs-dist.xml
[WARNING] The following patterns were never triggered in this artifact exclusion filter:
o  'org.apache.hadoop:hadoop-common'
o  'org.apache.hadoop:hadoop-hdfs'
o  'org.hsqldb:hsqldb'

[INFO] Copying files to <https://builds.apache.org/job/Hadoop-common-trunk-Java8/ws/hadoop-common-project/hadoop-nfs/target/hadoop-nfs-3.0.0-SNAPSHOT>
[INFO]                                                                         
[INFO] ------------------------------------------------------------------------
[INFO] Building Apache Hadoop KMS 3.0.0-SNAPSHOT
[INFO] ------------------------------------------------------------------------
[INFO] 
[INFO] --- maven-clean-plugin:2.5:clean (default-clean) @ hadoop-kms ---
[INFO] Deleting <https://builds.apache.org/job/Hadoop-common-trunk-Java8/ws/hadoop-common-project/hadoop-kms/target>
[INFO] 
[INFO] --- maven-antrun-plugin:1.7:run (create-testdirs) @ hadoop-kms ---
[INFO] Executing tasks

main:
    [mkdir] Created dir: <https://builds.apache.org/job/Hadoop-common-trunk-Java8/ws/hadoop-common-project/hadoop-kms/target/test-dir>
[INFO] Executed tasks
[INFO] 
[INFO] --- maven-resources-plugin:2.6:resources (default-resources) @ hadoop-kms ---
[INFO] Using 'UTF-8' encoding to copy filtered resources.
[INFO] skip non existing resourceDirectory <https://builds.apache.org/job/Hadoop-common-trunk-Java8/ws/hadoop-common-project/hadoop-kms/src/main/resources>
[INFO] 
[INFO] --- maven-compiler-plugin:3.1:compile (default-compile) @ hadoop-kms ---
[INFO] Changes detected - recompiling the module!
[INFO] Compiling 14 source files to <https://builds.apache.org/job/Hadoop-common-trunk-Java8/ws/hadoop-common-project/hadoop-kms/target/classes>
[INFO] 
[INFO] --- maven-antrun-plugin:1.7:run (create-web-xmls) @ hadoop-kms ---
[INFO] Executing tasks

main:
    [mkdir] Created dir: <https://builds.apache.org/job/Hadoop-common-trunk-Java8/ws/hadoop-common-project/hadoop-kms/target/test-classes/kms-webapp>
     [copy] Copying 1 file to <https://builds.apache.org/job/Hadoop-common-trunk-Java8/ws/hadoop-common-project/hadoop-kms/target/test-classes/kms-webapp>
[INFO] Executed tasks
[INFO] 
[INFO] --- maven-resources-plugin:2.6:testResources (default-testResources) @ hadoop-kms ---
[INFO] Using 'UTF-8' encoding to copy filtered resources.
[INFO] Copying 3 resources
[INFO] 
[INFO] --- maven-compiler-plugin:3.1:testCompile (default-testCompile) @ hadoop-kms ---
[INFO] Changes detected - recompiling the module!
[INFO] Compiling 6 source files to <https://builds.apache.org/job/Hadoop-common-trunk-Java8/ws/hadoop-common-project/hadoop-kms/target/test-classes>
[INFO] 
[INFO] --- maven-surefire-plugin:2.17:test (default-test) @ hadoop-kms ---
[WARNING] The parameter forkMode is deprecated since version 2.14. Use forkCount and reuseForks
instead.
[INFO] Surefire report directory: <https://builds.apache.org/job/Hadoop-common-trunk-Java8/ws/hadoop-common-project/hadoop-kms/target/surefire-reports>

-------------------------------------------------------
 T E S T S
-------------------------------------------------------

-------------------------------------------------------
 T E S T S
-------------------------------------------------------
Java HotSpot(TM) 64-Bit Server VM warning: ignoring option MaxPermSize=768m; support was removed
in 8.0
Running org.apache.hadoop.crypto.key.kms.server.TestKMSAudit
Tests run: 2, Failures: 0, Errors: 0, Skipped: 0, Time elapsed: 6.539 sec - in org.apache.hadoop.crypto.key.kms.server.TestKMSAudit
Java HotSpot(TM) 64-Bit Server VM warning: ignoring option MaxPermSize=768m; support was removed
in 8.0
Running org.apache.hadoop.crypto.key.kms.server.TestKMSACLs
Tests run: 3, Failures: 0, Errors: 0, Skipped: 0, Time elapsed: 0.513 sec - in org.apache.hadoop.crypto.key.kms.server.TestKMSACLs
Java HotSpot(TM) 64-Bit Server VM warning: ignoring option MaxPermSize=768m; support was removed
in 8.0
Running org.apache.hadoop.crypto.key.kms.server.TestKMS
Tests run: 21, Failures: 0, Errors: 0, Skipped: 0, Time elapsed: 61.379 sec - in org.apache.hadoop.crypto.key.kms.server.TestKMS
Java HotSpot(TM) 64-Bit Server VM warning: ignoring option MaxPermSize=768m; support was removed
in 8.0
Running org.apache.hadoop.crypto.key.kms.server.TestKMSWithZK
Tests run: 1, Failures: 0, Errors: 0, Skipped: 0, Time elapsed: 5.715 sec - in org.apache.hadoop.crypto.key.kms.server.TestKMSWithZK
Java HotSpot(TM) 64-Bit Server VM warning: ignoring option MaxPermSize=768m; support was removed
in 8.0
Running org.apache.hadoop.crypto.key.kms.server.TestKeyAuthorizationKeyProvider
Tests run: 3, Failures: 0, Errors: 0, Skipped: 0, Time elapsed: 1.093 sec - in org.apache.hadoop.crypto.key.kms.server.TestKeyAuthorizationKeyProvider

Results :

Tests run: 30, Failures: 0, Errors: 0, Skipped: 0

[INFO] 
[INFO] --- maven-war-plugin:2.4:war (default-war) @ hadoop-kms ---
[INFO] Packaging webapp
[INFO] Assembling webapp [hadoop-kms] in [<https://builds.apache.org/job/Hadoop-common-trunk-Java8/ws/hadoop-common-project/hadoop-kms/target/kms]>
[INFO] Processing war project
[INFO] Copying webapp resources [<https://builds.apache.org/job/Hadoop-common-trunk-Java8/ws/hadoop-common-project/hadoop-kms/src/main/webapp]>
[INFO] Building jar: <https://builds.apache.org/job/Hadoop-common-trunk-Java8/ws/hadoop-common-project/hadoop-kms/target/kms/WEB-INF/lib/hadoop-kms-3.0.0-SNAPSHOT.jar>
[INFO] Webapp assembled in [77 msecs]
[INFO] Building war: <https://builds.apache.org/job/Hadoop-common-trunk-Java8/ws/hadoop-common-project/hadoop-kms/target/kms.war>
[INFO] 
[INFO] --- maven-site-plugin:3.4:site (docs) @ hadoop-kms ---
[INFO] configuring report plugin org.apache.maven.plugins:maven-dependency-plugin:2.8
[INFO] preparing 'analyze-report' report requires 'test-compile' forked phase execution
[INFO] 
[INFO] >>> maven-dependency-plugin:2.8:analyze-report @ hadoop-kms >>>
[INFO] 
[INFO] --- maven-antrun-plugin:1.7:run (create-testdirs) @ hadoop-kms ---
[INFO] Executing tasks

main:
[INFO] Executed tasks
[INFO] 
[INFO] --- maven-resources-plugin:2.6:resources (default-resources) @ hadoop-kms ---
[INFO] Using 'UTF-8' encoding to copy filtered resources.
[INFO] skip non existing resourceDirectory <https://builds.apache.org/job/Hadoop-common-trunk-Java8/ws/hadoop-common-project/hadoop-kms/src/main/resources>
[INFO] 
[INFO] --- maven-compiler-plugin:3.1:compile (default-compile) @ hadoop-kms ---
[INFO] Nothing to compile - all classes are up to date
[INFO] 
[INFO] --- maven-antrun-plugin:1.7:run (create-web-xmls) @ hadoop-kms ---
[INFO] Executing tasks

main:
[INFO] Executed tasks
[INFO] 
[INFO] --- maven-resources-plugin:2.6:testResources (default-testResources) @ hadoop-kms ---
[INFO] Using 'UTF-8' encoding to copy filtered resources.
[INFO] Copying 3 resources
[INFO] 
[INFO] --- maven-compiler-plugin:3.1:testCompile (default-testCompile) @ hadoop-kms ---
[INFO] Nothing to compile - all classes are up to date
[INFO] 
[INFO] <<< maven-dependency-plugin:2.8:analyze-report @ hadoop-kms <<<
[WARNING] No project URL defined - decoration links will not be relativized!
[INFO] Rendering site with org.apache.maven.skins:maven-stylus-skin:jar:1.2 skin.
[INFO] Rendering 1 Doxia document: 1 markdown
[INFO] Generating "Dependency Analysis" report  --- maven-dependency-plugin:2.8:analyze-report
[INFO] 
[INFO] --- maven-jar-plugin:2.5:jar (prepare-jar) @ hadoop-kms ---
[INFO] Building jar: <https://builds.apache.org/job/Hadoop-common-trunk-Java8/ws/hadoop-common-project/hadoop-kms/target/hadoop-kms-3.0.0-SNAPSHOT-classes.jar>
[INFO] 
[INFO] --- maven-jar-plugin:2.5:test-jar (prepare-test-jar) @ hadoop-kms ---
[INFO] Building jar: <https://builds.apache.org/job/Hadoop-common-trunk-Java8/ws/hadoop-common-project/hadoop-kms/target/hadoop-kms-3.0.0-SNAPSHOT-tests.jar>
[INFO] 
[INFO] --- maven-source-plugin:2.3:jar-no-fork (hadoop-java-sources) @ hadoop-kms ---
[INFO] Building jar: <https://builds.apache.org/job/Hadoop-common-trunk-Java8/ws/hadoop-common-project/hadoop-kms/target/hadoop-kms-3.0.0-SNAPSHOT-sources.jar>
[INFO] 
[INFO] --- maven-source-plugin:2.3:test-jar-no-fork (hadoop-java-sources) @ hadoop-kms ---
[INFO] Building jar: <https://builds.apache.org/job/Hadoop-common-trunk-Java8/ws/hadoop-common-project/hadoop-kms/target/hadoop-kms-3.0.0-SNAPSHOT-test-sources.jar>
[INFO] 
[INFO] --- maven-enforcer-plugin:1.3.1:enforce (dist-enforce) @ hadoop-kms ---
[INFO] 
[INFO] --- maven-site-plugin:3.4:attach-descriptor (attach-descriptor) @ hadoop-kms ---
[INFO] 
[INFO] --- maven-assembly-plugin:2.4:single (dist) @ hadoop-kms ---
[INFO] ------------------------------------------------------------------------
[INFO] Reactor Summary:
[INFO] 
[INFO] Apache Hadoop Annotations ......................... SUCCESS [  5.194 s]
[INFO] Apache Hadoop MiniKDC ............................. SUCCESS [ 16.467 s]
[INFO] Apache Hadoop Auth ................................ SUCCESS [05:14 min]
[INFO] Apache Hadoop Auth Examples ....................... SUCCESS [  3.276 s]
[INFO] Apache Hadoop Common .............................. SUCCESS [24:18 min]
[INFO] Apache Hadoop NFS ................................. SUCCESS [ 12.595 s]
[INFO] Apache Hadoop KMS ................................. FAILURE [01:21 min]
[INFO] Apache Hadoop Common Project ...................... SKIPPED
[INFO] ------------------------------------------------------------------------
[INFO] BUILD FAILURE
[INFO] ------------------------------------------------------------------------
[INFO] Total time: 31:32 min
[INFO] Finished at: 2015-10-30T15:54:18+00:00
[INFO] Final Memory: 83M/345M
[INFO] ------------------------------------------------------------------------
[ERROR] Failed to execute goal org.apache.maven.plugins:maven-assembly-plugin:2.4:single (dist)
on project hadoop-kms: Error reading assemblies: Descriptor with ID 'hadoop-kms-dist' not
found -> [Help 1]
org.apache.maven.lifecycle.LifecycleExecutionException: Failed to execute goal org.apache.maven.plugins:maven-assembly-plugin:2.4:single
(dist) on project hadoop-kms: Error reading assemblies: Descriptor with ID 'hadoop-kms-dist'
not found
	at org.apache.maven.lifecycle.internal.MojoExecutor.execute(MojoExecutor.java:216)
	at org.apache.maven.lifecycle.internal.MojoExecutor.execute(MojoExecutor.java:153)
	at org.apache.maven.lifecycle.internal.MojoExecutor.execute(MojoExecutor.java:145)
	at org.apache.maven.lifecycle.internal.LifecycleModuleBuilder.buildProject(LifecycleModuleBuilder.java:108)
	at org.apache.maven.lifecycle.internal.LifecycleModuleBuilder.buildProject(LifecycleModuleBuilder.java:76)
	at org.apache.maven.lifecycle.internal.builder.singlethreaded.SingleThreadedBuilder.build(SingleThreadedBuilder.java:51)
	at org.apache.maven.lifecycle.internal.LifecycleStarter.execute(LifecycleStarter.java:116)
	at org.apache.maven.DefaultMaven.doExecute(DefaultMaven.java:361)
	at org.apache.maven.DefaultMaven.execute(DefaultMaven.java:155)
	at org.apache.maven.cli.MavenCli.execute(MavenCli.java:584)
	at org.apache.maven.cli.MavenCli.doMain(MavenCli.java:213)
	at org.apache.maven.cli.MavenCli.main(MavenCli.java:157)
	at sun.reflect.NativeMethodAccessorImpl.invoke0(Native Method)
	at sun.reflect.NativeMethodAccessorImpl.invoke(NativeMethodAccessorImpl.java:62)
	at sun.reflect.DelegatingMethodAccessorImpl.invoke(DelegatingMethodAccessorImpl.java:43)
	at java.lang.reflect.Method.invoke(Method.java:483)
	at org.codehaus.plexus.classworlds.launcher.Launcher.launchEnhanced(Launcher.java:289)
	at org.codehaus.plexus.classworlds.launcher.Launcher.launch(Launcher.java:229)
	at org.codehaus.plexus.classworlds.launcher.Launcher.mainWithExitCode(Launcher.java:415)
	at org.codehaus.plexus.classworlds.launcher.Launcher.main(Launcher.java:356)
Caused by: org.apache.maven.plugin.MojoExecutionException: Error reading assemblies: Descriptor
with ID 'hadoop-kms-dist' not found
	at org.apache.maven.plugin.assembly.mojos.AbstractAssemblyMojo.execute(AbstractAssemblyMojo.java:405)
	at org.apache.maven.plugin.DefaultBuildPluginManager.executeMojo(DefaultBuildPluginManager.java:133)
	at org.apache.maven.lifecycle.internal.MojoExecutor.execute(MojoExecutor.java:208)
	... 19 more
Caused by: org.apache.maven.plugin.assembly.io.AssemblyReadException: Descriptor with ID 'hadoop-kms-dist'
not found
	at org.apache.maven.plugin.assembly.io.DefaultAssemblyReader.addAssemblyForDescriptorReference(DefaultAssemblyReader.java:233)
	at org.apache.maven.plugin.assembly.io.DefaultAssemblyReader.readAssemblies(DefaultAssemblyReader.java:129)
	at org.apache.maven.plugin.assembly.mojos.AbstractAssemblyMojo.execute(AbstractAssemblyMojo.java:401)
	... 21 more
[ERROR] 
[ERROR] Re-run Maven using the -X switch to enable full debug logging.
[ERROR] 
[ERROR] For more information about the errors and possible solutions, please read the following
articles:
[ERROR] [Help 1] http://cwiki.apache.org/confluence/display/MAVEN/MojoExecutionException
[ERROR] 
[ERROR] After correcting the problems, you can resume the build with the command
[ERROR]   mvn <goals> -rf :hadoop-kms
Build step 'Execute shell' marked build as failure
Archiving artifacts
Recording test results

Mime
View raw message