hadoop-common-dev mailing list archives

Site index · List index
Message view « Date » · « Thread »
Top « Date » · « Thread »
From Apache Jenkins Server <jenk...@builds.apache.org>
Subject Build failed in Jenkins: Hadoop-Common-trunk #1675
Date Thu, 10 Sep 2015 16:52:54 GMT
See <https://builds.apache.org/job/Hadoop-Common-trunk/1675/changes>

Changes:

[jlowe] MAPREDUCE-6474. ShuffleHandler can possibly exhaust nodemanager file descriptors.
Contributed by Kuhu Shukla

------------------------------------------
[...truncated 5248 lines...]
Running org.apache.hadoop.metrics2.impl.TestSinkQueue
Tests run: 8, Failures: 0, Errors: 0, Skipped: 0, Time elapsed: 0.493 sec - in org.apache.hadoop.metrics2.impl.TestSinkQueue
Running org.apache.hadoop.metrics2.impl.TestMetricsSourceAdapter
Tests run: 2, Failures: 0, Errors: 0, Skipped: 0, Time elapsed: 1.443 sec - in org.apache.hadoop.metrics2.impl.TestMetricsSourceAdapter
Running org.apache.hadoop.metrics2.impl.TestGangliaMetrics
Tests run: 2, Failures: 0, Errors: 0, Skipped: 0, Time elapsed: 0.451 sec - in org.apache.hadoop.metrics2.impl.TestGangliaMetrics
Running org.apache.hadoop.metrics2.impl.TestMetricsCollectorImpl
Tests run: 2, Failures: 0, Errors: 0, Skipped: 0, Time elapsed: 0.242 sec - in org.apache.hadoop.metrics2.impl.TestMetricsCollectorImpl
Running org.apache.hadoop.metrics2.impl.TestMetricsSystemImpl
Tests run: 11, Failures: 0, Errors: 0, Skipped: 0, Time elapsed: 1.814 sec - in org.apache.hadoop.metrics2.impl.TestMetricsSystemImpl
Running org.apache.hadoop.metrics2.impl.TestMetricsConfig
Tests run: 3, Failures: 0, Errors: 0, Skipped: 0, Time elapsed: 0.296 sec - in org.apache.hadoop.metrics2.impl.TestMetricsConfig
Running org.apache.hadoop.metrics2.impl.TestGraphiteMetrics
Tests run: 5, Failures: 0, Errors: 0, Skipped: 0, Time elapsed: 0.391 sec - in org.apache.hadoop.metrics2.impl.TestGraphiteMetrics
Running org.apache.hadoop.metrics2.impl.TestMetricsVisitor
Tests run: 1, Failures: 0, Errors: 0, Skipped: 0, Time elapsed: 0.405 sec - in org.apache.hadoop.metrics2.impl.TestMetricsVisitor
Running org.apache.hadoop.metrics2.source.TestJvmMetrics
Tests run: 1, Failures: 0, Errors: 0, Skipped: 0, Time elapsed: 0.549 sec - in org.apache.hadoop.metrics2.source.TestJvmMetrics
Running org.apache.hadoop.metrics2.sink.TestFileSink
Tests run: 1, Failures: 0, Errors: 0, Skipped: 0, Time elapsed: 0.486 sec - in org.apache.hadoop.metrics2.sink.TestFileSink
Running org.apache.hadoop.metrics2.sink.ganglia.TestGangliaSink
Tests run: 4, Failures: 0, Errors: 0, Skipped: 0, Time elapsed: 0.256 sec - in org.apache.hadoop.metrics2.sink.ganglia.TestGangliaSink
Running org.apache.hadoop.metrics2.filter.TestPatternFilter
Tests run: 5, Failures: 0, Errors: 0, Skipped: 0, Time elapsed: 0.427 sec - in org.apache.hadoop.metrics2.filter.TestPatternFilter
Running org.apache.hadoop.log.TestLogLevel
Tests run: 1, Failures: 0, Errors: 0, Skipped: 0, Time elapsed: 0.746 sec - in org.apache.hadoop.log.TestLogLevel
Running org.apache.hadoop.log.TestLog4Json
Tests run: 5, Failures: 0, Errors: 0, Skipped: 0, Time elapsed: 0.414 sec - in org.apache.hadoop.log.TestLog4Json
Running org.apache.hadoop.jmx.TestJMXJsonServlet
Tests run: 1, Failures: 0, Errors: 0, Skipped: 0, Time elapsed: 0.986 sec - in org.apache.hadoop.jmx.TestJMXJsonServlet
Running org.apache.hadoop.ipc.TestIPCServerResponder
Tests run: 2, Failures: 0, Errors: 0, Skipped: 0, Time elapsed: 5.378 sec - in org.apache.hadoop.ipc.TestIPCServerResponder
Running org.apache.hadoop.ipc.TestRPCWaitForProxy
Tests run: 2, Failures: 0, Errors: 0, Skipped: 0, Time elapsed: 1.288 sec - in org.apache.hadoop.ipc.TestRPCWaitForProxy
Running org.apache.hadoop.ipc.TestSocketFactory
Tests run: 1, Failures: 0, Errors: 0, Skipped: 0, Time elapsed: 0.335 sec - in org.apache.hadoop.ipc.TestSocketFactory
Running org.apache.hadoop.ipc.TestCallQueueManager
Tests run: 3, Failures: 0, Errors: 0, Skipped: 0, Time elapsed: 7.557 sec - in org.apache.hadoop.ipc.TestCallQueueManager
Running org.apache.hadoop.ipc.TestIdentityProviders
Tests run: 2, Failures: 0, Errors: 0, Skipped: 0, Time elapsed: 0.592 sec - in org.apache.hadoop.ipc.TestIdentityProviders
Running org.apache.hadoop.ipc.TestWeightedRoundRobinMultiplexer
Tests run: 6, Failures: 0, Errors: 0, Skipped: 0, Time elapsed: 0.582 sec - in org.apache.hadoop.ipc.TestWeightedRoundRobinMultiplexer
Running org.apache.hadoop.ipc.TestRPCCompatibility
Tests run: 8, Failures: 0, Errors: 0, Skipped: 0, Time elapsed: 1.117 sec - in org.apache.hadoop.ipc.TestRPCCompatibility
Running org.apache.hadoop.ipc.TestProtoBufRpc
Tests run: 6, Failures: 0, Errors: 0, Skipped: 0, Time elapsed: 14.105 sec - in org.apache.hadoop.ipc.TestProtoBufRpc
Running org.apache.hadoop.ipc.TestMultipleProtocolServer
Tests run: 5, Failures: 0, Errors: 0, Skipped: 0, Time elapsed: 1.03 sec - in org.apache.hadoop.ipc.TestMultipleProtocolServer
Running org.apache.hadoop.ipc.TestRPCCallBenchmark
Tests run: 2, Failures: 0, Errors: 0, Skipped: 0, Time elapsed: 11.001 sec - in org.apache.hadoop.ipc.TestRPCCallBenchmark
Running org.apache.hadoop.ipc.TestRetryCacheMetrics
Tests run: 1, Failures: 0, Errors: 0, Skipped: 0, Time elapsed: 0.444 sec - in org.apache.hadoop.ipc.TestRetryCacheMetrics
Running org.apache.hadoop.ipc.TestMiniRPCBenchmark
Tests run: 1, Failures: 0, Errors: 0, Skipped: 0, Time elapsed: 0.95 sec - in org.apache.hadoop.ipc.TestMiniRPCBenchmark
Running org.apache.hadoop.ipc.TestIPC
Tests run: 34, Failures: 0, Errors: 0, Skipped: 0, Time elapsed: 91.509 sec - in org.apache.hadoop.ipc.TestIPC
Running org.apache.hadoop.ipc.TestDecayRpcScheduler
Tests run: 9, Failures: 0, Errors: 0, Skipped: 0, Time elapsed: 1.113 sec - in org.apache.hadoop.ipc.TestDecayRpcScheduler
Running org.apache.hadoop.ipc.TestFairCallQueue
Tests run: 22, Failures: 0, Errors: 0, Skipped: 0, Time elapsed: 1.347 sec - in org.apache.hadoop.ipc.TestFairCallQueue
Running org.apache.hadoop.ipc.TestServer
Tests run: 5, Failures: 0, Errors: 0, Skipped: 0, Time elapsed: 0.467 sec - in org.apache.hadoop.ipc.TestServer
Running org.apache.hadoop.ipc.TestRPC
Tests run: 20, Failures: 0, Errors: 0, Skipped: 0, Time elapsed: 18.079 sec - in org.apache.hadoop.ipc.TestRPC
Running org.apache.hadoop.ipc.TestSaslRPC
Tests run: 85, Failures: 0, Errors: 0, Skipped: 0, Time elapsed: 26.748 sec - in org.apache.hadoop.ipc.TestSaslRPC
Running org.apache.hadoop.ipc.TestRetryCache
Tests run: 6, Failures: 0, Errors: 0, Skipped: 0, Time elapsed: 1.396 sec - in org.apache.hadoop.ipc.TestRetryCache
Running org.apache.hadoop.security.token.delegation.web.TestDelegationTokenAuthenticationHandlerWithMocks
Tests run: 2, Failures: 0, Errors: 0, Skipped: 0, Time elapsed: 1.437 sec - in org.apache.hadoop.security.token.delegation.web.TestDelegationTokenAuthenticationHandlerWithMocks
Running org.apache.hadoop.security.token.delegation.web.TestDelegationTokenManager
Tests run: 2, Failures: 0, Errors: 0, Skipped: 0, Time elapsed: 0.854 sec - in org.apache.hadoop.security.token.delegation.web.TestDelegationTokenManager
Running org.apache.hadoop.security.token.delegation.web.TestWebDelegationToken
Tests run: 12, Failures: 0, Errors: 0, Skipped: 0, Time elapsed: 10.052 sec - in org.apache.hadoop.security.token.delegation.web.TestWebDelegationToken
Running org.apache.hadoop.security.token.delegation.TestDelegationToken
Tests run: 15, Failures: 0, Errors: 0, Skipped: 0, Time elapsed: 30.838 sec - in org.apache.hadoop.security.token.delegation.TestDelegationToken
Running org.apache.hadoop.security.token.delegation.TestZKDelegationTokenSecretManager
Tests run: 6, Failures: 0, Errors: 0, Skipped: 0, Time elapsed: 48.779 sec - in org.apache.hadoop.security.token.delegation.TestZKDelegationTokenSecretManager
Running org.apache.hadoop.security.token.TestToken
Tests run: 3, Failures: 0, Errors: 0, Skipped: 0, Time elapsed: 0.504 sec - in org.apache.hadoop.security.token.TestToken
Running org.apache.hadoop.security.TestWhitelistBasedResolver
Tests run: 3, Failures: 0, Errors: 0, Skipped: 0, Time elapsed: 0.513 sec - in org.apache.hadoop.security.TestWhitelistBasedResolver
Running org.apache.hadoop.security.TestAuthenticationFilter
Tests run: 1, Failures: 0, Errors: 0, Skipped: 0, Time elapsed: 0.577 sec - in org.apache.hadoop.security.TestAuthenticationFilter
Running org.apache.hadoop.security.TestGroupFallback
Tests run: 4, Failures: 0, Errors: 0, Skipped: 0, Time elapsed: 0.653 sec - in org.apache.hadoop.security.TestGroupFallback
Running org.apache.hadoop.security.TestProxyUserFromEnv
Tests run: 1, Failures: 0, Errors: 0, Skipped: 0, Time elapsed: 0.55 sec - in org.apache.hadoop.security.TestProxyUserFromEnv
Running org.apache.hadoop.security.TestUGILoginFromKeytab
Tests run: 1, Failures: 0, Errors: 0, Skipped: 0, Time elapsed: 5.418 sec - in org.apache.hadoop.security.TestUGILoginFromKeytab
Running org.apache.hadoop.security.TestLdapGroupsMappingWithPosixGroup
Tests run: 1, Failures: 0, Errors: 0, Skipped: 0, Time elapsed: 0.634 sec - in org.apache.hadoop.security.TestLdapGroupsMappingWithPosixGroup
Running org.apache.hadoop.security.TestShellBasedIdMapping
Tests run: 7, Failures: 0, Errors: 0, Skipped: 0, Time elapsed: 2.633 sec - in org.apache.hadoop.security.TestShellBasedIdMapping
Running org.apache.hadoop.security.TestDoAsEffectiveUser
Tests run: 9, Failures: 0, Errors: 0, Skipped: 0, Time elapsed: 1.51 sec - in org.apache.hadoop.security.TestDoAsEffectiveUser
Running org.apache.hadoop.security.TestUGIWithExternalKdc
Tests run: 1, Failures: 0, Errors: 0, Skipped: 1, Time elapsed: 0.08 sec - in org.apache.hadoop.security.TestUGIWithExternalKdc
Running org.apache.hadoop.security.TestJNIGroupsMapping
Tests run: 1, Failures: 0, Errors: 0, Skipped: 0, Time elapsed: 0.601 sec - in org.apache.hadoop.security.TestJNIGroupsMapping
Running org.apache.hadoop.security.TestGroupsCaching
Tests run: 10, Failures: 0, Errors: 0, Skipped: 0, Time elapsed: 1.837 sec - in org.apache.hadoop.security.TestGroupsCaching
Running org.apache.hadoop.security.alias.TestCredentialProviderFactory
Tests run: 6, Failures: 0, Errors: 0, Skipped: 0, Time elapsed: 1.348 sec - in org.apache.hadoop.security.alias.TestCredentialProviderFactory
Running org.apache.hadoop.security.alias.TestCredentialProvider
Tests run: 2, Failures: 0, Errors: 0, Skipped: 0, Time elapsed: 0.087 sec - in org.apache.hadoop.security.alias.TestCredentialProvider
Running org.apache.hadoop.security.alias.TestCredShell
Tests run: 9, Failures: 0, Errors: 0, Skipped: 0, Time elapsed: 1.219 sec - in org.apache.hadoop.security.alias.TestCredShell
Running org.apache.hadoop.security.ssl.TestReloadingX509TrustManager
Tests run: 5, Failures: 0, Errors: 0, Skipped: 0, Time elapsed: 2.555 sec - in org.apache.hadoop.security.ssl.TestReloadingX509TrustManager
Running org.apache.hadoop.security.ssl.TestSSLFactory
Tests run: 15, Failures: 0, Errors: 0, Skipped: 0, Time elapsed: 3.377 sec - in org.apache.hadoop.security.ssl.TestSSLFactory
Running org.apache.hadoop.security.TestLdapGroupsMapping
Tests run: 5, Failures: 0, Errors: 0, Skipped: 0, Time elapsed: 1.442 sec - in org.apache.hadoop.security.TestLdapGroupsMapping
Running org.apache.hadoop.security.TestUserFromEnv
Tests run: 1, Failures: 0, Errors: 0, Skipped: 0, Time elapsed: 0.55 sec - in org.apache.hadoop.security.TestUserFromEnv
Running org.apache.hadoop.security.TestCredentials
Tests run: 4, Failures: 0, Errors: 0, Skipped: 0, Time elapsed: 0.595 sec - in org.apache.hadoop.security.TestCredentials
Running org.apache.hadoop.security.TestNetgroupCache
Tests run: 3, Failures: 0, Errors: 0, Skipped: 0, Time elapsed: 0.078 sec - in org.apache.hadoop.security.TestNetgroupCache
Running org.apache.hadoop.security.TestUGIWithSecurityOn
Tests run: 2, Failures: 0, Errors: 0, Skipped: 2, Time elapsed: 0.079 sec - in org.apache.hadoop.security.TestUGIWithSecurityOn
Running org.apache.hadoop.security.authorize.TestAccessControlList
Tests run: 8, Failures: 0, Errors: 0, Skipped: 0, Time elapsed: 0.664 sec - in org.apache.hadoop.security.authorize.TestAccessControlList
Running org.apache.hadoop.security.authorize.TestProxyUsers
Tests run: 15, Failures: 0, Errors: 0, Skipped: 0, Time elapsed: 0.976 sec - in org.apache.hadoop.security.authorize.TestProxyUsers
Running org.apache.hadoop.security.authorize.TestProxyServers
Tests run: 1, Failures: 0, Errors: 0, Skipped: 0, Time elapsed: 0.422 sec - in org.apache.hadoop.security.authorize.TestProxyServers
Running org.apache.hadoop.security.authorize.TestServiceAuthorization
Tests run: 7, Failures: 0, Errors: 0, Skipped: 0, Time elapsed: 1.204 sec - in org.apache.hadoop.security.authorize.TestServiceAuthorization
Running org.apache.hadoop.security.TestCompositeGroupMapping
Tests run: 3, Failures: 0, Errors: 0, Skipped: 0, Time elapsed: 0.702 sec - in org.apache.hadoop.security.TestCompositeGroupMapping
Running org.apache.hadoop.security.TestSecurityUtil
Tests run: 17, Failures: 0, Errors: 0, Skipped: 0, Time elapsed: 0.902 sec - in org.apache.hadoop.security.TestSecurityUtil
Running org.apache.hadoop.security.TestUserGroupInformation
Tests run: 34, Failures: 0, Errors: 0, Skipped: 0, Time elapsed: 3.651 sec - in org.apache.hadoop.security.TestUserGroupInformation
Running org.apache.hadoop.tracing.TestTraceUtils
Tests run: 2, Failures: 0, Errors: 0, Skipped: 0, Time elapsed: 0.399 sec - in org.apache.hadoop.tracing.TestTraceUtils
Running org.apache.hadoop.http.lib.TestStaticUserWebFilter
Tests run: 3, Failures: 0, Errors: 0, Skipped: 0, Time elapsed: 0.612 sec - in org.apache.hadoop.http.lib.TestStaticUserWebFilter
Running org.apache.hadoop.http.TestServletFilter
Tests run: 3, Failures: 0, Errors: 0, Skipped: 0, Time elapsed: 1.317 sec - in org.apache.hadoop.http.TestServletFilter
Running org.apache.hadoop.http.TestHttpRequestLogAppender
Tests run: 1, Failures: 0, Errors: 0, Skipped: 0, Time elapsed: 0.075 sec - in org.apache.hadoop.http.TestHttpRequestLogAppender
Running org.apache.hadoop.http.TestHtmlQuoting
Tests run: 4, Failures: 0, Errors: 0, Skipped: 0, Time elapsed: 0.291 sec - in org.apache.hadoop.http.TestHtmlQuoting
Running org.apache.hadoop.http.TestPathFilter
Tests run: 1, Failures: 0, Errors: 0, Skipped: 0, Time elapsed: 0.87 sec - in org.apache.hadoop.http.TestPathFilter
Running org.apache.hadoop.http.TestGlobalFilter
Tests run: 1, Failures: 0, Errors: 0, Skipped: 0, Time elapsed: 0.906 sec - in org.apache.hadoop.http.TestGlobalFilter
Running org.apache.hadoop.http.TestHttpServerLifecycle
Tests run: 7, Failures: 0, Errors: 0, Skipped: 0, Time elapsed: 1.464 sec - in org.apache.hadoop.http.TestHttpServerLifecycle
Running org.apache.hadoop.http.TestAuthenticationSessionCookie
Tests run: 2, Failures: 0, Errors: 0, Skipped: 0, Time elapsed: 1.842 sec - in org.apache.hadoop.http.TestAuthenticationSessionCookie
Running org.apache.hadoop.http.TestHttpRequestLog
Tests run: 2, Failures: 0, Errors: 0, Skipped: 0, Time elapsed: 0.174 sec - in org.apache.hadoop.http.TestHttpRequestLog
Running org.apache.hadoop.http.TestHttpServerWebapps
Tests run: 2, Failures: 0, Errors: 0, Skipped: 0, Time elapsed: 0.589 sec - in org.apache.hadoop.http.TestHttpServerWebapps
Running org.apache.hadoop.http.TestHttpCookieFlag
Tests run: 2, Failures: 0, Errors: 0, Skipped: 0, Time elapsed: 1.83 sec - in org.apache.hadoop.http.TestHttpCookieFlag
Running org.apache.hadoop.http.TestHttpServer
Tests run: 14, Failures: 0, Errors: 0, Skipped: 0, Time elapsed: 3.468 sec - in org.apache.hadoop.http.TestHttpServer
Running org.apache.hadoop.http.TestSSLHttpServer
Tests run: 2, Failures: 0, Errors: 0, Skipped: 0, Time elapsed: 1.739 sec - in org.apache.hadoop.http.TestSSLHttpServer
Running org.apache.hadoop.metrics.spi.TestOutputRecord
Tests run: 1, Failures: 0, Errors: 0, Skipped: 0, Time elapsed: 0.054 sec - in org.apache.hadoop.metrics.spi.TestOutputRecord
Running org.apache.hadoop.metrics.ganglia.TestGangliaContext
Tests run: 5, Failures: 0, Errors: 0, Skipped: 0, Time elapsed: 0.184 sec - in org.apache.hadoop.metrics.ganglia.TestGangliaContext
Running org.apache.hadoop.metrics.TestMetricsServlet
Tests run: 3, Failures: 0, Errors: 0, Skipped: 0, Time elapsed: 0.087 sec - in org.apache.hadoop.metrics.TestMetricsServlet
Running org.apache.hadoop.net.TestSocketIOWithTimeout
Tests run: 1, Failures: 0, Errors: 0, Skipped: 0, Time elapsed: 5.372 sec - in org.apache.hadoop.net.TestSocketIOWithTimeout
Running org.apache.hadoop.net.TestSwitchMapping
Tests run: 5, Failures: 0, Errors: 0, Skipped: 0, Time elapsed: 0.393 sec - in org.apache.hadoop.net.TestSwitchMapping
Running org.apache.hadoop.net.TestStaticMapping
Tests run: 8, Failures: 0, Errors: 0, Skipped: 0, Time elapsed: 0.94 sec - in org.apache.hadoop.net.TestStaticMapping
Running org.apache.hadoop.net.TestNetUtils
Tests run: 40, Failures: 0, Errors: 0, Skipped: 0, Time elapsed: 3.636 sec - in org.apache.hadoop.net.TestNetUtils
Running org.apache.hadoop.net.TestClusterTopology
Tests run: 2, Failures: 0, Errors: 0, Skipped: 0, Time elapsed: 0.228 sec - in org.apache.hadoop.net.TestClusterTopology
Running org.apache.hadoop.net.TestDNS
Tests run: 8, Failures: 0, Errors: 0, Skipped: 0, Time elapsed: 0.27 sec - in org.apache.hadoop.net.TestDNS
Running org.apache.hadoop.net.unix.TestDomainSocket
Tests run: 17, Failures: 0, Errors: 0, Skipped: 0, Time elapsed: 2.921 sec - in org.apache.hadoop.net.unix.TestDomainSocket
Running org.apache.hadoop.net.unix.TestDomainSocketWatcher
Tests run: 6, Failures: 0, Errors: 0, Skipped: 0, Time elapsed: 0.63 sec - in org.apache.hadoop.net.unix.TestDomainSocketWatcher
Running org.apache.hadoop.net.TestScriptBasedMapping
Tests run: 4, Failures: 0, Errors: 0, Skipped: 0, Time elapsed: 0.753 sec - in org.apache.hadoop.net.TestScriptBasedMapping
Running org.apache.hadoop.net.TestTableMapping
Tests run: 6, Failures: 0, Errors: 0, Skipped: 0, Time elapsed: 0.627 sec - in org.apache.hadoop.net.TestTableMapping
Running org.apache.hadoop.net.TestNetworkTopologyWithNodeGroup
Tests run: 8, Failures: 0, Errors: 0, Skipped: 0, Time elapsed: 0.198 sec - in org.apache.hadoop.net.TestNetworkTopologyWithNodeGroup
Running org.apache.hadoop.net.TestScriptBasedMappingWithDependency
Tests run: 4, Failures: 0, Errors: 0, Skipped: 0, Time elapsed: 0.788 sec - in org.apache.hadoop.net.TestScriptBasedMappingWithDependency
Running org.apache.hadoop.cli.TestCLI
Tests run: 1, Failures: 0, Errors: 0, Skipped: 0, Time elapsed: 0.639 sec - in org.apache.hadoop.cli.TestCLI
Running org.apache.hadoop.service.TestServiceLifecycle
Tests run: 18, Failures: 0, Errors: 0, Skipped: 0, Time elapsed: 2.389 sec - in org.apache.hadoop.service.TestServiceLifecycle
Running org.apache.hadoop.service.TestCompositeService
Tests run: 18, Failures: 0, Errors: 0, Skipped: 0, Time elapsed: 0.24 sec - in org.apache.hadoop.service.TestCompositeService
Running org.apache.hadoop.service.TestGlobalStateChangeListener
Tests run: 5, Failures: 0, Errors: 0, Skipped: 0, Time elapsed: 0.212 sec - in org.apache.hadoop.service.TestGlobalStateChangeListener

Results :

Tests in error: 
  TestPrint.testPrint:51 ยป  test timed out after 1000 milliseconds

Tests run: 3106, Failures: 0, Errors: 1, Skipped: 86

[INFO] ------------------------------------------------------------------------
[INFO] Reactor Summary:
[INFO] 
[INFO] Apache Hadoop Annotations ......................... SUCCESS [  8.018 s]
[INFO] Apache Hadoop MiniKDC ............................. SUCCESS [ 21.264 s]
[INFO] Apache Hadoop Auth ................................ SUCCESS [05:19 min]
[INFO] Apache Hadoop Auth Examples ....................... SUCCESS [  3.655 s]
[INFO] Apache Hadoop Common .............................. FAILURE [23:12 min]
[INFO] Apache Hadoop NFS ................................. SKIPPED
[INFO] Apache Hadoop KMS ................................. SKIPPED
[INFO] Apache Hadoop Common Project ...................... SKIPPED
[INFO] ------------------------------------------------------------------------
[INFO] BUILD FAILURE
[INFO] ------------------------------------------------------------------------
[INFO] Total time: 29:06 min
[INFO] Finished at: 2015-09-10T16:52:46+00:00
[INFO] Final Memory: 83M/975M
[INFO] ------------------------------------------------------------------------
[ERROR] Failed to execute goal org.apache.maven.plugins:maven-surefire-plugin:2.17:test (default-test)
on project hadoop-common: There are test failures.
[ERROR] 
[ERROR] Please refer to <https://builds.apache.org/job/Hadoop-Common-trunk/ws/hadoop-common-project/hadoop-common/target/surefire-reports>
for the individual test results.
[ERROR] -> [Help 1]
[ERROR] 
[ERROR] To see the full stack trace of the errors, re-run Maven with the -e switch.
[ERROR] Re-run Maven using the -X switch to enable full debug logging.
[ERROR] 
[ERROR] For more information about the errors and possible solutions, please read the following
articles:
[ERROR] [Help 1] http://cwiki.apache.org/confluence/display/MAVEN/MojoFailureException
[ERROR] 
[ERROR] After correcting the problems, you can resume the build with the command
[ERROR]   mvn <goals> -rf :hadoop-common
result: 1

################
# mvn -eaf test -Pclover -DcloverLicenseLocation=/home/jenkins/tools/clover/latest/lib/clover.license
################
Build step 'Execute shell' marked build as failure
Archiving artifacts
Recording test results

Mime
View raw message