hadoop-common-dev mailing list archives

Site index · List index
Message view « Date » · « Thread »
Top « Date » · « Thread »
From Apache Jenkins Server <jenk...@builds.apache.org>
Subject Build failed in Jenkins: Hadoop-Common-trunk #1554
Date Tue, 14 Jul 2015 09:33:03 GMT
See <https://builds.apache.org/job/Hadoop-Common-trunk/1554/changes>

Changes:

[jianhe] Revert "YARN-3878. AsyncDispatcher can hang while stopping if it is configured for
draining events on stop. (Varun Saxena via kasha)"

[szetszwo] Add HDFS-8143 to CHANGES.txt.

[szetszwo] HDFS-8541. Mover should exit with NO_MOVE_PROGRESS if there is no move progress.
 Contributed by Surendra Singh Lilhore

[cdouglas] HADOOP-12211. Collect disk usage on the node. Contributed by Robert Grandl

[Arun Suresh] YARN-3453. Ensure preemption logic in FairScheduler uses DominantResourceCalculator
in DRF queues to prevent unnecessary thrashing. (asuresh)

------------------------------------------
[...truncated 5094 lines...]
Running org.apache.hadoop.fs.TestFileSystemTokens
Tests run: 10, Failures: 0, Errors: 0, Skipped: 0, Time elapsed: 0.694 sec - in org.apache.hadoop.fs.TestFileSystemTokens
Running org.apache.hadoop.fs.TestHarFileSystemBasics
Tests run: 12, Failures: 0, Errors: 0, Skipped: 0, Time elapsed: 2.301 sec - in org.apache.hadoop.fs.TestHarFileSystemBasics
Running org.apache.hadoop.fs.TestLocalDirAllocator
Tests run: 33, Failures: 0, Errors: 0, Skipped: 0, Time elapsed: 1.211 sec - in org.apache.hadoop.fs.TestLocalDirAllocator
Running org.apache.hadoop.fs.TestFileSystemCaching
Tests run: 13, Failures: 0, Errors: 0, Skipped: 0, Time elapsed: 1.212 sec - in org.apache.hadoop.fs.TestFileSystemCaching
Running org.apache.hadoop.fs.TestGetFileBlockLocations
Tests run: 3, Failures: 0, Errors: 0, Skipped: 0, Time elapsed: 0.97 sec - in org.apache.hadoop.fs.TestGetFileBlockLocations
Running org.apache.hadoop.fs.TestGlobPattern
Tests run: 2, Failures: 0, Errors: 0, Skipped: 0, Time elapsed: 0.09 sec - in org.apache.hadoop.fs.TestGlobPattern
Running org.apache.hadoop.fs.TestS3_LocalFileContextURI
Tests run: 17, Failures: 0, Errors: 0, Skipped: 0, Time elapsed: 1.59 sec - in org.apache.hadoop.fs.TestS3_LocalFileContextURI
Running org.apache.hadoop.fs.TestSymlinkLocalFSFileContext
Tests run: 63, Failures: 0, Errors: 0, Skipped: 3, Time elapsed: 2.438 sec - in org.apache.hadoop.fs.TestSymlinkLocalFSFileContext
Running org.apache.hadoop.fs.TestDelegateToFileSystem
Tests run: 2, Failures: 0, Errors: 0, Skipped: 0, Time elapsed: 0.433 sec - in org.apache.hadoop.fs.TestDelegateToFileSystem
Running org.apache.hadoop.fs.TestDelegationTokenRenewer
Tests run: 5, Failures: 0, Errors: 0, Skipped: 0, Time elapsed: 5.69 sec - in org.apache.hadoop.fs.TestDelegationTokenRenewer
Running org.apache.hadoop.fs.TestHarFileSystem
Tests run: 4, Failures: 0, Errors: 0, Skipped: 0, Time elapsed: 0.734 sec - in org.apache.hadoop.fs.TestHarFileSystem
Running org.apache.hadoop.fs.TestTruncatedInputBug
Tests run: 1, Failures: 0, Errors: 0, Skipped: 0, Time elapsed: 0.767 sec - in org.apache.hadoop.fs.TestTruncatedInputBug
Running org.apache.hadoop.fs.TestFileSystemInitialization
Tests run: 1, Failures: 0, Errors: 0, Skipped: 0, Time elapsed: 0.659 sec - in org.apache.hadoop.fs.TestFileSystemInitialization
Running org.apache.hadoop.fs.TestFsShell
Tests run: 1, Failures: 0, Errors: 0, Skipped: 0, Time elapsed: 0.419 sec - in org.apache.hadoop.fs.TestFsShell
Running org.apache.hadoop.fs.TestFileContextResolveAfs
Tests run: 1, Failures: 0, Errors: 0, Skipped: 0, Time elapsed: 0.818 sec - in org.apache.hadoop.fs.TestFileContextResolveAfs
Running org.apache.hadoop.fs.TestBlockLocation
Tests run: 2, Failures: 0, Errors: 0, Skipped: 0, Time elapsed: 0.091 sec - in org.apache.hadoop.fs.TestBlockLocation
Running org.apache.hadoop.fs.TestFsShellCopy
Tests run: 15, Failures: 0, Errors: 0, Skipped: 4, Time elapsed: 1.404 sec - in org.apache.hadoop.fs.TestFsShellCopy
Running org.apache.hadoop.fs.permission.TestAcl
Tests run: 6, Failures: 0, Errors: 0, Skipped: 0, Time elapsed: 0.235 sec - in org.apache.hadoop.fs.permission.TestAcl
Running org.apache.hadoop.fs.permission.TestFsPermission
Tests run: 8, Failures: 0, Errors: 0, Skipped: 0, Time elapsed: 0.686 sec - in org.apache.hadoop.fs.permission.TestFsPermission
Running org.apache.hadoop.fs.sftp.TestSFTPFileSystem
Tests run: 9, Failures: 0, Errors: 0, Skipped: 0, Time elapsed: 7.773 sec - in org.apache.hadoop.fs.sftp.TestSFTPFileSystem
Running org.apache.hadoop.fs.TestFileContextDeleteOnExit
Tests run: 1, Failures: 0, Errors: 0, Skipped: 0, Time elapsed: 0.858 sec - in org.apache.hadoop.fs.TestFileContextDeleteOnExit
Running org.apache.hadoop.fs.TestFcLocalFsUtil
Tests run: 2, Failures: 0, Errors: 0, Skipped: 0, Time elapsed: 0.832 sec - in org.apache.hadoop.fs.TestFcLocalFsUtil
Running org.apache.hadoop.fs.TestStat
Tests run: 5, Failures: 0, Errors: 0, Skipped: 0, Time elapsed: 0.861 sec - in org.apache.hadoop.fs.TestStat
Running org.apache.hadoop.fs.shell.TestCopy
Tests run: 5, Failures: 0, Errors: 0, Skipped: 0, Time elapsed: 1.041 sec - in org.apache.hadoop.fs.shell.TestCopy
Running org.apache.hadoop.fs.shell.TestTextCommand
Tests run: 4, Failures: 0, Errors: 0, Skipped: 0, Time elapsed: 1.224 sec - in org.apache.hadoop.fs.shell.TestTextCommand
Running org.apache.hadoop.fs.shell.TestCopyPreserveFlag
Tests run: 8, Failures: 0, Errors: 0, Skipped: 0, Time elapsed: 0.881 sec - in org.apache.hadoop.fs.shell.TestCopyPreserveFlag
Running org.apache.hadoop.fs.shell.TestAclCommands
Tests run: 7, Failures: 0, Errors: 0, Skipped: 0, Time elapsed: 0.886 sec - in org.apache.hadoop.fs.shell.TestAclCommands
Running org.apache.hadoop.fs.shell.find.TestFind
Tests run: 24, Failures: 0, Errors: 0, Skipped: 0, Time elapsed: 2.139 sec - in org.apache.hadoop.fs.shell.find.TestFind
Running org.apache.hadoop.fs.shell.find.TestPrint0
Tests run: 1, Failures: 0, Errors: 0, Skipped: 0, Time elapsed: 0.932 sec - in org.apache.hadoop.fs.shell.find.TestPrint0
Running org.apache.hadoop.fs.shell.find.TestPrint
Tests run: 1, Failures: 0, Errors: 0, Skipped: 0, Time elapsed: 1.029 sec - in org.apache.hadoop.fs.shell.find.TestPrint
Running org.apache.hadoop.fs.shell.find.TestAnd
Tests run: 10, Failures: 0, Errors: 0, Skipped: 0, Time elapsed: 0.337 sec - in org.apache.hadoop.fs.shell.find.TestAnd
Running org.apache.hadoop.fs.shell.find.TestResult
Tests run: 18, Failures: 0, Errors: 0, Skipped: 0, Time elapsed: 0.101 sec - in org.apache.hadoop.fs.shell.find.TestResult
Running org.apache.hadoop.fs.shell.find.TestIname
Tests run: 6, Failures: 0, Errors: 0, Skipped: 0, Time elapsed: 1.124 sec - in org.apache.hadoop.fs.shell.find.TestIname
Running org.apache.hadoop.fs.shell.find.TestName
Tests run: 6, Failures: 0, Errors: 0, Skipped: 0, Time elapsed: 1.09 sec - in org.apache.hadoop.fs.shell.find.TestName
Running org.apache.hadoop.fs.shell.find.TestFilterExpression
Tests run: 11, Failures: 0, Errors: 0, Skipped: 0, Time elapsed: 0.355 sec - in org.apache.hadoop.fs.shell.find.TestFilterExpression
Running org.apache.hadoop.fs.shell.TestPathExceptions
Tests run: 4, Failures: 0, Errors: 0, Skipped: 0, Time elapsed: 0.085 sec - in org.apache.hadoop.fs.shell.TestPathExceptions
Running org.apache.hadoop.fs.shell.TestCommandFactory
Tests run: 2, Failures: 0, Errors: 0, Skipped: 0, Time elapsed: 0.221 sec - in org.apache.hadoop.fs.shell.TestCommandFactory
Running org.apache.hadoop.fs.shell.TestLs
Tests run: 33, Failures: 0, Errors: 0, Skipped: 0, Time elapsed: 1.395 sec - in org.apache.hadoop.fs.shell.TestLs
Running org.apache.hadoop.fs.shell.TestMove
Tests run: 1, Failures: 0, Errors: 0, Skipped: 0, Time elapsed: 1.031 sec - in org.apache.hadoop.fs.shell.TestMove
Running org.apache.hadoop.fs.shell.TestXAttrCommands
Tests run: 2, Failures: 0, Errors: 0, Skipped: 0, Time elapsed: 0.551 sec - in org.apache.hadoop.fs.shell.TestXAttrCommands
Running org.apache.hadoop.fs.shell.TestPathData
Tests run: 11, Failures: 0, Errors: 0, Skipped: 0, Time elapsed: 1.287 sec - in org.apache.hadoop.fs.shell.TestPathData
Running org.apache.hadoop.fs.shell.TestCount
Tests run: 22, Failures: 0, Errors: 0, Skipped: 0, Time elapsed: 1.074 sec - in org.apache.hadoop.fs.shell.TestCount
Running org.apache.hadoop.fs.contract.rawlocal.TestRawlocalContractRename
Tests run: 7, Failures: 0, Errors: 0, Skipped: 0, Time elapsed: 1.063 sec - in org.apache.hadoop.fs.contract.rawlocal.TestRawlocalContractRename
Running org.apache.hadoop.fs.contract.rawlocal.TestRawlocalContractAppend
Tests run: 5, Failures: 0, Errors: 0, Skipped: 5, Time elapsed: 0.978 sec - in org.apache.hadoop.fs.contract.rawlocal.TestRawlocalContractAppend
Running org.apache.hadoop.fs.contract.rawlocal.TestRawlocalContractDelete
Tests run: 8, Failures: 0, Errors: 0, Skipped: 0, Time elapsed: 0.921 sec - in org.apache.hadoop.fs.contract.rawlocal.TestRawlocalContractDelete
Running org.apache.hadoop.fs.contract.rawlocal.TestRawlocalContractSeek
Tests run: 10, Failures: 0, Errors: 0, Skipped: 0, Time elapsed: 1.231 sec - in org.apache.hadoop.fs.contract.rawlocal.TestRawlocalContractSeek
Running org.apache.hadoop.fs.contract.rawlocal.TestRawlocalContractOpen
Tests run: 6, Failures: 0, Errors: 0, Skipped: 0, Time elapsed: 1.054 sec - in org.apache.hadoop.fs.contract.rawlocal.TestRawlocalContractOpen
Running org.apache.hadoop.fs.contract.rawlocal.TestRawlocalContractMkdir
Tests run: 5, Failures: 0, Errors: 0, Skipped: 0, Time elapsed: 0.991 sec - in org.apache.hadoop.fs.contract.rawlocal.TestRawlocalContractMkdir
Running org.apache.hadoop.fs.contract.rawlocal.TestRawLocalContractUnderlyingFileBehavior
Tests run: 1, Failures: 0, Errors: 0, Skipped: 0, Time elapsed: 0.197 sec - in org.apache.hadoop.fs.contract.rawlocal.TestRawLocalContractUnderlyingFileBehavior
Running org.apache.hadoop.fs.contract.rawlocal.TestRawlocalContractCreate
Tests run: 6, Failures: 0, Errors: 0, Skipped: 0, Time elapsed: 0.95 sec - in org.apache.hadoop.fs.contract.rawlocal.TestRawlocalContractCreate
Running org.apache.hadoop.fs.contract.ftp.TestFTPContractCreate
Tests run: 6, Failures: 0, Errors: 0, Skipped: 6, Time elapsed: 0.688 sec - in org.apache.hadoop.fs.contract.ftp.TestFTPContractCreate
Running org.apache.hadoop.fs.contract.ftp.TestFTPContractDelete
Tests run: 8, Failures: 0, Errors: 0, Skipped: 8, Time elapsed: 0.749 sec - in org.apache.hadoop.fs.contract.ftp.TestFTPContractDelete
Running org.apache.hadoop.fs.contract.ftp.TestFTPContractRename
Tests run: 6, Failures: 0, Errors: 0, Skipped: 6, Time elapsed: 0.626 sec - in org.apache.hadoop.fs.contract.ftp.TestFTPContractRename
Running org.apache.hadoop.fs.contract.ftp.TestFTPContractMkdir
Tests run: 5, Failures: 0, Errors: 0, Skipped: 5, Time elapsed: 0.652 sec - in org.apache.hadoop.fs.contract.ftp.TestFTPContractMkdir
Running org.apache.hadoop.fs.contract.ftp.TestFTPContractOpen
Tests run: 6, Failures: 0, Errors: 0, Skipped: 6, Time elapsed: 0.734 sec - in org.apache.hadoop.fs.contract.ftp.TestFTPContractOpen
Running org.apache.hadoop.fs.contract.localfs.TestLocalFSContractAppend
Tests run: 5, Failures: 0, Errors: 0, Skipped: 5, Time elapsed: 0.929 sec - in org.apache.hadoop.fs.contract.localfs.TestLocalFSContractAppend
Running org.apache.hadoop.fs.contract.localfs.TestLocalFSContractOpen
Tests run: 6, Failures: 0, Errors: 0, Skipped: 0, Time elapsed: 1.055 sec - in org.apache.hadoop.fs.contract.localfs.TestLocalFSContractOpen
Running org.apache.hadoop.fs.contract.localfs.TestLocalFSContractLoaded
Tests run: 2, Failures: 0, Errors: 0, Skipped: 0, Time elapsed: 0.847 sec - in org.apache.hadoop.fs.contract.localfs.TestLocalFSContractLoaded
Running org.apache.hadoop.fs.contract.localfs.TestLocalFSContractDelete
Tests run: 8, Failures: 0, Errors: 0, Skipped: 0, Time elapsed: 1.118 sec - in org.apache.hadoop.fs.contract.localfs.TestLocalFSContractDelete
Running org.apache.hadoop.fs.contract.localfs.TestLocalFSContractMkdir
Tests run: 5, Failures: 0, Errors: 0, Skipped: 0, Time elapsed: 0.995 sec - in org.apache.hadoop.fs.contract.localfs.TestLocalFSContractMkdir
Running org.apache.hadoop.fs.contract.localfs.TestLocalFSContractRename
Tests run: 6, Failures: 0, Errors: 0, Skipped: 0, Time elapsed: 0.972 sec - in org.apache.hadoop.fs.contract.localfs.TestLocalFSContractRename
Running org.apache.hadoop.fs.contract.localfs.TestLocalFSContractCreate
Tests run: 6, Failures: 0, Errors: 0, Skipped: 0, Time elapsed: 0.966 sec - in org.apache.hadoop.fs.contract.localfs.TestLocalFSContractCreate
Running org.apache.hadoop.fs.contract.localfs.TestLocalFSContractSeek
Tests run: 10, Failures: 0, Errors: 0, Skipped: 0, Time elapsed: 1.357 sec - in org.apache.hadoop.fs.contract.localfs.TestLocalFSContractSeek
Running org.apache.hadoop.fs.TestContentSummary
Tests run: 13, Failures: 0, Errors: 0, Skipped: 0, Time elapsed: 0.395 sec - in org.apache.hadoop.fs.TestContentSummary
Running org.apache.hadoop.fs.TestTrash
Tests run: 4, Failures: 0, Errors: 0, Skipped: 0, Time elapsed: 21.184 sec - in org.apache.hadoop.fs.TestTrash
Running org.apache.hadoop.fs.TestLocalFSFileContextCreateMkdir
Tests run: 8, Failures: 0, Errors: 0, Skipped: 0, Time elapsed: 1.243 sec - in org.apache.hadoop.fs.TestLocalFSFileContextCreateMkdir
Running org.apache.hadoop.fs.TestLocalFsFCStatistics
Tests run: 3, Failures: 0, Errors: 0, Skipped: 0, Time elapsed: 1.112 sec - in org.apache.hadoop.fs.TestLocalFsFCStatistics
Running org.apache.hadoop.fs.TestFileStatus
Tests run: 10, Failures: 0, Errors: 0, Skipped: 0, Time elapsed: 0.204 sec - in org.apache.hadoop.fs.TestFileStatus
Running org.apache.hadoop.fs.TestCommandFormat
Tests run: 10, Failures: 0, Errors: 0, Skipped: 0, Time elapsed: 0.085 sec - in org.apache.hadoop.fs.TestCommandFormat
Running org.apache.hadoop.jmx.TestJMXJsonServlet
Tests run: 1, Failures: 0, Errors: 0, Skipped: 0, Time elapsed: 1.004 sec - in org.apache.hadoop.jmx.TestJMXJsonServlet
Running org.apache.hadoop.http.TestGlobalFilter
Tests run: 1, Failures: 0, Errors: 0, Skipped: 0, Time elapsed: 0.912 sec - in org.apache.hadoop.http.TestGlobalFilter
Running org.apache.hadoop.http.TestPathFilter
Tests run: 1, Failures: 0, Errors: 0, Skipped: 0, Time elapsed: 0.983 sec - in org.apache.hadoop.http.TestPathFilter
Running org.apache.hadoop.http.TestHttpCookieFlag
Tests run: 2, Failures: 0, Errors: 0, Skipped: 0, Time elapsed: 1.887 sec - in org.apache.hadoop.http.TestHttpCookieFlag
Running org.apache.hadoop.http.TestHttpRequestLogAppender
Tests run: 1, Failures: 0, Errors: 0, Skipped: 0, Time elapsed: 0.08 sec - in org.apache.hadoop.http.TestHttpRequestLogAppender
Running org.apache.hadoop.http.TestHtmlQuoting
Tests run: 4, Failures: 0, Errors: 0, Skipped: 0, Time elapsed: 0.339 sec - in org.apache.hadoop.http.TestHtmlQuoting
Running org.apache.hadoop.http.TestHttpRequestLog
Tests run: 2, Failures: 0, Errors: 0, Skipped: 0, Time elapsed: 0.169 sec - in org.apache.hadoop.http.TestHttpRequestLog
Running org.apache.hadoop.http.TestHttpServerWebapps
Tests run: 2, Failures: 0, Errors: 0, Skipped: 0, Time elapsed: 0.653 sec - in org.apache.hadoop.http.TestHttpServerWebapps
Running org.apache.hadoop.http.TestHttpServerLifecycle
Tests run: 7, Failures: 0, Errors: 0, Skipped: 0, Time elapsed: 1.504 sec - in org.apache.hadoop.http.TestHttpServerLifecycle
Running org.apache.hadoop.http.TestAuthenticationSessionCookie
Tests run: 2, Failures: 0, Errors: 0, Skipped: 0, Time elapsed: 2.043 sec - in org.apache.hadoop.http.TestAuthenticationSessionCookie
Running org.apache.hadoop.http.TestHttpServer
Tests run: 14, Failures: 0, Errors: 0, Skipped: 0, Time elapsed: 3.784 sec - in org.apache.hadoop.http.TestHttpServer
Running org.apache.hadoop.http.lib.TestStaticUserWebFilter
Tests run: 3, Failures: 0, Errors: 0, Skipped: 0, Time elapsed: 0.611 sec - in org.apache.hadoop.http.lib.TestStaticUserWebFilter
Running org.apache.hadoop.http.TestServletFilter
Tests run: 3, Failures: 0, Errors: 0, Skipped: 0, Time elapsed: 1.22 sec - in org.apache.hadoop.http.TestServletFilter
Running org.apache.hadoop.http.TestSSLHttpServer
Tests run: 2, Failures: 0, Errors: 0, Skipped: 0, Time elapsed: 1.878 sec - in org.apache.hadoop.http.TestSSLHttpServer
Running org.apache.hadoop.metrics2.sink.TestFileSink
Tests run: 1, Failures: 0, Errors: 0, Skipped: 0, Time elapsed: 0.549 sec - in org.apache.hadoop.metrics2.sink.TestFileSink
Running org.apache.hadoop.metrics2.sink.ganglia.TestGangliaSink
Tests run: 4, Failures: 0, Errors: 0, Skipped: 0, Time elapsed: 0.274 sec - in org.apache.hadoop.metrics2.sink.ganglia.TestGangliaSink
Running org.apache.hadoop.metrics2.util.TestSampleStat
Tests run: 1, Failures: 0, Errors: 0, Skipped: 0, Time elapsed: 0.095 sec - in org.apache.hadoop.metrics2.util.TestSampleStat
Running org.apache.hadoop.metrics2.util.TestSampleQuantiles
Tests run: 3, Failures: 0, Errors: 0, Skipped: 0, Time elapsed: 0.793 sec - in org.apache.hadoop.metrics2.util.TestSampleQuantiles
Running org.apache.hadoop.metrics2.util.TestMetricsCache
Tests run: 4, Failures: 0, Errors: 0, Skipped: 0, Time elapsed: 1.855 sec - in org.apache.hadoop.metrics2.util.TestMetricsCache
Running org.apache.hadoop.metrics2.impl.TestMetricsSourceAdapter
Tests run: 2, Failures: 0, Errors: 0, Skipped: 0, Time elapsed: 1.458 sec - in org.apache.hadoop.metrics2.impl.TestMetricsSourceAdapter
Running org.apache.hadoop.metrics2.impl.TestSinkQueue
Tests run: 8, Failures: 0, Errors: 0, Skipped: 0, Time elapsed: 0.566 sec - in org.apache.hadoop.metrics2.impl.TestSinkQueue
Running org.apache.hadoop.metrics2.impl.TestMetricsCollectorImpl
Tests run: 2, Failures: 0, Errors: 0, Skipped: 0, Time elapsed: 0.265 sec - in org.apache.hadoop.metrics2.impl.TestMetricsCollectorImpl
Running org.apache.hadoop.metrics2.impl.TestMetricsVisitor
Tests run: 1, Failures: 0, Errors: 0, Skipped: 0, Time elapsed: 0.443 sec - in org.apache.hadoop.metrics2.impl.TestMetricsVisitor
Running org.apache.hadoop.metrics2.impl.TestGraphiteMetrics
Tests run: 5, Failures: 0, Errors: 0, Skipped: 0, Time elapsed: 0.442 sec - in org.apache.hadoop.metrics2.impl.TestGraphiteMetrics
Running org.apache.hadoop.metrics2.impl.TestMetricsConfig
Tests run: 3, Failures: 0, Errors: 0, Skipped: 0, Time elapsed: 0.316 sec - in org.apache.hadoop.metrics2.impl.TestMetricsConfig
Running org.apache.hadoop.metrics2.impl.TestMetricsSystemImpl
Tests run: 10, Failures: 0, Errors: 0, Skipped: 0, Time elapsed: 1.922 sec - in org.apache.hadoop.metrics2.impl.TestMetricsSystemImpl
Running org.apache.hadoop.metrics2.impl.TestGangliaMetrics
Tests run: 2, Failures: 0, Errors: 0, Skipped: 0, Time elapsed: 0.468 sec - in org.apache.hadoop.metrics2.impl.TestGangliaMetrics
Running org.apache.hadoop.metrics2.source.TestJvmMetrics
Tests run: 1, Failures: 0, Errors: 0, Skipped: 0, Time elapsed: 0.616 sec - in org.apache.hadoop.metrics2.source.TestJvmMetrics
Running org.apache.hadoop.metrics2.filter.TestPatternFilter
Tests run: 5, Failures: 0, Errors: 0, Skipped: 0, Time elapsed: 0.475 sec - in org.apache.hadoop.metrics2.filter.TestPatternFilter
Running org.apache.hadoop.metrics2.lib.TestMetricsAnnotations
Tests run: 9, Failures: 0, Errors: 0, Skipped: 0, Time elapsed: 0.529 sec - in org.apache.hadoop.metrics2.lib.TestMetricsAnnotations
Running org.apache.hadoop.metrics2.lib.TestUniqNames
Tests run: 2, Failures: 0, Errors: 0, Skipped: 0, Time elapsed: 0.089 sec - in org.apache.hadoop.metrics2.lib.TestUniqNames
Running org.apache.hadoop.metrics2.lib.TestInterns
Tests run: 4, Failures: 0, Errors: 0, Skipped: 0, Time elapsed: 0.235 sec - in org.apache.hadoop.metrics2.lib.TestInterns
Running org.apache.hadoop.metrics2.lib.TestMetricsRegistry
Tests run: 3, Failures: 0, Errors: 0, Skipped: 0, Time elapsed: 0.473 sec - in org.apache.hadoop.metrics2.lib.TestMetricsRegistry
Running org.apache.hadoop.metrics2.lib.TestMutableMetrics
Tests run: 5, Failures: 0, Errors: 0, Skipped: 0, Time elapsed: 28.493 sec - in org.apache.hadoop.metrics2.lib.TestMutableMetrics

Results :

Tests in error: 
  TestRPC.testClientBackOff:1128 ยป  test timed out after 30000 milliseconds

Tests run: 3090, Failures: 0, Errors: 1, Skipped: 86

[INFO] ------------------------------------------------------------------------
[INFO] Reactor Summary:
[INFO] 
[INFO] Apache Hadoop Annotations ......................... SUCCESS [  9.000 s]
[INFO] Apache Hadoop MiniKDC ............................. SUCCESS [ 21.948 s]
[INFO] Apache Hadoop Auth ................................ SUCCESS [05:24 min]
[INFO] Apache Hadoop Auth Examples ....................... SUCCESS [  3.933 s]
[INFO] Apache Hadoop Common .............................. FAILURE [23:15 min]
[INFO] Apache Hadoop NFS ................................. SKIPPED
[INFO] Apache Hadoop KMS ................................. SKIPPED
[INFO] Apache Hadoop Common Project ...................... SKIPPED
[INFO] ------------------------------------------------------------------------
[INFO] BUILD FAILURE
[INFO] ------------------------------------------------------------------------
[INFO] Total time: 29:16 min
[INFO] Finished at: 2015-07-14T09:33:07+00:00
[INFO] Final Memory: 82M/915M
[INFO] ------------------------------------------------------------------------
[ERROR] Failed to execute goal org.apache.maven.plugins:maven-surefire-plugin:2.17:test (default-test)
on project hadoop-common: There are test failures.
[ERROR] 
[ERROR] Please refer to <https://builds.apache.org/job/Hadoop-Common-trunk/ws/hadoop-common-project/hadoop-common/target/surefire-reports>
for the individual test results.
[ERROR] -> [Help 1]
[ERROR] 
[ERROR] To see the full stack trace of the errors, re-run Maven with the -e switch.
[ERROR] Re-run Maven using the -X switch to enable full debug logging.
[ERROR] 
[ERROR] For more information about the errors and possible solutions, please read the following
articles:
[ERROR] [Help 1] http://cwiki.apache.org/confluence/display/MAVEN/MojoFailureException
[ERROR] 
[ERROR] After correcting the problems, you can resume the build with the command
[ERROR]   mvn <goals> -rf :hadoop-common
result: 1
Build step 'Execute shell' marked build as failure
Archiving artifacts
Recording test results

Mime
View raw message