hadoop-common-dev mailing list archives

Site index · List index
Message view « Date » · « Thread »
Top « Date » · « Thread »
From Apache Jenkins Server <jenk...@builds.apache.org>
Subject Build failed in Jenkins: Hadoop-Common-trunk #1560
Date Mon, 20 Jul 2015 09:30:08 GMT
See <https://builds.apache.org/job/Hadoop-Common-trunk/1560/>

------------------------------------------
[...truncated 5207 lines...]
Tests run: 2, Failures: 0, Errors: 0, Skipped: 0, Time elapsed: 0.176 sec - in org.apache.hadoop.util.TestLightWeightGSet
Running org.apache.hadoop.util.TestPureJavaCrc32
Tests run: 1, Failures: 0, Errors: 0, Skipped: 0, Time elapsed: 0.568 sec - in org.apache.hadoop.util.TestPureJavaCrc32
Running org.apache.hadoop.util.TestStringUtils
Tests run: 14, Failures: 0, Errors: 0, Skipped: 0, Time elapsed: 0.328 sec - in org.apache.hadoop.util.TestStringUtils
Running org.apache.hadoop.util.TestProtoUtil
Tests run: 2, Failures: 0, Errors: 0, Skipped: 0, Time elapsed: 0.261 sec - in org.apache.hadoop.util.TestProtoUtil
Running org.apache.hadoop.util.TestSignalLogger
Tests run: 1, Failures: 0, Errors: 0, Skipped: 0, Time elapsed: 0.184 sec - in org.apache.hadoop.util.TestSignalLogger
Running org.apache.hadoop.util.TestDiskChecker
Tests run: 15, Failures: 0, Errors: 0, Skipped: 0, Time elapsed: 1.215 sec - in org.apache.hadoop.util.TestDiskChecker
Running org.apache.hadoop.util.TestShutdownThreadsHelper
Tests run: 2, Failures: 0, Errors: 0, Skipped: 0, Time elapsed: 3.171 sec - in org.apache.hadoop.util.TestShutdownThreadsHelper
Running org.apache.hadoop.util.TestCacheableIPList
Tests run: 4, Failures: 0, Errors: 0, Skipped: 0, Time elapsed: 1.278 sec - in org.apache.hadoop.util.TestCacheableIPList
Running org.apache.hadoop.util.TestLineReader
Tests run: 1, Failures: 0, Errors: 0, Skipped: 0, Time elapsed: 0.193 sec - in org.apache.hadoop.util.TestLineReader
Running org.apache.hadoop.util.TestIdentityHashStore
Tests run: 3, Failures: 0, Errors: 0, Skipped: 0, Time elapsed: 0.197 sec - in org.apache.hadoop.util.TestIdentityHashStore
Running org.apache.hadoop.util.TestClasspath
Tests run: 7, Failures: 0, Errors: 0, Skipped: 0, Time elapsed: 0.331 sec - in org.apache.hadoop.util.TestClasspath
Running org.apache.hadoop.util.TestApplicationClassLoader
Tests run: 4, Failures: 0, Errors: 0, Skipped: 0, Time elapsed: 0.236 sec - in org.apache.hadoop.util.TestApplicationClassLoader
Running org.apache.hadoop.util.TestShell
Tests run: 4, Failures: 0, Errors: 0, Skipped: 0, Time elapsed: 5.233 sec - in org.apache.hadoop.util.TestShell
Running org.apache.hadoop.util.TestShutdownHookManager
Tests run: 1, Failures: 0, Errors: 0, Skipped: 0, Time elapsed: 0.164 sec - in org.apache.hadoop.util.TestShutdownHookManager
Running org.apache.hadoop.util.TestConfTest
Tests run: 14, Failures: 0, Errors: 0, Skipped: 0, Time elapsed: 0.246 sec - in org.apache.hadoop.util.TestConfTest
Running org.apache.hadoop.util.TestHttpExceptionUtils
Tests run: 7, Failures: 0, Errors: 0, Skipped: 0, Time elapsed: 0.686 sec - in org.apache.hadoop.util.TestHttpExceptionUtils
Running org.apache.hadoop.util.TestJarFinder
Tests run: 4, Failures: 0, Errors: 0, Skipped: 0, Time elapsed: 0.756 sec - in org.apache.hadoop.util.TestJarFinder
Running org.apache.hadoop.util.hash.TestHash
Tests run: 1, Failures: 0, Errors: 0, Skipped: 0, Time elapsed: 0.43 sec - in org.apache.hadoop.util.hash.TestHash
Running org.apache.hadoop.util.TestLightWeightCache
Tests run: 1, Failures: 0, Errors: 0, Skipped: 0, Time elapsed: 11.011 sec - in org.apache.hadoop.util.TestLightWeightCache
Running org.apache.hadoop.util.TestNativeCodeLoader
Tests run: 1, Failures: 0, Errors: 0, Skipped: 0, Time elapsed: 0.168 sec - in org.apache.hadoop.util.TestNativeCodeLoader
Running org.apache.hadoop.util.TestReflectionUtils
Tests run: 5, Failures: 0, Errors: 0, Skipped: 0, Time elapsed: 0.653 sec - in org.apache.hadoop.util.TestReflectionUtils
Running org.apache.hadoop.crypto.TestCryptoStreams
Tests run: 14, Failures: 0, Errors: 0, Skipped: 0, Time elapsed: 21.916 sec - in org.apache.hadoop.crypto.TestCryptoStreams
Running org.apache.hadoop.crypto.TestCryptoStreamsForLocalFS
Tests run: 14, Failures: 0, Errors: 0, Skipped: 5, Time elapsed: 12.076 sec - in org.apache.hadoop.crypto.TestCryptoStreamsForLocalFS
Running org.apache.hadoop.crypto.TestOpensslCipher
Tests run: 3, Failures: 0, Errors: 0, Skipped: 0, Time elapsed: 0.193 sec - in org.apache.hadoop.crypto.TestOpensslCipher
Running org.apache.hadoop.crypto.TestCryptoStreamsWithOpensslAesCtrCryptoCodec
Tests run: 14, Failures: 0, Errors: 0, Skipped: 0, Time elapsed: 22.01 sec - in org.apache.hadoop.crypto.TestCryptoStreamsWithOpensslAesCtrCryptoCodec
Running org.apache.hadoop.crypto.TestCryptoStreamsNormal
Tests run: 14, Failures: 0, Errors: 0, Skipped: 8, Time elapsed: 6.829 sec - in org.apache.hadoop.crypto.TestCryptoStreamsNormal
Running org.apache.hadoop.crypto.TestCryptoCodec
Tests run: 3, Failures: 0, Errors: 0, Skipped: 0, Time elapsed: 14.566 sec - in org.apache.hadoop.crypto.TestCryptoCodec
Running org.apache.hadoop.crypto.random.TestOsSecureRandom
Tests run: 6, Failures: 0, Errors: 0, Skipped: 0, Time elapsed: 0.583 sec - in org.apache.hadoop.crypto.random.TestOsSecureRandom
Running org.apache.hadoop.crypto.random.TestOpensslSecureRandom
Tests run: 5, Failures: 0, Errors: 0, Skipped: 0, Time elapsed: 0.174 sec - in org.apache.hadoop.crypto.random.TestOpensslSecureRandom
Running org.apache.hadoop.crypto.TestCryptoStreamsWithJceAesCtrCryptoCodec
Tests run: 14, Failures: 0, Errors: 0, Skipped: 0, Time elapsed: 22.917 sec - in org.apache.hadoop.crypto.TestCryptoStreamsWithJceAesCtrCryptoCodec
Running org.apache.hadoop.crypto.key.TestKeyProviderDelegationTokenExtension
Tests run: 1, Failures: 0, Errors: 0, Skipped: 0, Time elapsed: 0.712 sec - in org.apache.hadoop.crypto.key.TestKeyProviderDelegationTokenExtension
Running org.apache.hadoop.crypto.key.TestCachingKeyProvider
Tests run: 5, Failures: 0, Errors: 0, Skipped: 0, Time elapsed: 2.09 sec - in org.apache.hadoop.crypto.key.TestCachingKeyProvider
Running org.apache.hadoop.crypto.key.TestKeyProviderFactory
Tests run: 8, Failures: 0, Errors: 0, Skipped: 0, Time elapsed: 1.489 sec - in org.apache.hadoop.crypto.key.TestKeyProviderFactory
Running org.apache.hadoop.crypto.key.TestValueQueue
Tests run: 8, Failures: 0, Errors: 0, Skipped: 0, Time elapsed: 1.177 sec - in org.apache.hadoop.crypto.key.TestValueQueue
Running org.apache.hadoop.crypto.key.kms.TestLoadBalancingKMSClientProvider
Tests run: 4, Failures: 0, Errors: 0, Skipped: 0, Time elapsed: 0.91 sec - in org.apache.hadoop.crypto.key.kms.TestLoadBalancingKMSClientProvider
Running org.apache.hadoop.crypto.key.TestKeyProvider
Tests run: 8, Failures: 0, Errors: 0, Skipped: 0, Time elapsed: 0.79 sec - in org.apache.hadoop.crypto.key.TestKeyProvider
Running org.apache.hadoop.crypto.key.TestKeyShell
Tests run: 9, Failures: 0, Errors: 0, Skipped: 0, Time elapsed: 1.524 sec - in org.apache.hadoop.crypto.key.TestKeyShell
Running org.apache.hadoop.crypto.key.TestKeyProviderCryptoExtension
Tests run: 2, Failures: 0, Errors: 0, Skipped: 0, Time elapsed: 0.947 sec - in org.apache.hadoop.crypto.key.TestKeyProviderCryptoExtension
Running org.apache.hadoop.io.TestSequenceFile
Tests run: 8, Failures: 0, Errors: 0, Skipped: 0, Time elapsed: 9.452 sec - in org.apache.hadoop.io.TestSequenceFile
Running org.apache.hadoop.io.TestSecureIOUtils
Tests run: 4, Failures: 0, Errors: 0, Skipped: 0, Time elapsed: 0.766 sec - in org.apache.hadoop.io.TestSecureIOUtils
Running org.apache.hadoop.io.nativeio.TestSharedFileDescriptorFactory
Tests run: 3, Failures: 0, Errors: 0, Skipped: 0, Time elapsed: 0.197 sec - in org.apache.hadoop.io.nativeio.TestSharedFileDescriptorFactory
Running org.apache.hadoop.io.nativeio.TestNativeIO
Tests run: 18, Failures: 0, Errors: 0, Skipped: 0, Time elapsed: 6.985 sec - in org.apache.hadoop.io.nativeio.TestNativeIO
Running org.apache.hadoop.io.TestWritable
Tests run: 7, Failures: 0, Errors: 0, Skipped: 0, Time elapsed: 0.483 sec - in org.apache.hadoop.io.TestWritable
Running org.apache.hadoop.io.TestIOUtils
Tests run: 12, Failures: 0, Errors: 0, Skipped: 0, Time elapsed: 0.426 sec - in org.apache.hadoop.io.TestIOUtils
Running org.apache.hadoop.io.TestTextNonUTF8
Tests run: 1, Failures: 0, Errors: 0, Skipped: 0, Time elapsed: 0.162 sec - in org.apache.hadoop.io.TestTextNonUTF8
Running org.apache.hadoop.io.TestMD5Hash
Tests run: 2, Failures: 0, Errors: 0, Skipped: 0, Time elapsed: 0.187 sec - in org.apache.hadoop.io.TestMD5Hash
Running org.apache.hadoop.io.TestSequenceFileAppend
Tests run: 4, Failures: 0, Errors: 0, Skipped: 0, Time elapsed: 0.885 sec - in org.apache.hadoop.io.TestSequenceFileAppend
Running org.apache.hadoop.io.TestMapFile
Tests run: 21, Failures: 0, Errors: 0, Skipped: 0, Time elapsed: 1.503 sec - in org.apache.hadoop.io.TestMapFile
Running org.apache.hadoop.io.TestWritableName
Tests run: 4, Failures: 0, Errors: 0, Skipped: 0, Time elapsed: 0.165 sec - in org.apache.hadoop.io.TestWritableName
Running org.apache.hadoop.io.TestSortedMapWritable
Tests run: 4, Failures: 0, Errors: 0, Skipped: 0, Time elapsed: 0.21 sec - in org.apache.hadoop.io.TestSortedMapWritable
Running org.apache.hadoop.io.TestSequenceFileSync
Tests run: 1, Failures: 0, Errors: 0, Skipped: 0, Time elapsed: 1.08 sec - in org.apache.hadoop.io.TestSequenceFileSync
Running org.apache.hadoop.io.retry.TestFailoverProxy
Tests run: 9, Failures: 0, Errors: 0, Skipped: 0, Time elapsed: 11.8 sec - in org.apache.hadoop.io.retry.TestFailoverProxy
Running org.apache.hadoop.io.retry.TestDefaultRetryPolicy
Tests run: 3, Failures: 0, Errors: 0, Skipped: 0, Time elapsed: 0.472 sec - in org.apache.hadoop.io.retry.TestDefaultRetryPolicy
Running org.apache.hadoop.io.retry.TestRetryProxy
Tests run: 10, Failures: 0, Errors: 0, Skipped: 0, Time elapsed: 1.211 sec - in org.apache.hadoop.io.retry.TestRetryProxy
Running org.apache.hadoop.io.TestDefaultStringifier
Tests run: 4, Failures: 0, Errors: 0, Skipped: 0, Time elapsed: 0.371 sec - in org.apache.hadoop.io.TestDefaultStringifier
Running org.apache.hadoop.io.TestBloomMapFile
Tests run: 7, Failures: 0, Errors: 0, Skipped: 0, Time elapsed: 1.623 sec - in org.apache.hadoop.io.TestBloomMapFile
Running org.apache.hadoop.io.TestBytesWritable
Tests run: 6, Failures: 0, Errors: 0, Skipped: 0, Time elapsed: 0.202 sec - in org.apache.hadoop.io.TestBytesWritable
Running org.apache.hadoop.io.TestWritableUtils
Tests run: 1, Failures: 0, Errors: 0, Skipped: 0, Time elapsed: 0.161 sec - in org.apache.hadoop.io.TestWritableUtils
Running org.apache.hadoop.io.TestBooleanWritable
Tests run: 2, Failures: 0, Errors: 0, Skipped: 0, Time elapsed: 0.192 sec - in org.apache.hadoop.io.TestBooleanWritable
Running org.apache.hadoop.io.TestDataByteBuffers
Tests run: 5, Failures: 0, Errors: 0, Skipped: 0, Time elapsed: 0.41 sec - in org.apache.hadoop.io.TestDataByteBuffers
Running org.apache.hadoop.io.TestVersionedWritable
Tests run: 3, Failures: 0, Errors: 0, Skipped: 0, Time elapsed: 0.16 sec - in org.apache.hadoop.io.TestVersionedWritable
Running org.apache.hadoop.io.TestEnumSetWritable
Tests run: 6, Failures: 0, Errors: 0, Skipped: 0, Time elapsed: 0.543 sec - in org.apache.hadoop.io.TestEnumSetWritable
Running org.apache.hadoop.io.TestMapWritable
Tests run: 5, Failures: 0, Errors: 0, Skipped: 0, Time elapsed: 0.203 sec - in org.apache.hadoop.io.TestMapWritable
Running org.apache.hadoop.io.TestArrayPrimitiveWritable
Tests run: 3, Failures: 0, Errors: 0, Skipped: 0, Time elapsed: 0.18 sec - in org.apache.hadoop.io.TestArrayPrimitiveWritable
Running org.apache.hadoop.io.TestSetFile
Tests run: 2, Failures: 0, Errors: 0, Skipped: 0, Time elapsed: 2.032 sec - in org.apache.hadoop.io.TestSetFile
Running org.apache.hadoop.io.TestUTF8
Tests run: 8, Failures: 0, Errors: 0, Skipped: 0, Time elapsed: 0.772 sec - in org.apache.hadoop.io.TestUTF8
Running org.apache.hadoop.io.TestBoundedByteArrayOutputStream
Tests run: 2, Failures: 0, Errors: 0, Skipped: 0, Time elapsed: 0.053 sec - in org.apache.hadoop.io.TestBoundedByteArrayOutputStream
Running org.apache.hadoop.io.compress.TestCodecPool
Tests run: 6, Failures: 0, Errors: 0, Skipped: 0, Time elapsed: 0.444 sec - in org.apache.hadoop.io.compress.TestCodecPool
Running org.apache.hadoop.io.compress.lz4.TestLz4CompressorDecompressor
Tests run: 13, Failures: 0, Errors: 0, Skipped: 0, Time elapsed: 0.336 sec - in org.apache.hadoop.io.compress.lz4.TestLz4CompressorDecompressor
Running org.apache.hadoop.io.compress.TestBlockDecompressorStream
Tests run: 2, Failures: 0, Errors: 0, Skipped: 0, Time elapsed: 0.079 sec - in org.apache.hadoop.io.compress.TestBlockDecompressorStream
Running org.apache.hadoop.io.compress.TestCodec
Tests run: 25, Failures: 0, Errors: 0, Skipped: 0, Time elapsed: 132.711 sec - in org.apache.hadoop.io.compress.TestCodec
Running org.apache.hadoop.io.compress.TestCompressorStream
Tests run: 1, Failures: 0, Errors: 0, Skipped: 0, Time elapsed: 0.079 sec - in org.apache.hadoop.io.compress.TestCompressorStream
Running org.apache.hadoop.io.compress.TestCompressorDecompressor
Tests run: 2, Failures: 0, Errors: 0, Skipped: 0, Time elapsed: 0.633 sec - in org.apache.hadoop.io.compress.TestCompressorDecompressor
Running org.apache.hadoop.io.compress.zlib.TestZlibCompressorDecompressor
Tests run: 9, Failures: 0, Errors: 0, Skipped: 0, Time elapsed: 1.053 sec - in org.apache.hadoop.io.compress.zlib.TestZlibCompressorDecompressor
Running org.apache.hadoop.io.compress.TestCodecFactory
Tests run: 1, Failures: 0, Errors: 0, Skipped: 0, Time elapsed: 0.544 sec - in org.apache.hadoop.io.compress.TestCodecFactory
Running org.apache.hadoop.io.compress.TestCompressionStreamReuse
Tests run: 3, Failures: 0, Errors: 0, Skipped: 0, Time elapsed: 4.243 sec - in org.apache.hadoop.io.compress.TestCompressionStreamReuse
Running org.apache.hadoop.io.compress.snappy.TestSnappyCompressorDecompressor
Tests run: 14, Failures: 0, Errors: 0, Skipped: 0, Time elapsed: 0.39 sec - in org.apache.hadoop.io.compress.snappy.TestSnappyCompressorDecompressor
Running org.apache.hadoop.io.compress.bzip2.TestBzip2CompressorDecompressor
Tests run: 2, Failures: 0, Errors: 0, Skipped: 2, Time elapsed: 0.393 sec - in org.apache.hadoop.io.compress.bzip2.TestBzip2CompressorDecompressor
Running org.apache.hadoop.io.serializer.TestSerializationFactory
Tests run: 5, Failures: 0, Errors: 0, Skipped: 0, Time elapsed: 0.538 sec - in org.apache.hadoop.io.serializer.TestSerializationFactory
Running org.apache.hadoop.io.serializer.avro.TestAvroSerialization
Tests run: 5, Failures: 0, Errors: 0, Skipped: 0, Time elapsed: 0.67 sec - in org.apache.hadoop.io.serializer.avro.TestAvroSerialization
Running org.apache.hadoop.io.serializer.TestWritableSerialization
Tests run: 3, Failures: 0, Errors: 0, Skipped: 0, Time elapsed: 0.393 sec - in org.apache.hadoop.io.serializer.TestWritableSerialization
Running org.apache.hadoop.io.TestGenericWritable
Tests run: 5, Failures: 0, Errors: 0, Skipped: 0, Time elapsed: 0.536 sec - in org.apache.hadoop.io.TestGenericWritable
Running org.apache.hadoop.io.TestText
Tests run: 18, Failures: 0, Errors: 0, Skipped: 0, Time elapsed: 0.738 sec - in org.apache.hadoop.io.TestText
Running org.apache.hadoop.io.file.tfile.TestTFileNoneCodecsStreams
Tests run: 19, Failures: 0, Errors: 0, Skipped: 0, Time elapsed: 1.829 sec - in org.apache.hadoop.io.file.tfile.TestTFileNoneCodecsStreams
Running org.apache.hadoop.io.file.tfile.TestTFileLzoCodecsByteArrays
Tests run: 25, Failures: 0, Errors: 0, Skipped: 0, Time elapsed: 0.377 sec - in org.apache.hadoop.io.file.tfile.TestTFileLzoCodecsByteArrays
Running org.apache.hadoop.io.file.tfile.TestTFileSeek
Tests run: 1, Failures: 0, Errors: 0, Skipped: 0, Time elapsed: 3.001 sec - in org.apache.hadoop.io.file.tfile.TestTFileSeek
Running org.apache.hadoop.io.file.tfile.TestTFileSplit
Tests run: 1, Failures: 0, Errors: 0, Skipped: 0, Time elapsed: 4.217 sec - in org.apache.hadoop.io.file.tfile.TestTFileSplit
Running org.apache.hadoop.io.file.tfile.TestTFileSeqFileComparison
Tests run: 1, Failures: 0, Errors: 0, Skipped: 0, Time elapsed: 4.208 sec - in org.apache.hadoop.io.file.tfile.TestTFileSeqFileComparison
Running org.apache.hadoop.io.file.tfile.TestTFileByteArrays
Tests run: 25, Failures: 0, Errors: 0, Skipped: 0, Time elapsed: 2.622 sec - in org.apache.hadoop.io.file.tfile.TestTFileByteArrays
Running org.apache.hadoop.io.file.tfile.TestTFileComparator2
Tests run: 1, Failures: 0, Errors: 0, Skipped: 0, Time elapsed: 1.65 sec - in org.apache.hadoop.io.file.tfile.TestTFileComparator2
Running org.apache.hadoop.io.file.tfile.TestTFileNoneCodecsByteArrays
Tests run: 25, Failures: 0, Errors: 0, Skipped: 0, Time elapsed: 1.534 sec - in org.apache.hadoop.io.file.tfile.TestTFileNoneCodecsByteArrays
Running org.apache.hadoop.io.file.tfile.TestTFileNoneCodecsJClassComparatorByteArrays
Tests run: 25, Failures: 0, Errors: 0, Skipped: 0, Time elapsed: 1.505 sec - in org.apache.hadoop.io.file.tfile.TestTFileNoneCodecsJClassComparatorByteArrays
Running org.apache.hadoop.io.file.tfile.TestTFileJClassComparatorByteArrays
Tests run: 25, Failures: 0, Errors: 0, Skipped: 0, Time elapsed: 2.721 sec - in org.apache.hadoop.io.file.tfile.TestTFileJClassComparatorByteArrays
Running org.apache.hadoop.io.file.tfile.TestTFileLzoCodecsStreams
Tests run: 19, Failures: 0, Errors: 0, Skipped: 0, Time elapsed: 0.342 sec - in org.apache.hadoop.io.file.tfile.TestTFileLzoCodecsStreams
Running org.apache.hadoop.io.file.tfile.TestTFileComparators
Tests run: 3, Failures: 0, Errors: 0, Skipped: 0, Time elapsed: 0.779 sec - in org.apache.hadoop.io.file.tfile.TestTFileComparators
Running org.apache.hadoop.io.file.tfile.TestTFileStreams
Tests run: 19, Failures: 0, Errors: 0, Skipped: 0, Time elapsed: 1.889 sec - in org.apache.hadoop.io.file.tfile.TestTFileStreams
Running org.apache.hadoop.io.file.tfile.TestTFileUnsortedByteArrays
Tests run: 4, Failures: 0, Errors: 0, Skipped: 0, Time elapsed: 0.886 sec - in org.apache.hadoop.io.file.tfile.TestTFileUnsortedByteArrays
Running org.apache.hadoop.io.file.tfile.TestVLong
Tests run: 9, Failures: 0, Errors: 0, Skipped: 0, Time elapsed: 1.652 sec - in org.apache.hadoop.io.file.tfile.TestVLong
Running org.apache.hadoop.io.file.tfile.TestTFile
Tests run: 3, Failures: 0, Errors: 0, Skipped: 0, Time elapsed: 1.27 sec - in org.apache.hadoop.io.file.tfile.TestTFile
Running org.apache.hadoop.io.TestObjectWritableProtos
Tests run: 3, Failures: 0, Errors: 0, Skipped: 0, Time elapsed: 0.366 sec - in org.apache.hadoop.io.TestObjectWritableProtos
Running org.apache.hadoop.io.TestArrayWritable
Tests run: 4, Failures: 0, Errors: 0, Skipped: 0, Time elapsed: 0.183 sec - in org.apache.hadoop.io.TestArrayWritable
Running org.apache.hadoop.io.TestSequenceFileSerialization
Tests run: 1, Failures: 0, Errors: 0, Skipped: 0, Time elapsed: 0.798 sec - in org.apache.hadoop.io.TestSequenceFileSerialization
Running org.apache.hadoop.io.TestArrayFile
Tests run: 3, Failures: 0, Errors: 0, Skipped: 0, Time elapsed: 2.848 sec - in org.apache.hadoop.io.TestArrayFile

Results :

Tests in error: 
  TestZKFailoverController>ClientBaseWithFixes.setUp:409->ClientBaseWithFixes.startServer:445->ClientBaseWithFixes.createNewServerInstance:348
» Bind
  TestActiveStandbyElectorRealZK.setUp:63->ClientBaseWithFixes.setUp:409->ClientBaseWithFixes.startServer:445->ClientBaseWithFixes.createNewServerInstance:348
» Bind

Tests run: 3091, Failures: 0, Errors: 2, Skipped: 86

[INFO] ------------------------------------------------------------------------
[INFO] Reactor Summary:
[INFO] 
[INFO] Apache Hadoop Annotations ......................... SUCCESS [  7.903 s]
[INFO] Apache Hadoop MiniKDC ............................. SUCCESS [ 21.664 s]
[INFO] Apache Hadoop Auth ................................ SUCCESS [05:24 min]
[INFO] Apache Hadoop Auth Examples ....................... SUCCESS [  3.904 s]
[INFO] Apache Hadoop Common .............................. FAILURE [22:03 min]
[INFO] Apache Hadoop NFS ................................. SKIPPED
[INFO] Apache Hadoop KMS ................................. SKIPPED
[INFO] Apache Hadoop Common Project ...................... SKIPPED
[INFO] ------------------------------------------------------------------------
[INFO] BUILD FAILURE
[INFO] ------------------------------------------------------------------------
[INFO] Total time: 28:02 min
[INFO] Finished at: 2015-07-20T09:30:20+00:00
[INFO] Final Memory: 82M/995M
[INFO] ------------------------------------------------------------------------
[ERROR] Failed to execute goal org.apache.maven.plugins:maven-surefire-plugin:2.17:test (default-test)
on project hadoop-common: There are test failures.
[ERROR] 
[ERROR] Please refer to <https://builds.apache.org/job/Hadoop-Common-trunk/ws/hadoop-common-project/hadoop-common/target/surefire-reports>
for the individual test results.
[ERROR] -> [Help 1]
[ERROR] 
[ERROR] To see the full stack trace of the errors, re-run Maven with the -e switch.
[ERROR] Re-run Maven using the -X switch to enable full debug logging.
[ERROR] 
[ERROR] For more information about the errors and possible solutions, please read the following
articles:
[ERROR] [Help 1] http://cwiki.apache.org/confluence/display/MAVEN/MojoFailureException
[ERROR] 
[ERROR] After correcting the problems, you can resume the build with the command
[ERROR]   mvn <goals> -rf :hadoop-common
result: 1
Build step 'Execute shell' marked build as failure
Archiving artifacts
Recording test results

Mime
View raw message