hadoop-common-dev mailing list archives

Site index · List index
Message view « Date » · « Thread »
Top « Date » · « Thread »
From Apache Jenkins Server <jenk...@builds.apache.org>
Subject Build failed in Jenkins: Hadoop-common-trunk-Java8 #218
Date Thu, 04 Jun 2015 09:44:41 GMT
See <https://builds.apache.org/job/Hadoop-common-trunk-Java8/218/changes>

Changes:

[vinayakumarb] HDFS-8523. Remove usage information on unsupported operation 'fsck -showprogress'
from branch-2 (Contributed by J.Andreina)

[vinayakumarb] HDFS-3716. Purger should remove stale fsimage ckpt files (Contributed by J.Andreina)

[zjshen] YARN-3751. Fixed AppInfo to check if used resources are null. Contributed by Sunil
G.

[jlowe] YARN-3585. NodeManager cannot exit on SHUTDOWN event triggered and NM recovery is
enabled. Contributed by Rohith Sharmaks

[jlowe] MAPREDUCE-6374. Distributed Cache File visibility should check permission of full
path. Contributed by Chang Li

[kasha] YARN-3762. FairScheduler: CME on FSParentQueue#getQueueUserAclInfo. (kasha)

[zjshen] Revert "YARN-1462. Correct fix version from branch-2.7.1 to branch-2.8 in"

[zjshen] Revert "YARN-1462. Made RM write application tags to timeline server and exposed
them to users via generic history web UI and REST API. Contributed by Xuan Gong."

[gera] MAPREDUCE-6174. Combine common stream code into parent class for InMemoryMapOutput
and OnDiskMapOutput. (Eric Payne via gera)

[xgong] YARN-3749. We should make a copy of configuration when init

[rkanter] MAPREDUCE-5965. Hadoop streaming throws error if list of input files is high. Error
is: "error=7, Argument list too long at if number of input file is high" (wilfreds via rkanter)

[aajisaka] HADOOP-12018. smart-apply-patch.sh fails if the patch edits CR+LF files and is
created by 'git diff --no-prefix'. Contributed by Kengo Seki.

[vinayakumarb] HADOOP-12019. update BUILDING.txt to include python for 'mvn site' in windows
(Contributed by Vinayakumar B)

[gera] MAPREDUCE-6382. Don't escape HTML links in Diagnostics in JHS job overview. (Siqi Li
via gera)

------------------------------------------
[...truncated 5505 lines...]
Java HotSpot(TM) 64-Bit Server VM warning: ignoring option MaxPermSize=768m; support was removed
in 8.0
Running org.apache.hadoop.fs.shell.TestPathData
Tests run: 11, Failures: 0, Errors: 0, Skipped: 0, Time elapsed: 0.735 sec - in org.apache.hadoop.fs.shell.TestPathData
Java HotSpot(TM) 64-Bit Server VM warning: ignoring option MaxPermSize=768m; support was removed
in 8.0
Running org.apache.hadoop.fs.shell.TestCount
Tests run: 22, Failures: 0, Errors: 0, Skipped: 0, Time elapsed: 0.768 sec - in org.apache.hadoop.fs.shell.TestCount
Java HotSpot(TM) 64-Bit Server VM warning: ignoring option MaxPermSize=768m; support was removed
in 8.0
Running org.apache.hadoop.fs.contract.rawlocal.TestRawlocalContractRename
Tests run: 7, Failures: 0, Errors: 0, Skipped: 0, Time elapsed: 0.684 sec - in org.apache.hadoop.fs.contract.rawlocal.TestRawlocalContractRename
Java HotSpot(TM) 64-Bit Server VM warning: ignoring option MaxPermSize=768m; support was removed
in 8.0
Running org.apache.hadoop.fs.contract.rawlocal.TestRawlocalContractAppend
Tests run: 5, Failures: 0, Errors: 0, Skipped: 5, Time elapsed: 0.585 sec - in org.apache.hadoop.fs.contract.rawlocal.TestRawlocalContractAppend
Java HotSpot(TM) 64-Bit Server VM warning: ignoring option MaxPermSize=768m; support was removed
in 8.0
Running org.apache.hadoop.fs.contract.rawlocal.TestRawlocalContractDelete
Tests run: 8, Failures: 0, Errors: 0, Skipped: 0, Time elapsed: 0.642 sec - in org.apache.hadoop.fs.contract.rawlocal.TestRawlocalContractDelete
Java HotSpot(TM) 64-Bit Server VM warning: ignoring option MaxPermSize=768m; support was removed
in 8.0
Running org.apache.hadoop.fs.contract.rawlocal.TestRawlocalContractSeek
Tests run: 10, Failures: 0, Errors: 0, Skipped: 0, Time elapsed: 0.815 sec - in org.apache.hadoop.fs.contract.rawlocal.TestRawlocalContractSeek
Java HotSpot(TM) 64-Bit Server VM warning: ignoring option MaxPermSize=768m; support was removed
in 8.0
Running org.apache.hadoop.fs.contract.rawlocal.TestRawlocalContractOpen
Tests run: 6, Failures: 0, Errors: 0, Skipped: 0, Time elapsed: 0.658 sec - in org.apache.hadoop.fs.contract.rawlocal.TestRawlocalContractOpen
Java HotSpot(TM) 64-Bit Server VM warning: ignoring option MaxPermSize=768m; support was removed
in 8.0
Running org.apache.hadoop.fs.contract.rawlocal.TestRawlocalContractMkdir
Tests run: 5, Failures: 0, Errors: 0, Skipped: 0, Time elapsed: 0.626 sec - in org.apache.hadoop.fs.contract.rawlocal.TestRawlocalContractMkdir
Java HotSpot(TM) 64-Bit Server VM warning: ignoring option MaxPermSize=768m; support was removed
in 8.0
Running org.apache.hadoop.fs.contract.rawlocal.TestRawLocalContractUnderlyingFileBehavior
Tests run: 1, Failures: 0, Errors: 0, Skipped: 0, Time elapsed: 0.176 sec - in org.apache.hadoop.fs.contract.rawlocal.TestRawLocalContractUnderlyingFileBehavior
Java HotSpot(TM) 64-Bit Server VM warning: ignoring option MaxPermSize=768m; support was removed
in 8.0
Running org.apache.hadoop.fs.contract.rawlocal.TestRawlocalContractCreate
Tests run: 6, Failures: 0, Errors: 0, Skipped: 0, Time elapsed: 0.665 sec - in org.apache.hadoop.fs.contract.rawlocal.TestRawlocalContractCreate
Java HotSpot(TM) 64-Bit Server VM warning: ignoring option MaxPermSize=768m; support was removed
in 8.0
Running org.apache.hadoop.fs.contract.ftp.TestFTPContractCreate
Tests run: 6, Failures: 0, Errors: 0, Skipped: 6, Time elapsed: 0.413 sec - in org.apache.hadoop.fs.contract.ftp.TestFTPContractCreate
Java HotSpot(TM) 64-Bit Server VM warning: ignoring option MaxPermSize=768m; support was removed
in 8.0
Running org.apache.hadoop.fs.contract.ftp.TestFTPContractDelete
Tests run: 8, Failures: 0, Errors: 0, Skipped: 8, Time elapsed: 0.45 sec - in org.apache.hadoop.fs.contract.ftp.TestFTPContractDelete
Java HotSpot(TM) 64-Bit Server VM warning: ignoring option MaxPermSize=768m; support was removed
in 8.0
Running org.apache.hadoop.fs.contract.ftp.TestFTPContractRename
Tests run: 6, Failures: 0, Errors: 0, Skipped: 6, Time elapsed: 0.418 sec - in org.apache.hadoop.fs.contract.ftp.TestFTPContractRename
Java HotSpot(TM) 64-Bit Server VM warning: ignoring option MaxPermSize=768m; support was removed
in 8.0
Running org.apache.hadoop.fs.contract.ftp.TestFTPContractMkdir
Tests run: 5, Failures: 0, Errors: 0, Skipped: 5, Time elapsed: 0.393 sec - in org.apache.hadoop.fs.contract.ftp.TestFTPContractMkdir
Java HotSpot(TM) 64-Bit Server VM warning: ignoring option MaxPermSize=768m; support was removed
in 8.0
Running org.apache.hadoop.fs.contract.ftp.TestFTPContractOpen
Tests run: 6, Failures: 0, Errors: 0, Skipped: 6, Time elapsed: 0.474 sec - in org.apache.hadoop.fs.contract.ftp.TestFTPContractOpen
Java HotSpot(TM) 64-Bit Server VM warning: ignoring option MaxPermSize=768m; support was removed
in 8.0
Running org.apache.hadoop.fs.contract.localfs.TestLocalFSContractAppend
Tests run: 5, Failures: 0, Errors: 0, Skipped: 5, Time elapsed: 0.598 sec - in org.apache.hadoop.fs.contract.localfs.TestLocalFSContractAppend
Java HotSpot(TM) 64-Bit Server VM warning: ignoring option MaxPermSize=768m; support was removed
in 8.0
Running org.apache.hadoop.fs.contract.localfs.TestLocalFSContractOpen
Tests run: 6, Failures: 0, Errors: 0, Skipped: 0, Time elapsed: 0.701 sec - in org.apache.hadoop.fs.contract.localfs.TestLocalFSContractOpen
Java HotSpot(TM) 64-Bit Server VM warning: ignoring option MaxPermSize=768m; support was removed
in 8.0
Running org.apache.hadoop.fs.contract.localfs.TestLocalFSContractLoaded
Tests run: 2, Failures: 0, Errors: 0, Skipped: 0, Time elapsed: 0.558 sec - in org.apache.hadoop.fs.contract.localfs.TestLocalFSContractLoaded
Java HotSpot(TM) 64-Bit Server VM warning: ignoring option MaxPermSize=768m; support was removed
in 8.0
Running org.apache.hadoop.fs.contract.localfs.TestLocalFSContractDelete
Tests run: 8, Failures: 0, Errors: 0, Skipped: 0, Time elapsed: 0.664 sec - in org.apache.hadoop.fs.contract.localfs.TestLocalFSContractDelete
Java HotSpot(TM) 64-Bit Server VM warning: ignoring option MaxPermSize=768m; support was removed
in 8.0
Running org.apache.hadoop.fs.contract.localfs.TestLocalFSContractMkdir
Tests run: 5, Failures: 0, Errors: 0, Skipped: 0, Time elapsed: 0.626 sec - in org.apache.hadoop.fs.contract.localfs.TestLocalFSContractMkdir
Java HotSpot(TM) 64-Bit Server VM warning: ignoring option MaxPermSize=768m; support was removed
in 8.0
Running org.apache.hadoop.fs.contract.localfs.TestLocalFSContractRename
Tests run: 6, Failures: 0, Errors: 0, Skipped: 0, Time elapsed: 0.641 sec - in org.apache.hadoop.fs.contract.localfs.TestLocalFSContractRename
Java HotSpot(TM) 64-Bit Server VM warning: ignoring option MaxPermSize=768m; support was removed
in 8.0
Running org.apache.hadoop.fs.contract.localfs.TestLocalFSContractCreate
Tests run: 6, Failures: 0, Errors: 0, Skipped: 0, Time elapsed: 0.689 sec - in org.apache.hadoop.fs.contract.localfs.TestLocalFSContractCreate
Java HotSpot(TM) 64-Bit Server VM warning: ignoring option MaxPermSize=768m; support was removed
in 8.0
Running org.apache.hadoop.fs.contract.localfs.TestLocalFSContractSeek
Tests run: 10, Failures: 0, Errors: 0, Skipped: 0, Time elapsed: 0.835 sec - in org.apache.hadoop.fs.contract.localfs.TestLocalFSContractSeek
Java HotSpot(TM) 64-Bit Server VM warning: ignoring option MaxPermSize=768m; support was removed
in 8.0
Running org.apache.hadoop.fs.TestContentSummary
Tests run: 13, Failures: 0, Errors: 0, Skipped: 0, Time elapsed: 0.394 sec - in org.apache.hadoop.fs.TestContentSummary
Java HotSpot(TM) 64-Bit Server VM warning: ignoring option MaxPermSize=768m; support was removed
in 8.0
Running org.apache.hadoop.fs.TestTrash
Tests run: 4, Failures: 0, Errors: 0, Skipped: 0, Time elapsed: 15.769 sec - in org.apache.hadoop.fs.TestTrash
Java HotSpot(TM) 64-Bit Server VM warning: ignoring option MaxPermSize=768m; support was removed
in 8.0
Running org.apache.hadoop.fs.TestLocalFSFileContextCreateMkdir
Tests run: 8, Failures: 0, Errors: 0, Skipped: 0, Time elapsed: 0.617 sec - in org.apache.hadoop.fs.TestLocalFSFileContextCreateMkdir
Java HotSpot(TM) 64-Bit Server VM warning: ignoring option MaxPermSize=768m; support was removed
in 8.0
Running org.apache.hadoop.fs.TestLocalFsFCStatistics
Tests run: 2, Failures: 0, Errors: 0, Skipped: 0, Time elapsed: 0.605 sec - in org.apache.hadoop.fs.TestLocalFsFCStatistics
Java HotSpot(TM) 64-Bit Server VM warning: ignoring option MaxPermSize=768m; support was removed
in 8.0
Running org.apache.hadoop.fs.TestFileStatus
Tests run: 10, Failures: 0, Errors: 0, Skipped: 0, Time elapsed: 0.197 sec - in org.apache.hadoop.fs.TestFileStatus
Java HotSpot(TM) 64-Bit Server VM warning: ignoring option MaxPermSize=768m; support was removed
in 8.0
Running org.apache.hadoop.fs.TestCommandFormat
Tests run: 10, Failures: 0, Errors: 0, Skipped: 0, Time elapsed: 0.114 sec - in org.apache.hadoop.fs.TestCommandFormat
Java HotSpot(TM) 64-Bit Server VM warning: ignoring option MaxPermSize=768m; support was removed
in 8.0
Running org.apache.hadoop.jmx.TestJMXJsonServlet
Tests run: 1, Failures: 0, Errors: 0, Skipped: 0, Time elapsed: 0.949 sec - in org.apache.hadoop.jmx.TestJMXJsonServlet
Java HotSpot(TM) 64-Bit Server VM warning: ignoring option MaxPermSize=768m; support was removed
in 8.0
Running org.apache.hadoop.http.TestGlobalFilter
Tests run: 1, Failures: 0, Errors: 0, Skipped: 0, Time elapsed: 0.902 sec - in org.apache.hadoop.http.TestGlobalFilter
Java HotSpot(TM) 64-Bit Server VM warning: ignoring option MaxPermSize=768m; support was removed
in 8.0
Running org.apache.hadoop.http.TestPathFilter
Tests run: 1, Failures: 0, Errors: 0, Skipped: 0, Time elapsed: 0.868 sec - in org.apache.hadoop.http.TestPathFilter
Java HotSpot(TM) 64-Bit Server VM warning: ignoring option MaxPermSize=768m; support was removed
in 8.0
Running org.apache.hadoop.http.TestHttpCookieFlag
Tests run: 2, Failures: 0, Errors: 0, Skipped: 0, Time elapsed: 1.379 sec - in org.apache.hadoop.http.TestHttpCookieFlag
Java HotSpot(TM) 64-Bit Server VM warning: ignoring option MaxPermSize=768m; support was removed
in 8.0
Running org.apache.hadoop.http.TestHttpRequestLogAppender
Tests run: 1, Failures: 0, Errors: 0, Skipped: 0, Time elapsed: 0.091 sec - in org.apache.hadoop.http.TestHttpRequestLogAppender
Java HotSpot(TM) 64-Bit Server VM warning: ignoring option MaxPermSize=768m; support was removed
in 8.0
Running org.apache.hadoop.http.TestHtmlQuoting
Tests run: 4, Failures: 0, Errors: 0, Skipped: 0, Time elapsed: 0.268 sec - in org.apache.hadoop.http.TestHtmlQuoting
Java HotSpot(TM) 64-Bit Server VM warning: ignoring option MaxPermSize=768m; support was removed
in 8.0
Running org.apache.hadoop.http.TestHttpRequestLog
Tests run: 2, Failures: 0, Errors: 0, Skipped: 0, Time elapsed: 0.169 sec - in org.apache.hadoop.http.TestHttpRequestLog
Java HotSpot(TM) 64-Bit Server VM warning: ignoring option MaxPermSize=768m; support was removed
in 8.0
Running org.apache.hadoop.http.TestHttpServerWebapps
Tests run: 2, Failures: 0, Errors: 0, Skipped: 0, Time elapsed: 0.493 sec - in org.apache.hadoop.http.TestHttpServerWebapps
Java HotSpot(TM) 64-Bit Server VM warning: ignoring option MaxPermSize=768m; support was removed
in 8.0
Running org.apache.hadoop.http.TestHttpServerLifecycle
Java HotSpot(TM) 64-Bit Server VM warning: ignoring option MaxPermSize=768m; support was removed
in 8.0
Running org.apache.hadoop.http.TestHttpServer
Tests run: 14, Failures: 0, Errors: 0, Skipped: 0, Time elapsed: 2.87 sec - in org.apache.hadoop.http.TestHttpServer
Java HotSpot(TM) 64-Bit Server VM warning: ignoring option MaxPermSize=768m; support was removed
in 8.0
Running org.apache.hadoop.http.lib.TestStaticUserWebFilter
Tests run: 3, Failures: 0, Errors: 0, Skipped: 0, Time elapsed: 0.48 sec - in org.apache.hadoop.http.lib.TestStaticUserWebFilter
Java HotSpot(TM) 64-Bit Server VM warning: ignoring option MaxPermSize=768m; support was removed
in 8.0
Running org.apache.hadoop.http.TestServletFilter
Tests run: 3, Failures: 0, Errors: 0, Skipped: 0, Time elapsed: 1.25 sec - in org.apache.hadoop.http.TestServletFilter
Java HotSpot(TM) 64-Bit Server VM warning: ignoring option MaxPermSize=768m; support was removed
in 8.0
Running org.apache.hadoop.http.TestSSLHttpServer
Tests run: 2, Failures: 0, Errors: 0, Skipped: 0, Time elapsed: 1.37 sec - in org.apache.hadoop.http.TestSSLHttpServer
Java HotSpot(TM) 64-Bit Server VM warning: ignoring option MaxPermSize=768m; support was removed
in 8.0
Running org.apache.hadoop.metrics2.sink.TestFileSink
Tests run: 1, Failures: 0, Errors: 0, Skipped: 0, Time elapsed: 0.455 sec - in org.apache.hadoop.metrics2.sink.TestFileSink
Java HotSpot(TM) 64-Bit Server VM warning: ignoring option MaxPermSize=768m; support was removed
in 8.0
Running org.apache.hadoop.metrics2.sink.ganglia.TestGangliaSink
Tests run: 4, Failures: 0, Errors: 0, Skipped: 0, Time elapsed: 0.234 sec - in org.apache.hadoop.metrics2.sink.ganglia.TestGangliaSink
Java HotSpot(TM) 64-Bit Server VM warning: ignoring option MaxPermSize=768m; support was removed
in 8.0
Running org.apache.hadoop.metrics2.util.TestSampleStat
Tests run: 1, Failures: 0, Errors: 0, Skipped: 0, Time elapsed: 0.075 sec - in org.apache.hadoop.metrics2.util.TestSampleStat
Java HotSpot(TM) 64-Bit Server VM warning: ignoring option MaxPermSize=768m; support was removed
in 8.0
Running org.apache.hadoop.metrics2.util.TestSampleQuantiles
Tests run: 3, Failures: 0, Errors: 0, Skipped: 0, Time elapsed: 0.67 sec - in org.apache.hadoop.metrics2.util.TestSampleQuantiles
Java HotSpot(TM) 64-Bit Server VM warning: ignoring option MaxPermSize=768m; support was removed
in 8.0
Running org.apache.hadoop.metrics2.util.TestMetricsCache
Tests run: 4, Failures: 0, Errors: 0, Skipped: 0, Time elapsed: 1.464 sec - in org.apache.hadoop.metrics2.util.TestMetricsCache
Java HotSpot(TM) 64-Bit Server VM warning: ignoring option MaxPermSize=768m; support was removed
in 8.0
Running org.apache.hadoop.metrics2.impl.TestMetricsSourceAdapter
Tests run: 2, Failures: 0, Errors: 0, Skipped: 0, Time elapsed: 1.423 sec - in org.apache.hadoop.metrics2.impl.TestMetricsSourceAdapter
Java HotSpot(TM) 64-Bit Server VM warning: ignoring option MaxPermSize=768m; support was removed
in 8.0
Running org.apache.hadoop.metrics2.impl.TestSinkQueue
Tests run: 8, Failures: 0, Errors: 0, Skipped: 0, Time elapsed: 0.428 sec - in org.apache.hadoop.metrics2.impl.TestSinkQueue
Java HotSpot(TM) 64-Bit Server VM warning: ignoring option MaxPermSize=768m; support was removed
in 8.0
Running org.apache.hadoop.metrics2.impl.TestMetricsCollectorImpl
Tests run: 2, Failures: 0, Errors: 0, Skipped: 0, Time elapsed: 0.22 sec - in org.apache.hadoop.metrics2.impl.TestMetricsCollectorImpl
Java HotSpot(TM) 64-Bit Server VM warning: ignoring option MaxPermSize=768m; support was removed
in 8.0
Running org.apache.hadoop.metrics2.impl.TestMetricsVisitor
Tests run: 1, Failures: 0, Errors: 0, Skipped: 0, Time elapsed: 0.361 sec - in org.apache.hadoop.metrics2.impl.TestMetricsVisitor
Java HotSpot(TM) 64-Bit Server VM warning: ignoring option MaxPermSize=768m; support was removed
in 8.0
Running org.apache.hadoop.metrics2.impl.TestGraphiteMetrics
Tests run: 5, Failures: 0, Errors: 0, Skipped: 0, Time elapsed: 0.321 sec - in org.apache.hadoop.metrics2.impl.TestGraphiteMetrics
Java HotSpot(TM) 64-Bit Server VM warning: ignoring option MaxPermSize=768m; support was removed
in 8.0
Running org.apache.hadoop.metrics2.impl.TestMetricsConfig
Tests run: 3, Failures: 0, Errors: 0, Skipped: 0, Time elapsed: 0.274 sec - in org.apache.hadoop.metrics2.impl.TestMetricsConfig
Java HotSpot(TM) 64-Bit Server VM warning: ignoring option MaxPermSize=768m; support was removed
in 8.0
Running org.apache.hadoop.metrics2.impl.TestMetricsSystemImpl
Tests run: 10, Failures: 0, Errors: 0, Skipped: 0, Time elapsed: 1.66 sec - in org.apache.hadoop.metrics2.impl.TestMetricsSystemImpl
Java HotSpot(TM) 64-Bit Server VM warning: ignoring option MaxPermSize=768m; support was removed
in 8.0
Running org.apache.hadoop.metrics2.impl.TestGangliaMetrics
Tests run: 2, Failures: 0, Errors: 0, Skipped: 0, Time elapsed: 0.402 sec - in org.apache.hadoop.metrics2.impl.TestGangliaMetrics
Java HotSpot(TM) 64-Bit Server VM warning: ignoring option MaxPermSize=768m; support was removed
in 8.0
Running org.apache.hadoop.metrics2.source.TestJvmMetrics
Tests run: 1, Failures: 0, Errors: 0, Skipped: 0, Time elapsed: 0.469 sec - in org.apache.hadoop.metrics2.source.TestJvmMetrics
Java HotSpot(TM) 64-Bit Server VM warning: ignoring option MaxPermSize=768m; support was removed
in 8.0
Running org.apache.hadoop.metrics2.filter.TestPatternFilter
Tests run: 5, Failures: 0, Errors: 0, Skipped: 0, Time elapsed: 0.369 sec - in org.apache.hadoop.metrics2.filter.TestPatternFilter
Java HotSpot(TM) 64-Bit Server VM warning: ignoring option MaxPermSize=768m; support was removed
in 8.0
Running org.apache.hadoop.metrics2.lib.TestMetricsAnnotations
Tests run: 9, Failures: 0, Errors: 0, Skipped: 0, Time elapsed: 0.427 sec - in org.apache.hadoop.metrics2.lib.TestMetricsAnnotations
Java HotSpot(TM) 64-Bit Server VM warning: ignoring option MaxPermSize=768m; support was removed
in 8.0
Running org.apache.hadoop.metrics2.lib.TestUniqNames
Tests run: 2, Failures: 0, Errors: 0, Skipped: 0, Time elapsed: 0.066 sec - in org.apache.hadoop.metrics2.lib.TestUniqNames
Java HotSpot(TM) 64-Bit Server VM warning: ignoring option MaxPermSize=768m; support was removed
in 8.0
Running org.apache.hadoop.metrics2.lib.TestInterns
Tests run: 4, Failures: 0, Errors: 0, Skipped: 0, Time elapsed: 0.178 sec - in org.apache.hadoop.metrics2.lib.TestInterns
Java HotSpot(TM) 64-Bit Server VM warning: ignoring option MaxPermSize=768m; support was removed
in 8.0
Running org.apache.hadoop.metrics2.lib.TestMetricsRegistry
Tests run: 3, Failures: 0, Errors: 0, Skipped: 0, Time elapsed: 0.348 sec - in org.apache.hadoop.metrics2.lib.TestMetricsRegistry
Java HotSpot(TM) 64-Bit Server VM warning: ignoring option MaxPermSize=768m; support was removed
in 8.0
Running org.apache.hadoop.metrics2.lib.TestMutableMetrics
Tests run: 5, Failures: 0, Errors: 0, Skipped: 0, Time elapsed: 28.4 sec - in org.apache.hadoop.metrics2.lib.TestMutableMetrics

Results :

Tests run: 3043, Failures: 0, Errors: 0, Skipped: 86

[INFO] ------------------------------------------------------------------------
[INFO] Reactor Summary:
[INFO] 
[INFO] Apache Hadoop Annotations ......................... SUCCESS [  5.348 s]
[INFO] Apache Hadoop MiniKDC ............................. SUCCESS [ 18.546 s]
[INFO] Apache Hadoop Auth ................................ SUCCESS [05:09 min]
[INFO] Apache Hadoop Auth Examples ....................... SUCCESS [  3.041 s]
[INFO] Apache Hadoop Common .............................. FAILURE [36:09 min]
[INFO] Apache Hadoop NFS ................................. SKIPPED
[INFO] Apache Hadoop KMS ................................. SKIPPED
[INFO] Apache Hadoop Common Project ...................... SKIPPED
[INFO] ------------------------------------------------------------------------
[INFO] BUILD FAILURE
[INFO] ------------------------------------------------------------------------
[INFO] Total time: 41:46 min
[INFO] Finished at: 2015-06-04T09:44:33+00:00
[INFO] Final Memory: 66M/316M
[INFO] ------------------------------------------------------------------------
[ERROR] Failed to execute goal org.apache.maven.plugins:maven-surefire-plugin:2.17:test (default-test)
on project hadoop-common: There was a timeout or other error in the fork -> [Help 1]
org.apache.maven.lifecycle.LifecycleExecutionException: Failed to execute goal org.apache.maven.plugins:maven-surefire-plugin:2.17:test
(default-test) on project hadoop-common: There was a timeout or other error in the fork
	at org.apache.maven.lifecycle.internal.MojoExecutor.execute(MojoExecutor.java:212)
	at org.apache.maven.lifecycle.internal.MojoExecutor.execute(MojoExecutor.java:153)
	at org.apache.maven.lifecycle.internal.MojoExecutor.execute(MojoExecutor.java:145)
	at org.apache.maven.lifecycle.internal.LifecycleModuleBuilder.buildProject(LifecycleModuleBuilder.java:108)
	at org.apache.maven.lifecycle.internal.LifecycleModuleBuilder.buildProject(LifecycleModuleBuilder.java:76)
	at org.apache.maven.lifecycle.internal.builder.singlethreaded.SingleThreadedBuilder.build(SingleThreadedBuilder.java:51)
	at org.apache.maven.lifecycle.internal.LifecycleStarter.execute(LifecycleStarter.java:116)
	at org.apache.maven.DefaultMaven.doExecute(DefaultMaven.java:361)
	at org.apache.maven.DefaultMaven.execute(DefaultMaven.java:155)
	at org.apache.maven.cli.MavenCli.execute(MavenCli.java:584)
	at org.apache.maven.cli.MavenCli.doMain(MavenCli.java:213)
	at org.apache.maven.cli.MavenCli.main(MavenCli.java:157)
	at sun.reflect.NativeMethodAccessorImpl.invoke0(Native Method)
	at sun.reflect.NativeMethodAccessorImpl.invoke(NativeMethodAccessorImpl.java:62)
	at sun.reflect.DelegatingMethodAccessorImpl.invoke(DelegatingMethodAccessorImpl.java:43)
	at java.lang.reflect.Method.invoke(Method.java:483)
	at org.codehaus.plexus.classworlds.launcher.Launcher.launchEnhanced(Launcher.java:289)
	at org.codehaus.plexus.classworlds.launcher.Launcher.launch(Launcher.java:229)
	at org.codehaus.plexus.classworlds.launcher.Launcher.mainWithExitCode(Launcher.java:415)
	at org.codehaus.plexus.classworlds.launcher.Launcher.main(Launcher.java:356)
Caused by: org.apache.maven.plugin.MojoFailureException: There was a timeout or other error
in the fork
	at org.apache.maven.plugin.surefire.SurefireHelper.reportExecution(SurefireHelper.java:82)
	at org.apache.maven.plugin.surefire.SurefirePlugin.handleSummary(SurefirePlugin.java:195)
	at org.apache.maven.plugin.surefire.AbstractSurefireMojo.executeAfterPreconditionsChecked(AbstractSurefireMojo.java:861)
	at org.apache.maven.plugin.surefire.AbstractSurefireMojo.execute(AbstractSurefireMojo.java:729)
	at org.apache.maven.plugin.DefaultBuildPluginManager.executeMojo(DefaultBuildPluginManager.java:133)
	at org.apache.maven.lifecycle.internal.MojoExecutor.execute(MojoExecutor.java:208)
	... 19 more
[ERROR] 
[ERROR] Re-run Maven using the -X switch to enable full debug logging.
[ERROR] 
[ERROR] For more information about the errors and possible solutions, please read the following
articles:
[ERROR] [Help 1] http://cwiki.apache.org/confluence/display/MAVEN/MojoFailureException
[ERROR] 
[ERROR] After correcting the problems, you can resume the build with the command
[ERROR]   mvn <goals> -rf :hadoop-common
Build step 'Execute shell' marked build as failure
Archiving artifacts
Recording test results

Mime
View raw message