hadoop-common-dev mailing list archives

Site index · List index
Message view « Date » · « Thread »
Top « Date » · « Thread »
From Apache Jenkins Server <jenk...@builds.apache.org>
Subject Build failed in Jenkins: Hadoop-Common-trunk #1416
Date Tue, 24 Feb 2015 09:30:18 GMT
See <https://builds.apache.org/job/Hadoop-Common-trunk/1416/changes>

Changes:

[cnauroth] HDFS-7009. Active NN and standby NN have different live nodes. Contributed by Ming
Ma.

[wheat9] HADOOP-10478. Fix new findbugs warnings in hadoop-maven-plugins. Contributed by Li
Lu.

[aw] HADOOP-11625. Minor fixes to command manual & SLA doc (aw)

[aajisaka] HADOOP-8642. Document that io.native.lib.available only controls native bz2 and
zlib compression codecs. (aajisaka)

[cmccabe] HDFS-7807. libhdfs htable.c: fix htable resizing, add unit test (cmccabe)

[cmccabe] HDFS-7805. NameNode recovery prompt should be printed on console (Surendra Singh
Lilhore via Colin P. McCabe)

[gera] HADOOP-11619. FTPFileSystem should override getDefaultPort. (Brahma Reddy Battula via
gera)

[devaraj] YARN-2797. Add -help to yarn logs and nodes CLI command. Contributed by

------------------------------------------
[...truncated 5029 lines...]
Running org.apache.hadoop.util.bloom.TestBloomFilters
Tests run: 6, Failures: 0, Errors: 0, Skipped: 0, Time elapsed: 0.476 sec - in org.apache.hadoop.util.bloom.TestBloomFilters
Running org.apache.hadoop.util.TestStopWatch
Tests run: 3, Failures: 0, Errors: 0, Skipped: 0, Time elapsed: 0.072 sec - in org.apache.hadoop.util.TestStopWatch
Running org.apache.hadoop.util.TestMachineList
Tests run: 13, Failures: 0, Errors: 0, Skipped: 0, Time elapsed: 93.789 sec - in org.apache.hadoop.util.TestMachineList
Running org.apache.hadoop.util.TestFileBasedIPList
Tests run: 8, Failures: 0, Errors: 0, Skipped: 0, Time elapsed: 0.175 sec - in org.apache.hadoop.util.TestFileBasedIPList
Running org.apache.hadoop.util.TestGenericsUtil
Tests run: 6, Failures: 0, Errors: 0, Skipped: 0, Time elapsed: 0.345 sec - in org.apache.hadoop.util.TestGenericsUtil
Running org.apache.hadoop.util.TestFindClass
Tests run: 16, Failures: 0, Errors: 0, Skipped: 0, Time elapsed: 0.857 sec - in org.apache.hadoop.util.TestFindClass
Running org.apache.hadoop.util.TestLightWeightGSet
Tests run: 2, Failures: 0, Errors: 0, Skipped: 0, Time elapsed: 0.179 sec - in org.apache.hadoop.util.TestLightWeightGSet
Running org.apache.hadoop.util.TestPureJavaCrc32
Tests run: 1, Failures: 0, Errors: 0, Skipped: 0, Time elapsed: 0.58 sec - in org.apache.hadoop.util.TestPureJavaCrc32
Running org.apache.hadoop.util.TestStringUtils
Tests run: 13, Failures: 0, Errors: 0, Skipped: 0, Time elapsed: 0.31 sec - in org.apache.hadoop.util.TestStringUtils
Running org.apache.hadoop.util.TestProtoUtil
Tests run: 2, Failures: 0, Errors: 0, Skipped: 0, Time elapsed: 0.268 sec - in org.apache.hadoop.util.TestProtoUtil
Running org.apache.hadoop.util.TestSignalLogger
Tests run: 1, Failures: 0, Errors: 0, Skipped: 0, Time elapsed: 0.197 sec - in org.apache.hadoop.util.TestSignalLogger
Running org.apache.hadoop.util.TestDiskChecker
Tests run: 14, Failures: 0, Errors: 0, Skipped: 0, Time elapsed: 1.223 sec - in org.apache.hadoop.util.TestDiskChecker
Running org.apache.hadoop.util.TestShutdownThreadsHelper
Tests run: 2, Failures: 0, Errors: 0, Skipped: 0, Time elapsed: 3.175 sec - in org.apache.hadoop.util.TestShutdownThreadsHelper
Running org.apache.hadoop.util.TestCacheableIPList
Tests run: 4, Failures: 0, Errors: 0, Skipped: 0, Time elapsed: 1.285 sec - in org.apache.hadoop.util.TestCacheableIPList
Running org.apache.hadoop.util.TestLineReader
Tests run: 1, Failures: 0, Errors: 0, Skipped: 0, Time elapsed: 0.205 sec - in org.apache.hadoop.util.TestLineReader
Running org.apache.hadoop.util.TestIdentityHashStore
Tests run: 3, Failures: 0, Errors: 0, Skipped: 0, Time elapsed: 0.191 sec - in org.apache.hadoop.util.TestIdentityHashStore
Running org.apache.hadoop.util.TestClasspath
Tests run: 7, Failures: 0, Errors: 0, Skipped: 0, Time elapsed: 0.376 sec - in org.apache.hadoop.util.TestClasspath
Running org.apache.hadoop.util.TestApplicationClassLoader
Tests run: 4, Failures: 0, Errors: 0, Skipped: 0, Time elapsed: 0.251 sec - in org.apache.hadoop.util.TestApplicationClassLoader
Running org.apache.hadoop.util.TestShell
Tests run: 4, Failures: 0, Errors: 0, Skipped: 0, Time elapsed: 5.234 sec - in org.apache.hadoop.util.TestShell
Running org.apache.hadoop.util.TestShutdownHookManager
Tests run: 1, Failures: 0, Errors: 0, Skipped: 0, Time elapsed: 0.167 sec - in org.apache.hadoop.util.TestShutdownHookManager
Running org.apache.hadoop.util.TestHttpExceptionUtils
Tests run: 7, Failures: 0, Errors: 0, Skipped: 0, Time elapsed: 0.686 sec - in org.apache.hadoop.util.TestHttpExceptionUtils
Running org.apache.hadoop.util.TestJarFinder
Tests run: 4, Failures: 0, Errors: 0, Skipped: 0, Time elapsed: 0.772 sec - in org.apache.hadoop.util.TestJarFinder
Running org.apache.hadoop.util.hash.TestHash
Tests run: 1, Failures: 0, Errors: 0, Skipped: 0, Time elapsed: 0.448 sec - in org.apache.hadoop.util.hash.TestHash
Running org.apache.hadoop.util.TestLightWeightCache
Tests run: 1, Failures: 0, Errors: 0, Skipped: 0, Time elapsed: 10.425 sec - in org.apache.hadoop.util.TestLightWeightCache
Running org.apache.hadoop.util.TestNativeCodeLoader
Tests run: 1, Failures: 0, Errors: 0, Skipped: 0, Time elapsed: 0.166 sec - in org.apache.hadoop.util.TestNativeCodeLoader
Running org.apache.hadoop.util.TestReflectionUtils
Tests run: 5, Failures: 0, Errors: 0, Skipped: 0, Time elapsed: 0.626 sec - in org.apache.hadoop.util.TestReflectionUtils
Running org.apache.hadoop.crypto.TestCryptoStreams
Tests run: 14, Failures: 0, Errors: 0, Skipped: 0, Time elapsed: 21.855 sec - in org.apache.hadoop.crypto.TestCryptoStreams
Running org.apache.hadoop.crypto.TestCryptoStreamsForLocalFS
Tests run: 14, Failures: 0, Errors: 0, Skipped: 5, Time elapsed: 12.224 sec - in org.apache.hadoop.crypto.TestCryptoStreamsForLocalFS
Running org.apache.hadoop.crypto.TestOpensslCipher
Tests run: 3, Failures: 0, Errors: 0, Skipped: 0, Time elapsed: 0.209 sec - in org.apache.hadoop.crypto.TestOpensslCipher
Running org.apache.hadoop.crypto.TestCryptoStreamsWithOpensslAesCtrCryptoCodec
Tests run: 14, Failures: 0, Errors: 0, Skipped: 0, Time elapsed: 22.536 sec - in org.apache.hadoop.crypto.TestCryptoStreamsWithOpensslAesCtrCryptoCodec
Running org.apache.hadoop.crypto.TestCryptoStreamsNormal
Tests run: 14, Failures: 0, Errors: 0, Skipped: 8, Time elapsed: 6.97 sec - in org.apache.hadoop.crypto.TestCryptoStreamsNormal
Running org.apache.hadoop.crypto.TestCryptoCodec
Tests run: 3, Failures: 0, Errors: 0, Skipped: 0, Time elapsed: 14.068 sec - in org.apache.hadoop.crypto.TestCryptoCodec
Running org.apache.hadoop.crypto.random.TestOsSecureRandom
Tests run: 6, Failures: 0, Errors: 0, Skipped: 0, Time elapsed: 0.577 sec - in org.apache.hadoop.crypto.random.TestOsSecureRandom
Running org.apache.hadoop.crypto.random.TestOpensslSecureRandom
Tests run: 5, Failures: 0, Errors: 0, Skipped: 0, Time elapsed: 0.176 sec - in org.apache.hadoop.crypto.random.TestOpensslSecureRandom
Running org.apache.hadoop.crypto.key.TestKeyProviderDelegationTokenExtension
Tests run: 1, Failures: 0, Errors: 0, Skipped: 0, Time elapsed: 0.738 sec - in org.apache.hadoop.crypto.key.TestKeyProviderDelegationTokenExtension
Running org.apache.hadoop.crypto.key.TestCachingKeyProvider
Tests run: 5, Failures: 0, Errors: 0, Skipped: 0, Time elapsed: 2.104 sec - in org.apache.hadoop.crypto.key.TestCachingKeyProvider
Running org.apache.hadoop.crypto.key.TestKeyProviderFactory
Tests run: 8, Failures: 0, Errors: 0, Skipped: 0, Time elapsed: 1.454 sec - in org.apache.hadoop.crypto.key.TestKeyProviderFactory
Running org.apache.hadoop.crypto.key.TestValueQueue
Tests run: 8, Failures: 0, Errors: 0, Skipped: 0, Time elapsed: 1.187 sec - in org.apache.hadoop.crypto.key.TestValueQueue
Running org.apache.hadoop.crypto.key.TestKeyProvider
Tests run: 8, Failures: 0, Errors: 0, Skipped: 0, Time elapsed: 0.77 sec - in org.apache.hadoop.crypto.key.TestKeyProvider
Running org.apache.hadoop.crypto.key.TestKeyShell
Tests run: 9, Failures: 0, Errors: 0, Skipped: 0, Time elapsed: 1.536 sec - in org.apache.hadoop.crypto.key.TestKeyShell
Running org.apache.hadoop.crypto.key.TestKeyProviderCryptoExtension
Tests run: 2, Failures: 0, Errors: 0, Skipped: 0, Time elapsed: 0.959 sec - in org.apache.hadoop.crypto.key.TestKeyProviderCryptoExtension
Running org.apache.hadoop.io.TestSequenceFile
Tests run: 8, Failures: 0, Errors: 0, Skipped: 0, Time elapsed: 9.653 sec - in org.apache.hadoop.io.TestSequenceFile
Running org.apache.hadoop.io.TestSecureIOUtils
Tests run: 4, Failures: 0, Errors: 0, Skipped: 0, Time elapsed: 0.729 sec - in org.apache.hadoop.io.TestSecureIOUtils
Running org.apache.hadoop.io.nativeio.TestSharedFileDescriptorFactory
Tests run: 3, Failures: 0, Errors: 0, Skipped: 0, Time elapsed: 0.202 sec - in org.apache.hadoop.io.nativeio.TestSharedFileDescriptorFactory
Running org.apache.hadoop.io.nativeio.TestNativeIO
Tests run: 18, Failures: 0, Errors: 0, Skipped: 0, Time elapsed: 7.068 sec - in org.apache.hadoop.io.nativeio.TestNativeIO
Running org.apache.hadoop.io.TestWritable
Tests run: 7, Failures: 0, Errors: 0, Skipped: 0, Time elapsed: 0.461 sec - in org.apache.hadoop.io.TestWritable
Running org.apache.hadoop.io.TestIOUtils
Tests run: 12, Failures: 0, Errors: 0, Skipped: 0, Time elapsed: 0.42 sec - in org.apache.hadoop.io.TestIOUtils
Running org.apache.hadoop.io.TestTextNonUTF8
Tests run: 1, Failures: 0, Errors: 0, Skipped: 0, Time elapsed: 0.163 sec - in org.apache.hadoop.io.TestTextNonUTF8
Running org.apache.hadoop.io.TestMD5Hash
Tests run: 2, Failures: 0, Errors: 0, Skipped: 0, Time elapsed: 0.186 sec - in org.apache.hadoop.io.TestMD5Hash
Running org.apache.hadoop.io.TestMapFile
Tests run: 20, Failures: 0, Errors: 0, Skipped: 0, Time elapsed: 1.35 sec - in org.apache.hadoop.io.TestMapFile
Running org.apache.hadoop.io.TestWritableName
Tests run: 4, Failures: 0, Errors: 0, Skipped: 0, Time elapsed: 0.163 sec - in org.apache.hadoop.io.TestWritableName
Running org.apache.hadoop.io.TestSortedMapWritable
Tests run: 4, Failures: 0, Errors: 0, Skipped: 0, Time elapsed: 0.21 sec - in org.apache.hadoop.io.TestSortedMapWritable
Running org.apache.hadoop.io.TestSequenceFileSync
Tests run: 1, Failures: 0, Errors: 0, Skipped: 0, Time elapsed: 0.942 sec - in org.apache.hadoop.io.TestSequenceFileSync
Running org.apache.hadoop.io.retry.TestFailoverProxy
Tests run: 9, Failures: 0, Errors: 0, Skipped: 0, Time elapsed: 11.419 sec - in org.apache.hadoop.io.retry.TestFailoverProxy
Running org.apache.hadoop.io.retry.TestRetryProxy
Tests run: 10, Failures: 0, Errors: 0, Skipped: 0, Time elapsed: 1.204 sec - in org.apache.hadoop.io.retry.TestRetryProxy
Running org.apache.hadoop.io.TestDefaultStringifier
Tests run: 4, Failures: 0, Errors: 0, Skipped: 0, Time elapsed: 0.454 sec - in org.apache.hadoop.io.TestDefaultStringifier
Running org.apache.hadoop.io.TestBloomMapFile
Tests run: 7, Failures: 0, Errors: 0, Skipped: 0, Time elapsed: 1.563 sec - in org.apache.hadoop.io.TestBloomMapFile
Running org.apache.hadoop.io.TestBytesWritable
Tests run: 6, Failures: 0, Errors: 0, Skipped: 0, Time elapsed: 0.203 sec - in org.apache.hadoop.io.TestBytesWritable
Running org.apache.hadoop.io.TestWritableUtils
Tests run: 1, Failures: 0, Errors: 0, Skipped: 0, Time elapsed: 0.156 sec - in org.apache.hadoop.io.TestWritableUtils
Running org.apache.hadoop.io.TestBooleanWritable
Tests run: 2, Failures: 0, Errors: 0, Skipped: 0, Time elapsed: 0.202 sec - in org.apache.hadoop.io.TestBooleanWritable
Running org.apache.hadoop.io.TestDataByteBuffers
Tests run: 5, Failures: 0, Errors: 0, Skipped: 0, Time elapsed: 0.41 sec - in org.apache.hadoop.io.TestDataByteBuffers
Running org.apache.hadoop.io.TestVersionedWritable
Tests run: 3, Failures: 0, Errors: 0, Skipped: 0, Time elapsed: 0.164 sec - in org.apache.hadoop.io.TestVersionedWritable
Running org.apache.hadoop.io.TestEnumSetWritable
Tests run: 6, Failures: 0, Errors: 0, Skipped: 0, Time elapsed: 0.482 sec - in org.apache.hadoop.io.TestEnumSetWritable
Running org.apache.hadoop.io.TestMapWritable
Tests run: 4, Failures: 0, Errors: 0, Skipped: 0, Time elapsed: 0.193 sec - in org.apache.hadoop.io.TestMapWritable
Running org.apache.hadoop.io.TestArrayPrimitiveWritable
Tests run: 3, Failures: 0, Errors: 0, Skipped: 0, Time elapsed: 0.17 sec - in org.apache.hadoop.io.TestArrayPrimitiveWritable
Running org.apache.hadoop.io.TestSetFile
Tests run: 2, Failures: 0, Errors: 0, Skipped: 0, Time elapsed: 1.988 sec - in org.apache.hadoop.io.TestSetFile
Running org.apache.hadoop.io.TestUTF8
Tests run: 8, Failures: 0, Errors: 0, Skipped: 0, Time elapsed: 0.77 sec - in org.apache.hadoop.io.TestUTF8
Running org.apache.hadoop.io.TestBoundedByteArrayOutputStream
Tests run: 2, Failures: 0, Errors: 0, Skipped: 0, Time elapsed: 0.053 sec - in org.apache.hadoop.io.TestBoundedByteArrayOutputStream
Running org.apache.hadoop.io.compress.TestCodecPool
Tests run: 6, Failures: 0, Errors: 0, Skipped: 0, Time elapsed: 0.63 sec - in org.apache.hadoop.io.compress.TestCodecPool
Running org.apache.hadoop.io.compress.lz4.TestLz4CompressorDecompressor
Tests run: 12, Failures: 0, Errors: 0, Skipped: 0, Time elapsed: 0.268 sec - in org.apache.hadoop.io.compress.lz4.TestLz4CompressorDecompressor
Running org.apache.hadoop.io.compress.TestBlockDecompressorStream
Tests run: 2, Failures: 0, Errors: 0, Skipped: 0, Time elapsed: 0.077 sec - in org.apache.hadoop.io.compress.TestBlockDecompressorStream
Running org.apache.hadoop.io.compress.TestCodec
Tests run: 24, Failures: 0, Errors: 0, Skipped: 0, Time elapsed: 134.657 sec - in org.apache.hadoop.io.compress.TestCodec
Running org.apache.hadoop.io.compress.TestCompressorStream
Tests run: 1, Failures: 0, Errors: 0, Skipped: 0, Time elapsed: 0.089 sec - in org.apache.hadoop.io.compress.TestCompressorStream
Running org.apache.hadoop.io.compress.TestCompressorDecompressor
Tests run: 2, Failures: 0, Errors: 0, Skipped: 0, Time elapsed: 0.647 sec - in org.apache.hadoop.io.compress.TestCompressorDecompressor
Running org.apache.hadoop.io.compress.zlib.TestZlibCompressorDecompressor
Tests run: 8, Failures: 0, Errors: 0, Skipped: 0, Time elapsed: 1.231 sec - in org.apache.hadoop.io.compress.zlib.TestZlibCompressorDecompressor
Running org.apache.hadoop.io.compress.TestCodecFactory
Tests run: 1, Failures: 0, Errors: 0, Skipped: 0, Time elapsed: 0.509 sec - in org.apache.hadoop.io.compress.TestCodecFactory
Running org.apache.hadoop.io.compress.TestCompressionStreamReuse
Tests run: 3, Failures: 0, Errors: 0, Skipped: 0, Time elapsed: 4.532 sec - in org.apache.hadoop.io.compress.TestCompressionStreamReuse
Running org.apache.hadoop.io.compress.snappy.TestSnappyCompressorDecompressor
Tests run: 13, Failures: 0, Errors: 0, Skipped: 0, Time elapsed: 0.463 sec - in org.apache.hadoop.io.compress.snappy.TestSnappyCompressorDecompressor
Running org.apache.hadoop.io.serializer.TestSerializationFactory
Tests run: 5, Failures: 0, Errors: 0, Skipped: 0, Time elapsed: 0.686 sec - in org.apache.hadoop.io.serializer.TestSerializationFactory
Running org.apache.hadoop.io.serializer.avro.TestAvroSerialization
Tests run: 5, Failures: 0, Errors: 0, Skipped: 0, Time elapsed: 0.819 sec - in org.apache.hadoop.io.serializer.avro.TestAvroSerialization
Running org.apache.hadoop.io.serializer.TestWritableSerialization
Tests run: 3, Failures: 0, Errors: 0, Skipped: 0, Time elapsed: 0.512 sec - in org.apache.hadoop.io.serializer.TestWritableSerialization
Running org.apache.hadoop.io.TestGenericWritable
Tests run: 5, Failures: 0, Errors: 0, Skipped: 0, Time elapsed: 0.635 sec - in org.apache.hadoop.io.TestGenericWritable
Running org.apache.hadoop.io.TestText
Tests run: 18, Failures: 0, Errors: 0, Skipped: 0, Time elapsed: 0.78 sec - in org.apache.hadoop.io.TestText
Running org.apache.hadoop.io.file.tfile.TestTFileNoneCodecsStreams
Tests run: 19, Failures: 0, Errors: 0, Skipped: 0, Time elapsed: 1.992 sec - in org.apache.hadoop.io.file.tfile.TestTFileNoneCodecsStreams
Running org.apache.hadoop.io.file.tfile.TestTFileLzoCodecsByteArrays
Tests run: 25, Failures: 0, Errors: 0, Skipped: 0, Time elapsed: 0.939 sec - in org.apache.hadoop.io.file.tfile.TestTFileLzoCodecsByteArrays
Running org.apache.hadoop.io.file.tfile.TestTFileSeek
Tests run: 1, Failures: 0, Errors: 0, Skipped: 0, Time elapsed: 3.562 sec - in org.apache.hadoop.io.file.tfile.TestTFileSeek
Running org.apache.hadoop.io.file.tfile.TestTFileSplit
Tests run: 1, Failures: 0, Errors: 0, Skipped: 0, Time elapsed: 5.359 sec - in org.apache.hadoop.io.file.tfile.TestTFileSplit
Running org.apache.hadoop.io.file.tfile.TestTFileSeqFileComparison
Tests run: 1, Failures: 0, Errors: 0, Skipped: 0, Time elapsed: 4.486 sec - in org.apache.hadoop.io.file.tfile.TestTFileSeqFileComparison
Running org.apache.hadoop.io.file.tfile.TestTFileByteArrays
Tests run: 25, Failures: 0, Errors: 0, Skipped: 0, Time elapsed: 2.825 sec - in org.apache.hadoop.io.file.tfile.TestTFileByteArrays
Running org.apache.hadoop.io.file.tfile.TestTFileComparator2
Tests run: 1, Failures: 0, Errors: 0, Skipped: 0, Time elapsed: 1.743 sec - in org.apache.hadoop.io.file.tfile.TestTFileComparator2
Running org.apache.hadoop.io.file.tfile.TestTFileNoneCodecsByteArrays
Tests run: 25, Failures: 0, Errors: 0, Skipped: 0, Time elapsed: 1.594 sec - in org.apache.hadoop.io.file.tfile.TestTFileNoneCodecsByteArrays
Running org.apache.hadoop.io.file.tfile.TestTFileNoneCodecsJClassComparatorByteArrays
Tests run: 25, Failures: 0, Errors: 0, Skipped: 0, Time elapsed: 1.466 sec - in org.apache.hadoop.io.file.tfile.TestTFileNoneCodecsJClassComparatorByteArrays
Running org.apache.hadoop.io.file.tfile.TestTFileJClassComparatorByteArrays
Tests run: 25, Failures: 0, Errors: 0, Skipped: 0, Time elapsed: 2.876 sec - in org.apache.hadoop.io.file.tfile.TestTFileJClassComparatorByteArrays
Running org.apache.hadoop.io.file.tfile.TestTFileLzoCodecsStreams
Tests run: 19, Failures: 0, Errors: 0, Skipped: 0, Time elapsed: 0.333 sec - in org.apache.hadoop.io.file.tfile.TestTFileLzoCodecsStreams
Running org.apache.hadoop.io.file.tfile.TestTFileComparators
Tests run: 3, Failures: 0, Errors: 0, Skipped: 0, Time elapsed: 0.774 sec - in org.apache.hadoop.io.file.tfile.TestTFileComparators
Running org.apache.hadoop.io.file.tfile.TestTFileStreams
Tests run: 19, Failures: 0, Errors: 0, Skipped: 0, Time elapsed: 1.78 sec - in org.apache.hadoop.io.file.tfile.TestTFileStreams
Running org.apache.hadoop.io.file.tfile.TestTFileUnsortedByteArrays
Tests run: 4, Failures: 0, Errors: 0, Skipped: 0, Time elapsed: 0.833 sec - in org.apache.hadoop.io.file.tfile.TestTFileUnsortedByteArrays
Running org.apache.hadoop.io.file.tfile.TestVLong
Tests run: 9, Failures: 0, Errors: 0, Skipped: 0, Time elapsed: 1.635 sec - in org.apache.hadoop.io.file.tfile.TestVLong
Running org.apache.hadoop.io.file.tfile.TestTFile
Tests run: 3, Failures: 0, Errors: 0, Skipped: 0, Time elapsed: 1.215 sec - in org.apache.hadoop.io.file.tfile.TestTFile
Running org.apache.hadoop.io.TestObjectWritableProtos
Tests run: 3, Failures: 0, Errors: 0, Skipped: 0, Time elapsed: 0.3 sec - in org.apache.hadoop.io.TestObjectWritableProtos
Running org.apache.hadoop.io.TestArrayWritable
Tests run: 4, Failures: 0, Errors: 0, Skipped: 0, Time elapsed: 0.182 sec - in org.apache.hadoop.io.TestArrayWritable
Running org.apache.hadoop.io.TestSequenceFileSerialization
Tests run: 1, Failures: 0, Errors: 0, Skipped: 0, Time elapsed: 0.768 sec - in org.apache.hadoop.io.TestSequenceFileSerialization
Running org.apache.hadoop.io.TestArrayFile
Tests run: 3, Failures: 0, Errors: 0, Skipped: 0, Time elapsed: 2.928 sec - in org.apache.hadoop.io.TestArrayFile

Results :

Tests in error: 
  TestZKFailoverController>ClientBaseWithFixes.setUp:402->ClientBaseWithFixes.startServer:438->ClientBaseWithFixes.createNewServerInstance:341
ยป Bind

Tests run: 2953, Failures: 0, Errors: 1, Skipped: 83

[INFO] ------------------------------------------------------------------------
[INFO] Reactor Summary:
[INFO] 
[INFO] Apache Hadoop Annotations ......................... SUCCESS [  7.841 s]
[INFO] Apache Hadoop MiniKDC ............................. SUCCESS [ 12.825 s]
[INFO] Apache Hadoop Auth ................................ SUCCESS [04:56 min]
[INFO] Apache Hadoop Auth Examples ....................... SUCCESS [  3.945 s]
[INFO] Apache Hadoop Common .............................. FAILURE [22:27 min]
[INFO] Apache Hadoop NFS ................................. SKIPPED
[INFO] Apache Hadoop KMS ................................. SKIPPED
[INFO] Apache Hadoop Common Project ...................... SKIPPED
[INFO] ------------------------------------------------------------------------
[INFO] BUILD FAILURE
[INFO] ------------------------------------------------------------------------
[INFO] Total time: 27:50 min
[INFO] Finished at: 2015-02-24T09:29:59+00:00
[INFO] Final Memory: 82M/991M
[INFO] ------------------------------------------------------------------------
[ERROR] Failed to execute goal org.apache.maven.plugins:maven-surefire-plugin:2.17:test (default-test)
on project hadoop-common: There are test failures.
[ERROR] 
[ERROR] Please refer to <https://builds.apache.org/job/Hadoop-Common-trunk/ws/hadoop-common-project/hadoop-common/target/surefire-reports>
for the individual test results.
[ERROR] -> [Help 1]
[ERROR] 
[ERROR] To see the full stack trace of the errors, re-run Maven with the -e switch.
[ERROR] Re-run Maven using the -X switch to enable full debug logging.
[ERROR] 
[ERROR] For more information about the errors and possible solutions, please read the following
articles:
[ERROR] [Help 1] http://cwiki.apache.org/confluence/display/MAVEN/MojoFailureException
[ERROR] 
[ERROR] After correcting the problems, you can resume the build with the command
[ERROR]   mvn <goals> -rf :hadoop-common
result: 1
Build step 'Execute shell' marked build as failure
Archiving artifacts
Recording test results

Mime
View raw message