hadoop-common-dev mailing list archives

Site index · List index
Message view « Date » · « Thread »
Top « Date » · « Thread »
From Apache Jenkins Server <jenk...@builds.apache.org>
Subject Build failed in Jenkins: Hadoop-common-trunk-Java8 #83
Date Thu, 22 Jan 2015 09:27:27 GMT
See <https://builds.apache.org/job/Hadoop-common-trunk-Java8/83/changes>

Changes:

[aw] HADOOP-11256. Some site docs have inconsistent appearance (Masatake Iwasaki via aw)

[jlowe] HADOOP-11327. BloomFilter#not() omits the last bit, resulting in an incorrect filter.
Contributed by Eric Payne

[cmccabe] HADOOP-11484. hadoop-mapreduce-client-nativetask fails to build on ARM AARCH64 due
to x86 asm statements (Edward Nevill via Colin P. McCabe)

[cmccabe] HADOOP-11484: move CHANGES.txt entry to 3.0

[szetszwo] HDFS-3443. Fix NPE when namenode transition to active during startup by adding
checkNNStartup() in NameNodeRpcServer.  Contributed by Vinayakumar B

[cnauroth] HADOOP-10668. Addendum patch to fix TestZKFailoverController. Contributed by Ming
Ma.

[kihwal] HDFS-7548. Corrupt block reporting delayed until datablock scanner thread detects
it. Contributed by Rushabh Shah.

[cnauroth] MAPREDUCE-3283. mapred classpath CLI does not display the complete classpath. Contributed
by Varun Saxena.

[shv] HADOOP-11490. Expose truncate API via FileSystem and shell command. Contributed by Milan
Desai.

[cmccabe] HADOOP-11466. FastByteComparisons: do not use UNSAFE_COMPARER on the SPARC architecture
because it is slower there (Suman Somasundar via Colin P.  McCabe)

[gera] MAPREDUCE-5785. Derive heap size or mapreduce.*.memory.mb automatically. (Gera Shegalov
and Karthik Kambatla via gera)

[cmccabe] HDFS-7430. Refactor the BlockScanner to use O(1) memory and use multiple threads
(cmccabe)

[ozawa] YARN-3078. LogCLIHelpers lacks of a blank space before string 'does not exist'. Contributed
by Sam Liu.

[ozawa] HADOOP-11209. Configuration#updatingResource/finalParameters are not thread-safe.
Contributed by Varun Saxena.

------------------------------------------
[...truncated 5169 lines...]
Tests run: 18, Failures: 0, Errors: 0, Skipped: 0, Time elapsed: 6.516 sec - in org.apache.hadoop.io.nativeio.TestNativeIO
Java HotSpot(TM) 64-Bit Server VM warning: ignoring option MaxPermSize=768m; support was removed
in 8.0
Running org.apache.hadoop.io.TestWritable
Tests run: 7, Failures: 0, Errors: 0, Skipped: 0, Time elapsed: 0.293 sec - in org.apache.hadoop.io.TestWritable
Java HotSpot(TM) 64-Bit Server VM warning: ignoring option MaxPermSize=768m; support was removed
in 8.0
Running org.apache.hadoop.io.TestIOUtils
Tests run: 12, Failures: 0, Errors: 0, Skipped: 0, Time elapsed: 0.378 sec - in org.apache.hadoop.io.TestIOUtils
Java HotSpot(TM) 64-Bit Server VM warning: ignoring option MaxPermSize=768m; support was removed
in 8.0
Running org.apache.hadoop.io.TestTextNonUTF8
Tests run: 1, Failures: 0, Errors: 0, Skipped: 0, Time elapsed: 0.146 sec - in org.apache.hadoop.io.TestTextNonUTF8
Java HotSpot(TM) 64-Bit Server VM warning: ignoring option MaxPermSize=768m; support was removed
in 8.0
Running org.apache.hadoop.io.TestMD5Hash
Tests run: 2, Failures: 0, Errors: 0, Skipped: 0, Time elapsed: 0.172 sec - in org.apache.hadoop.io.TestMD5Hash
Java HotSpot(TM) 64-Bit Server VM warning: ignoring option MaxPermSize=768m; support was removed
in 8.0
Running org.apache.hadoop.io.TestMapFile
Tests run: 20, Failures: 0, Errors: 0, Skipped: 0, Time elapsed: 0.966 sec - in org.apache.hadoop.io.TestMapFile
Java HotSpot(TM) 64-Bit Server VM warning: ignoring option MaxPermSize=768m; support was removed
in 8.0
Running org.apache.hadoop.io.TestWritableName
Tests run: 4, Failures: 0, Errors: 0, Skipped: 0, Time elapsed: 0.151 sec - in org.apache.hadoop.io.TestWritableName
Java HotSpot(TM) 64-Bit Server VM warning: ignoring option MaxPermSize=768m; support was removed
in 8.0
Running org.apache.hadoop.io.TestSortedMapWritable
Tests run: 4, Failures: 0, Errors: 0, Skipped: 0, Time elapsed: 0.187 sec - in org.apache.hadoop.io.TestSortedMapWritable
Java HotSpot(TM) 64-Bit Server VM warning: ignoring option MaxPermSize=768m; support was removed
in 8.0
Running org.apache.hadoop.io.TestSequenceFileSync
Tests run: 1, Failures: 0, Errors: 0, Skipped: 0, Time elapsed: 0.651 sec - in org.apache.hadoop.io.TestSequenceFileSync
Java HotSpot(TM) 64-Bit Server VM warning: ignoring option MaxPermSize=768m; support was removed
in 8.0
Running org.apache.hadoop.io.retry.TestFailoverProxy
Tests run: 9, Failures: 0, Errors: 0, Skipped: 0, Time elapsed: 17.878 sec - in org.apache.hadoop.io.retry.TestFailoverProxy
Java HotSpot(TM) 64-Bit Server VM warning: ignoring option MaxPermSize=768m; support was removed
in 8.0
Running org.apache.hadoop.io.retry.TestRetryProxy
Tests run: 10, Failures: 0, Errors: 0, Skipped: 0, Time elapsed: 1.173 sec - in org.apache.hadoop.io.retry.TestRetryProxy
Java HotSpot(TM) 64-Bit Server VM warning: ignoring option MaxPermSize=768m; support was removed
in 8.0
Running org.apache.hadoop.io.TestDefaultStringifier
Tests run: 4, Failures: 0, Errors: 0, Skipped: 0, Time elapsed: 0.325 sec - in org.apache.hadoop.io.TestDefaultStringifier
Java HotSpot(TM) 64-Bit Server VM warning: ignoring option MaxPermSize=768m; support was removed
in 8.0
Running org.apache.hadoop.io.TestBloomMapFile
Tests run: 7, Failures: 0, Errors: 0, Skipped: 0, Time elapsed: 1.171 sec - in org.apache.hadoop.io.TestBloomMapFile
Java HotSpot(TM) 64-Bit Server VM warning: ignoring option MaxPermSize=768m; support was removed
in 8.0
Running org.apache.hadoop.io.TestBytesWritable
Tests run: 6, Failures: 0, Errors: 0, Skipped: 0, Time elapsed: 0.166 sec - in org.apache.hadoop.io.TestBytesWritable
Java HotSpot(TM) 64-Bit Server VM warning: ignoring option MaxPermSize=768m; support was removed
in 8.0
Running org.apache.hadoop.io.TestWritableUtils
Tests run: 1, Failures: 0, Errors: 0, Skipped: 0, Time elapsed: 0.141 sec - in org.apache.hadoop.io.TestWritableUtils
Java HotSpot(TM) 64-Bit Server VM warning: ignoring option MaxPermSize=768m; support was removed
in 8.0
Running org.apache.hadoop.io.TestBooleanWritable
Tests run: 2, Failures: 0, Errors: 0, Skipped: 0, Time elapsed: 0.164 sec - in org.apache.hadoop.io.TestBooleanWritable
Java HotSpot(TM) 64-Bit Server VM warning: ignoring option MaxPermSize=768m; support was removed
in 8.0
Running org.apache.hadoop.io.TestDataByteBuffers
Tests run: 5, Failures: 0, Errors: 0, Skipped: 0, Time elapsed: 0.324 sec - in org.apache.hadoop.io.TestDataByteBuffers
Java HotSpot(TM) 64-Bit Server VM warning: ignoring option MaxPermSize=768m; support was removed
in 8.0
Running org.apache.hadoop.io.TestVersionedWritable
Tests run: 3, Failures: 0, Errors: 0, Skipped: 0, Time elapsed: 0.148 sec - in org.apache.hadoop.io.TestVersionedWritable
Java HotSpot(TM) 64-Bit Server VM warning: ignoring option MaxPermSize=768m; support was removed
in 8.0
Running org.apache.hadoop.io.TestEnumSetWritable
Tests run: 6, Failures: 0, Errors: 0, Skipped: 0, Time elapsed: 0.411 sec - in org.apache.hadoop.io.TestEnumSetWritable
Java HotSpot(TM) 64-Bit Server VM warning: ignoring option MaxPermSize=768m; support was removed
in 8.0
Running org.apache.hadoop.io.TestMapWritable
Tests run: 4, Failures: 0, Errors: 0, Skipped: 0, Time elapsed: 0.169 sec - in org.apache.hadoop.io.TestMapWritable
Java HotSpot(TM) 64-Bit Server VM warning: ignoring option MaxPermSize=768m; support was removed
in 8.0
Running org.apache.hadoop.io.TestArrayPrimitiveWritable
Tests run: 3, Failures: 0, Errors: 0, Skipped: 0, Time elapsed: 0.153 sec - in org.apache.hadoop.io.TestArrayPrimitiveWritable
Java HotSpot(TM) 64-Bit Server VM warning: ignoring option MaxPermSize=768m; support was removed
in 8.0
Running org.apache.hadoop.io.TestSetFile
Tests run: 2, Failures: 0, Errors: 0, Skipped: 0, Time elapsed: 1.503 sec - in org.apache.hadoop.io.TestSetFile
Java HotSpot(TM) 64-Bit Server VM warning: ignoring option MaxPermSize=768m; support was removed
in 8.0
Running org.apache.hadoop.io.TestUTF8
Tests run: 8, Failures: 0, Errors: 0, Skipped: 0, Time elapsed: 0.529 sec - in org.apache.hadoop.io.TestUTF8
Java HotSpot(TM) 64-Bit Server VM warning: ignoring option MaxPermSize=768m; support was removed
in 8.0
Running org.apache.hadoop.io.TestBoundedByteArrayOutputStream
Tests run: 2, Failures: 0, Errors: 0, Skipped: 0, Time elapsed: 0.05 sec - in org.apache.hadoop.io.TestBoundedByteArrayOutputStream
Java HotSpot(TM) 64-Bit Server VM warning: ignoring option MaxPermSize=768m; support was removed
in 8.0
Running org.apache.hadoop.io.compress.TestCodecPool
Tests run: 6, Failures: 0, Errors: 0, Skipped: 0, Time elapsed: 0.481 sec - in org.apache.hadoop.io.compress.TestCodecPool
Java HotSpot(TM) 64-Bit Server VM warning: ignoring option MaxPermSize=768m; support was removed
in 8.0
Running org.apache.hadoop.io.compress.lz4.TestLz4CompressorDecompressor
Tests run: 12, Failures: 0, Errors: 0, Skipped: 0, Time elapsed: 0.246 sec - in org.apache.hadoop.io.compress.lz4.TestLz4CompressorDecompressor
Java HotSpot(TM) 64-Bit Server VM warning: ignoring option MaxPermSize=768m; support was removed
in 8.0
Running org.apache.hadoop.io.compress.TestBlockDecompressorStream
Tests run: 2, Failures: 0, Errors: 0, Skipped: 0, Time elapsed: 0.078 sec - in org.apache.hadoop.io.compress.TestBlockDecompressorStream
Java HotSpot(TM) 64-Bit Server VM warning: ignoring option MaxPermSize=768m; support was removed
in 8.0
Running org.apache.hadoop.io.compress.TestCodec
Tests run: 24, Failures: 0, Errors: 0, Skipped: 0, Time elapsed: 103.119 sec - in org.apache.hadoop.io.compress.TestCodec
Java HotSpot(TM) 64-Bit Server VM warning: ignoring option MaxPermSize=768m; support was removed
in 8.0
Running org.apache.hadoop.io.compress.TestCompressorStream
Tests run: 1, Failures: 0, Errors: 0, Skipped: 0, Time elapsed: 0.066 sec - in org.apache.hadoop.io.compress.TestCompressorStream
Java HotSpot(TM) 64-Bit Server VM warning: ignoring option MaxPermSize=768m; support was removed
in 8.0
Running org.apache.hadoop.io.compress.TestCompressorDecompressor
Tests run: 2, Failures: 0, Errors: 0, Skipped: 0, Time elapsed: 0.512 sec - in org.apache.hadoop.io.compress.TestCompressorDecompressor
Java HotSpot(TM) 64-Bit Server VM warning: ignoring option MaxPermSize=768m; support was removed
in 8.0
Running org.apache.hadoop.io.compress.zlib.TestZlibCompressorDecompressor
Tests run: 8, Failures: 0, Errors: 0, Skipped: 0, Time elapsed: 0.759 sec - in org.apache.hadoop.io.compress.zlib.TestZlibCompressorDecompressor
Java HotSpot(TM) 64-Bit Server VM warning: ignoring option MaxPermSize=768m; support was removed
in 8.0
Running org.apache.hadoop.io.compress.TestCodecFactory
Tests run: 1, Failures: 0, Errors: 0, Skipped: 0, Time elapsed: 0.323 sec - in org.apache.hadoop.io.compress.TestCodecFactory
Java HotSpot(TM) 64-Bit Server VM warning: ignoring option MaxPermSize=768m; support was removed
in 8.0
Running org.apache.hadoop.io.compress.TestCompressionStreamReuse
Tests run: 3, Failures: 0, Errors: 0, Skipped: 0, Time elapsed: 3.719 sec - in org.apache.hadoop.io.compress.TestCompressionStreamReuse
Java HotSpot(TM) 64-Bit Server VM warning: ignoring option MaxPermSize=768m; support was removed
in 8.0
Running org.apache.hadoop.io.compress.snappy.TestSnappyCompressorDecompressor
Tests run: 13, Failures: 0, Errors: 0, Skipped: 0, Time elapsed: 0.294 sec - in org.apache.hadoop.io.compress.snappy.TestSnappyCompressorDecompressor
Java HotSpot(TM) 64-Bit Server VM warning: ignoring option MaxPermSize=768m; support was removed
in 8.0
Running org.apache.hadoop.io.serializer.TestSerializationFactory
Tests run: 4, Failures: 0, Errors: 0, Skipped: 0, Time elapsed: 0.317 sec - in org.apache.hadoop.io.serializer.TestSerializationFactory
Java HotSpot(TM) 64-Bit Server VM warning: ignoring option MaxPermSize=768m; support was removed
in 8.0
Running org.apache.hadoop.io.serializer.avro.TestAvroSerialization
Tests run: 5, Failures: 0, Errors: 0, Skipped: 0, Time elapsed: 0.52 sec - in org.apache.hadoop.io.serializer.avro.TestAvroSerialization
Java HotSpot(TM) 64-Bit Server VM warning: ignoring option MaxPermSize=768m; support was removed
in 8.0
Running org.apache.hadoop.io.serializer.TestWritableSerialization
Tests run: 3, Failures: 0, Errors: 0, Skipped: 0, Time elapsed: 0.302 sec - in org.apache.hadoop.io.serializer.TestWritableSerialization
Java HotSpot(TM) 64-Bit Server VM warning: ignoring option MaxPermSize=768m; support was removed
in 8.0
Running org.apache.hadoop.io.TestGenericWritable
Tests run: 5, Failures: 0, Errors: 0, Skipped: 0, Time elapsed: 0.305 sec - in org.apache.hadoop.io.TestGenericWritable
Java HotSpot(TM) 64-Bit Server VM warning: ignoring option MaxPermSize=768m; support was removed
in 8.0
Running org.apache.hadoop.io.TestText
Tests run: 18, Failures: 0, Errors: 0, Skipped: 0, Time elapsed: 0.636 sec - in org.apache.hadoop.io.TestText
Java HotSpot(TM) 64-Bit Server VM warning: ignoring option MaxPermSize=768m; support was removed
in 8.0
Running org.apache.hadoop.io.file.tfile.TestTFileNoneCodecsStreams
Tests run: 19, Failures: 0, Errors: 0, Skipped: 0, Time elapsed: 0.932 sec - in org.apache.hadoop.io.file.tfile.TestTFileNoneCodecsStreams
Java HotSpot(TM) 64-Bit Server VM warning: ignoring option MaxPermSize=768m; support was removed
in 8.0
Running org.apache.hadoop.io.file.tfile.TestTFileLzoCodecsByteArrays
Tests run: 25, Failures: 0, Errors: 0, Skipped: 0, Time elapsed: 0.533 sec - in org.apache.hadoop.io.file.tfile.TestTFileLzoCodecsByteArrays
Java HotSpot(TM) 64-Bit Server VM warning: ignoring option MaxPermSize=768m; support was removed
in 8.0
Running org.apache.hadoop.io.file.tfile.TestTFileSeek
Tests run: 1, Failures: 0, Errors: 0, Skipped: 0, Time elapsed: 2.371 sec - in org.apache.hadoop.io.file.tfile.TestTFileSeek
Java HotSpot(TM) 64-Bit Server VM warning: ignoring option MaxPermSize=768m; support was removed
in 8.0
Running org.apache.hadoop.io.file.tfile.TestTFileSplit
Tests run: 1, Failures: 0, Errors: 0, Skipped: 0, Time elapsed: 3.476 sec - in org.apache.hadoop.io.file.tfile.TestTFileSplit
Java HotSpot(TM) 64-Bit Server VM warning: ignoring option MaxPermSize=768m; support was removed
in 8.0
Running org.apache.hadoop.io.file.tfile.TestTFileSeqFileComparison
Tests run: 1, Failures: 0, Errors: 0, Skipped: 0, Time elapsed: 3.07 sec - in org.apache.hadoop.io.file.tfile.TestTFileSeqFileComparison
Java HotSpot(TM) 64-Bit Server VM warning: ignoring option MaxPermSize=768m; support was removed
in 8.0
Running org.apache.hadoop.io.file.tfile.TestTFileByteArrays
Tests run: 25, Failures: 0, Errors: 0, Skipped: 0, Time elapsed: 1.597 sec - in org.apache.hadoop.io.file.tfile.TestTFileByteArrays
Java HotSpot(TM) 64-Bit Server VM warning: ignoring option MaxPermSize=768m; support was removed
in 8.0
Running org.apache.hadoop.io.file.tfile.TestTFileComparator2
Tests run: 1, Failures: 0, Errors: 0, Skipped: 0, Time elapsed: 0.791 sec - in org.apache.hadoop.io.file.tfile.TestTFileComparator2
Java HotSpot(TM) 64-Bit Server VM warning: ignoring option MaxPermSize=768m; support was removed
in 8.0
Running org.apache.hadoop.io.file.tfile.TestTFileNoneCodecsByteArrays
Tests run: 25, Failures: 0, Errors: 0, Skipped: 0, Time elapsed: 0.889 sec - in org.apache.hadoop.io.file.tfile.TestTFileNoneCodecsByteArrays
Java HotSpot(TM) 64-Bit Server VM warning: ignoring option MaxPermSize=768m; support was removed
in 8.0
Running org.apache.hadoop.io.file.tfile.TestTFileNoneCodecsJClassComparatorByteArrays
Tests run: 25, Failures: 0, Errors: 0, Skipped: 0, Time elapsed: 0.912 sec - in org.apache.hadoop.io.file.tfile.TestTFileNoneCodecsJClassComparatorByteArrays
Java HotSpot(TM) 64-Bit Server VM warning: ignoring option MaxPermSize=768m; support was removed
in 8.0
Running org.apache.hadoop.io.file.tfile.TestTFileJClassComparatorByteArrays
Tests run: 25, Failures: 0, Errors: 0, Skipped: 0, Time elapsed: 1.617 sec - in org.apache.hadoop.io.file.tfile.TestTFileJClassComparatorByteArrays
Java HotSpot(TM) 64-Bit Server VM warning: ignoring option MaxPermSize=768m; support was removed
in 8.0
Running org.apache.hadoop.io.file.tfile.TestTFileLzoCodecsStreams
Tests run: 19, Failures: 0, Errors: 0, Skipped: 0, Time elapsed: 0.287 sec - in org.apache.hadoop.io.file.tfile.TestTFileLzoCodecsStreams
Java HotSpot(TM) 64-Bit Server VM warning: ignoring option MaxPermSize=768m; support was removed
in 8.0
Running org.apache.hadoop.io.file.tfile.TestTFileComparators
Tests run: 3, Failures: 0, Errors: 0, Skipped: 0, Time elapsed: 0.539 sec - in org.apache.hadoop.io.file.tfile.TestTFileComparators
Java HotSpot(TM) 64-Bit Server VM warning: ignoring option MaxPermSize=768m; support was removed
in 8.0
Running org.apache.hadoop.io.file.tfile.TestTFileStreams
Tests run: 19, Failures: 0, Errors: 0, Skipped: 0, Time elapsed: 0.963 sec - in org.apache.hadoop.io.file.tfile.TestTFileStreams
Java HotSpot(TM) 64-Bit Server VM warning: ignoring option MaxPermSize=768m; support was removed
in 8.0
Running org.apache.hadoop.io.file.tfile.TestTFileUnsortedByteArrays
Tests run: 4, Failures: 0, Errors: 0, Skipped: 0, Time elapsed: 0.604 sec - in org.apache.hadoop.io.file.tfile.TestTFileUnsortedByteArrays
Java HotSpot(TM) 64-Bit Server VM warning: ignoring option MaxPermSize=768m; support was removed
in 8.0
Running org.apache.hadoop.io.file.tfile.TestVLong
Tests run: 9, Failures: 0, Errors: 0, Skipped: 0, Time elapsed: 1.183 sec - in org.apache.hadoop.io.file.tfile.TestVLong
Java HotSpot(TM) 64-Bit Server VM warning: ignoring option MaxPermSize=768m; support was removed
in 8.0
Running org.apache.hadoop.io.file.tfile.TestTFile
Tests run: 3, Failures: 0, Errors: 0, Skipped: 0, Time elapsed: 0.811 sec - in org.apache.hadoop.io.file.tfile.TestTFile
Java HotSpot(TM) 64-Bit Server VM warning: ignoring option MaxPermSize=768m; support was removed
in 8.0
Running org.apache.hadoop.io.TestObjectWritableProtos
Tests run: 3, Failures: 0, Errors: 0, Skipped: 0, Time elapsed: 0.254 sec - in org.apache.hadoop.io.TestObjectWritableProtos
Java HotSpot(TM) 64-Bit Server VM warning: ignoring option MaxPermSize=768m; support was removed
in 8.0
Running org.apache.hadoop.io.TestArrayWritable
Tests run: 4, Failures: 0, Errors: 0, Skipped: 0, Time elapsed: 0.157 sec - in org.apache.hadoop.io.TestArrayWritable
Java HotSpot(TM) 64-Bit Server VM warning: ignoring option MaxPermSize=768m; support was removed
in 8.0
Running org.apache.hadoop.io.TestSequenceFileSerialization
Tests run: 1, Failures: 0, Errors: 0, Skipped: 0, Time elapsed: 0.559 sec - in org.apache.hadoop.io.TestSequenceFileSerialization
Java HotSpot(TM) 64-Bit Server VM warning: ignoring option MaxPermSize=768m; support was removed
in 8.0
Running org.apache.hadoop.io.TestArrayFile
Tests run: 3, Failures: 0, Errors: 0, Skipped: 0, Time elapsed: 2.216 sec - in org.apache.hadoop.io.TestArrayFile

Results :

Tests in error: 
  TestZKFailoverControllerStress>ClientBaseWithFixes.setUp:402->ClientBaseWithFixes.startServer:438->ClientBaseWithFixes.createNewServerInstance:341
ยป Bind

Tests run: 2872, Failures: 0, Errors: 1, Skipped: 83

[INFO] ------------------------------------------------------------------------
[INFO] Reactor Summary:
[INFO] 
[INFO] Apache Hadoop Annotations ......................... SUCCESS [  5.551 s]
[INFO] Apache Hadoop MiniKDC ............................. SUCCESS [ 11.524 s]
[INFO] Apache Hadoop Auth ................................ SUCCESS [04:47 min]
[INFO] Apache Hadoop Auth Examples ....................... SUCCESS [  2.975 s]
[INFO] Apache Hadoop Common .............................. FAILURE [19:19 min]
[INFO] Apache Hadoop NFS ................................. SKIPPED
[INFO] Apache Hadoop KMS ................................. SKIPPED
[INFO] Apache Hadoop Common Project ...................... SKIPPED
[INFO] ------------------------------------------------------------------------
[INFO] BUILD FAILURE
[INFO] ------------------------------------------------------------------------
[INFO] Total time: 24:26 min
[INFO] Finished at: 2015-01-22T09:27:20+00:00
[INFO] Final Memory: 60M/266M
[INFO] ------------------------------------------------------------------------
[ERROR] Failed to execute goal org.apache.maven.plugins:maven-surefire-plugin:2.17:test (default-test)
on project hadoop-common: There are test failures.
[ERROR] 
[ERROR] Please refer to <https://builds.apache.org/job/Hadoop-common-trunk-Java8/ws/hadoop-common-project/hadoop-common/target/surefire-reports>
for the individual test results.
[ERROR] -> [Help 1]
org.apache.maven.lifecycle.LifecycleExecutionException: Failed to execute goal org.apache.maven.plugins:maven-surefire-plugin:2.17:test
(default-test) on project hadoop-common: There are test failures.

Please refer to <https://builds.apache.org/job/Hadoop-common-trunk-Java8/ws/hadoop-common-project/hadoop-common/target/surefire-reports>
for the individual test results.
	at org.apache.maven.lifecycle.internal.MojoExecutor.execute(MojoExecutor.java:212)
	at org.apache.maven.lifecycle.internal.MojoExecutor.execute(MojoExecutor.java:153)
	at org.apache.maven.lifecycle.internal.MojoExecutor.execute(MojoExecutor.java:145)
	at org.apache.maven.lifecycle.internal.LifecycleModuleBuilder.buildProject(LifecycleModuleBuilder.java:108)
	at org.apache.maven.lifecycle.internal.LifecycleModuleBuilder.buildProject(LifecycleModuleBuilder.java:76)
	at org.apache.maven.lifecycle.internal.builder.singlethreaded.SingleThreadedBuilder.build(SingleThreadedBuilder.java:51)
	at org.apache.maven.lifecycle.internal.LifecycleStarter.execute(LifecycleStarter.java:116)
	at org.apache.maven.DefaultMaven.doExecute(DefaultMaven.java:361)
	at org.apache.maven.DefaultMaven.execute(DefaultMaven.java:155)
	at org.apache.maven.cli.MavenCli.execute(MavenCli.java:584)
	at org.apache.maven.cli.MavenCli.doMain(MavenCli.java:213)
	at org.apache.maven.cli.MavenCli.main(MavenCli.java:157)
	at sun.reflect.NativeMethodAccessorImpl.invoke0(Native Method)
	at sun.reflect.NativeMethodAccessorImpl.invoke(NativeMethodAccessorImpl.java:62)
	at sun.reflect.DelegatingMethodAccessorImpl.invoke(DelegatingMethodAccessorImpl.java:43)
	at java.lang.reflect.Method.invoke(Method.java:483)
	at org.codehaus.plexus.classworlds.launcher.Launcher.launchEnhanced(Launcher.java:289)
	at org.codehaus.plexus.classworlds.launcher.Launcher.launch(Launcher.java:229)
	at org.codehaus.plexus.classworlds.launcher.Launcher.mainWithExitCode(Launcher.java:415)
	at org.codehaus.plexus.classworlds.launcher.Launcher.main(Launcher.java:356)
Caused by: org.apache.maven.plugin.MojoFailureException: There are test failures.

Please refer to <https://builds.apache.org/job/Hadoop-common-trunk-Java8/ws/hadoop-common-project/hadoop-common/target/surefire-reports>
for the individual test results.
	at org.apache.maven.plugin.surefire.SurefireHelper.reportExecution(SurefireHelper.java:82)
	at org.apache.maven.plugin.surefire.SurefirePlugin.handleSummary(SurefirePlugin.java:195)
	at org.apache.maven.plugin.surefire.AbstractSurefireMojo.executeAfterPreconditionsChecked(AbstractSurefireMojo.java:861)
	at org.apache.maven.plugin.surefire.AbstractSurefireMojo.execute(AbstractSurefireMojo.java:729)
	at org.apache.maven.plugin.DefaultBuildPluginManager.executeMojo(DefaultBuildPluginManager.java:133)
	at org.apache.maven.lifecycle.internal.MojoExecutor.execute(MojoExecutor.java:208)
	... 19 more
[ERROR] 
[ERROR] Re-run Maven using the -X switch to enable full debug logging.
[ERROR] 
[ERROR] For more information about the errors and possible solutions, please read the following
articles:
[ERROR] [Help 1] http://cwiki.apache.org/confluence/display/MAVEN/MojoFailureException
[ERROR] 
[ERROR] After correcting the problems, you can resume the build with the command
[ERROR]   mvn <goals> -rf :hadoop-common
Build step 'Execute shell' marked build as failure
Archiving artifacts
Recording test results

Mime
View raw message