hadoop-common-dev mailing list archives

Site index · List index
Message view « Date » · « Thread »
Top « Date » · « Thread »
From Apache Jenkins Server <jenk...@builds.apache.org>
Subject Build failed in Jenkins: Hadoop-Common-trunk #1256
Date Thu, 02 Oct 2014 09:08:40 GMT
See <https://builds.apache.org/job/Hadoop-Common-trunk/1256/changes>

Changes:

[aagarwal] HDFS-6921. Add LazyPersist flag to FileStatus. (Arpit Agarwal)

[aagarwal] HDFS-6924. Add new RAM_DISK storage type. (Arpit Agarwal)

[aagarwal] HDFS-6922. Add LazyPersist flag to INodeFile, save it in FsImage and edit logs.
(Arpit Agarwal)

[aagarwal] HDFS-6923. Propagate LazyPersist flag to DNs via DataTransferProtocol. (Arpit Agarwal)

[aagarwal] HDFS-6925. DataNode should attempt to place replicas on transient storage first
if lazyPersist flag is received. (Arpit Agarwal)

[aagarwal] HDFS-6926. DN support for saving replicas to persistent storage and evicting in-memory
replicas. (Arpit Agarwal)

[aagarwal] HDFS-6927. Initial unit tests for Lazy Persist files. (Arpit Agarwal)

[aagarwal] HDFS-6929. NN periodically unlinks lazy persist files with missing replicas from
namespace. (Arpit Agarwal)

[arp] HDFS-6928. 'hdfs put' command should accept lazyPersist flag for testing. (Arpit Agarwal)

[arp] HADOOP-10880. Move HTTP delegation tokens out of URL querystring to a header. (tucu)

[arp] Fixing CHANGES.txt, moving HADOOP-8815 to 2.6.0 release

[arp] Fix up CHANGES.txt for HDFS-6134, HADOOP-10150 and related JIRAs following merge to
branch-2

[arp] Fix typos in log messages. Contributed by Ray Chiang

[arp] HDFS-6960. Bugfix in LazyWriter, fix test case and some refactoring. (Arpit Agarwal)

[arp] HDFS-6931. Move lazily persisted replicas to finalized directory on DN startup. (Arpit
Agarwal)

[arp] HDFS-6950. Add Additional unit tests for HDFS-6581. (Contributed by Xiaoyu Yao)

[arp] HDFS-6930. Improve replica eviction from RAM disk. (Arpit Agarwal)

[arp] HDFS-6977. Delete all copies when a block is deleted from the block space. (Arpit Agarwal)

[arp] HDFS-6991. Notify NN of evicted block before deleting it from RAM disk. (Arpit Agarwal)

[arp] HDFS-6482. Fix CHANGES.txt in trunk

[arp] HDFS-6978. Directory scanner should correctly reconcile blocks on RAM disk. (Arpit Agarwal)

[arp] HDFS-7066. LazyWriter#evictBlocks misses a null check for replicaState. (Contributed
by Xiaoyu Yao)

[arp] HDFS-7064. Fix unit test failures in HDFS-6581 branch. (Contributed by Xiaoyu Yao)

[arp] HDFS-7079. Few more unit test fixes for HDFS-6581. (Arpit Agarwal)

[arp] HDFS-7080. Fix finalize and upgrade unit test failures. (Arpit Agarwal)

[arp] HDFS-7084. FsDatasetImpl#copyBlockFiles debug log can be improved. (Contributed by Xiaoyu
Yao)

[arp] HDFS-7091. Add forwarding constructor for INodeFile for existing callers. (Arpit Agarwal)

[arp] HDFS-7100. Make eviction scheme pluggable. (Arpit Agarwal)

[arp] HDFS-7108. Fix unit test failures in SimulatedFsDataset. (Arpit Agarwal)

[arp] HDFS-7071. Updated editsStored and editsStored.xml to bump layout version and add LazyPersist
flag. (Contributed by Xiaoyu Yao and Arpit Agarwal)

[arp] HDFS-7071. Undo accidental commit of binary file editsStored.

[arp] HDFS-6990. Add unit test for evict/delete RAM_DISK block with open handle. (Contributed
by Xiaoyu Yao)

[arp] HDFS-7143. Fix findbugs warnings in HDFS-6581 branch. (Contributed by Tsz Wo Nicholas
Sze)

[arp] HDFS-6932. Balancer and Mover tools should ignore replicas on RAM_DISK. (Contributed
by Xiaoyu Yao)

[arp] HDFS-7144. Fix findbugs warnings in RamDiskReplicaTracker. (Contributed by Tsz Wo Nicholas
Sze)

[arp] Fix test build break after merging from trunk

[arp] HDFS-7155. Bugfix in createLocatedFileStatus caused by bad merge. (Arpit Agarwal)

[arp] HDFS-7153. Add storagePolicy to NN edit log during file creation. (Arpit Agarwal)

[arp] HDFS-7159. Use block storage policy to set lazy persist preference. (Arpit Agarwal)

[arp] HDFS-7129. Metrics to track usage of memory for writes. (Contributed by Xiaoyu Yao)

[arp] HDFS-7171. Fix Jenkins failures in HDFS-6581 branch. (Arpit Agarwal)

[kihwal] HDFS-6754. TestNamenodeCapacityReport.testXceiverCount may sometimes fail due to
lack of retry. Contributed by Mit Desai.

[arp] HDFS-6581. Update CHANGES.txt in preparation for trunk merge

[vinodkv] YARN-1063. Augmented Hadoop common winutils to have the ability to create containers
as domain users. Contributed by Remus Rusanu.

[vinodkv] YARN-1972. Added a secure container-executor for Windows. Contributed by Remus Rusanu.

[wheat9] HDFS-7172. Test data files may be checked out of git with incorrect line endings,
causing test failures in TestHDFSCLI. Contributed by Chris Nauroth.

[wheat9] HDFS-7158. Reduce the memory usage of WebImageViewer. Contributed by Haohui Mai.

[wheat9] HDFS-6894. Add XDR parser method for each NFS response. Contributed by Brandon Li.

[cmccabe] HDFS-7176. The namenode usage message doesn't include "-rollingupgrade started"
(cmccabe)

[zjshen] YARN-2630. Prevented previous AM container status from being acquired by the current
restarted AM. Contributed by Jian He.

[wheat9] Addendum patch for HDFS-7172. Contributed by Chris Nauroth.

[junping_du] YARN-2613. Support retry in NMClient for rolling-upgrades. (Contributed by Jian
He)

[vinodkv] YARN-2446. Augmented Timeline service APIs to start taking in domains as a parameter
while posting entities and events. Contributed by Zhijie Shen.

------------------------------------------
[...truncated 25917 lines...]
Setting project property: maven.dependency.org.apache.directory.server.apacheds-interceptors-authz.jar.path
-> /home/jenkins/.m2/repository/org/apache/directory/server/apacheds-interceptors-authz/2.0.0-M15/apacheds-interceptors-authz-2.0.0-M15.jar
Setting project property: maven.dependency.org.apache.directory.server.apacheds-interceptors-changelog.jar.path
-> /home/jenkins/.m2/repository/org/apache/directory/server/apacheds-interceptors-changelog/2.0.0-M15/apacheds-interceptors-changelog-2.0.0-M15.jar
Setting project property: maven.dependency.org.apache.directory.server.apacheds-interceptors-collective.jar.path
-> /home/jenkins/.m2/repository/org/apache/directory/server/apacheds-interceptors-collective/2.0.0-M15/apacheds-interceptors-collective-2.0.0-M15.jar
Setting project property: maven.dependency.org.apache.directory.server.apacheds-interceptors-event.jar.path
-> /home/jenkins/.m2/repository/org/apache/directory/server/apacheds-interceptors-event/2.0.0-M15/apacheds-interceptors-event-2.0.0-M15.jar
Setting project property: maven.dependency.org.apache.directory.server.apacheds-interceptors-exception.jar.path
-> /home/jenkins/.m2/repository/org/apache/directory/server/apacheds-interceptors-exception/2.0.0-M15/apacheds-interceptors-exception-2.0.0-M15.jar
Setting project property: maven.dependency.org.apache.directory.server.apacheds-interceptors-journal.jar.path
-> /home/jenkins/.m2/repository/org/apache/directory/server/apacheds-interceptors-journal/2.0.0-M15/apacheds-interceptors-journal-2.0.0-M15.jar
Setting project property: maven.dependency.org.apache.directory.server.apacheds-interceptors-normalization.jar.path
-> /home/jenkins/.m2/repository/org/apache/directory/server/apacheds-interceptors-normalization/2.0.0-M15/apacheds-interceptors-normalization-2.0.0-M15.jar
Setting project property: maven.dependency.org.apache.directory.server.apacheds-interceptors-operational.jar.path
-> /home/jenkins/.m2/repository/org/apache/directory/server/apacheds-interceptors-operational/2.0.0-M15/apacheds-interceptors-operational-2.0.0-M15.jar
Setting project property: maven.dependency.org.apache.directory.server.apacheds-interceptors-referral.jar.path
-> /home/jenkins/.m2/repository/org/apache/directory/server/apacheds-interceptors-referral/2.0.0-M15/apacheds-interceptors-referral-2.0.0-M15.jar
Setting project property: maven.dependency.org.apache.directory.server.apacheds-interceptors-schema.jar.path
-> /home/jenkins/.m2/repository/org/apache/directory/server/apacheds-interceptors-schema/2.0.0-M15/apacheds-interceptors-schema-2.0.0-M15.jar
Setting project property: maven.dependency.org.apache.directory.server.apacheds-interceptors-subtree.jar.path
-> /home/jenkins/.m2/repository/org/apache/directory/server/apacheds-interceptors-subtree/2.0.0-M15/apacheds-interceptors-subtree-2.0.0-M15.jar
Setting project property: maven.dependency.org.apache.directory.server.apacheds-interceptors-trigger.jar.path
-> /home/jenkins/.m2/repository/org/apache/directory/server/apacheds-interceptors-trigger/2.0.0-M15/apacheds-interceptors-trigger-2.0.0-M15.jar
Setting project property: maven.dependency.org.apache.directory.api.api-ldap-extras-trigger.jar.path
-> /home/jenkins/.m2/repository/org/apache/directory/api/api-ldap-extras-trigger/1.0.0-M20/api-ldap-extras-trigger-1.0.0-M20.jar
Setting project property: maven.dependency.org.apache.directory.server.apacheds-protocol-shared.jar.path
-> /home/jenkins/.m2/repository/org/apache/directory/server/apacheds-protocol-shared/2.0.0-M15/apacheds-protocol-shared-2.0.0-M15.jar
Setting project property: maven.dependency.org.apache.directory.server.apacheds-protocol-kerberos.jar.path
-> /home/jenkins/.m2/repository/org/apache/directory/server/apacheds-protocol-kerberos/2.0.0-M15/apacheds-protocol-kerberos-2.0.0-M15.jar
Setting project property: maven.dependency.org.apache.directory.server.apacheds-core-shared.jar.path
-> /home/jenkins/.m2/repository/org/apache/directory/server/apacheds-core-shared/2.0.0-M15/apacheds-core-shared-2.0.0-M15.jar
Setting project property: maven.dependency.org.apache.directory.server.apacheds-ldif-partition.jar.path
-> /home/jenkins/.m2/repository/org/apache/directory/server/apacheds-ldif-partition/2.0.0-M15/apacheds-ldif-partition-2.0.0-M15.jar
Setting project property: maven.dependency.org.apache.directory.server.apacheds-xdbm-partition.jar.path
-> /home/jenkins/.m2/repository/org/apache/directory/server/apacheds-xdbm-partition/2.0.0-M15/apacheds-xdbm-partition-2.0.0-M15.jar
Setting project property: maven.dependency.org.apache.directory.server.apacheds-mavibot-partition.jar.path
-> /home/jenkins/.m2/repository/org/apache/directory/server/apacheds-mavibot-partition/2.0.0-M15/apacheds-mavibot-partition-2.0.0-M15.jar
Setting project property: maven.dependency.org.apache.directory.mavibot.mavibot.jar.path ->
/home/jenkins/.m2/repository/org/apache/directory/mavibot/mavibot/1.0.0-M1/mavibot-1.0.0-M1.jar
Setting project property: maven.dependency.org.apache.directory.server.apacheds-core-avl.jar.path
-> /home/jenkins/.m2/repository/org/apache/directory/server/apacheds-core-avl/2.0.0-M15/apacheds-core-avl-2.0.0-M15.jar
Setting project property: maven.dependency.org.apache.directory.api.api-all.jar.path ->
/home/jenkins/.m2/repository/org/apache/directory/api/api-all/1.0.0-M20/api-all-1.0.0-M20.jar
Setting project property: maven.dependency.commons-pool.commons-pool.jar.path -> /home/jenkins/.m2/repository/commons-pool/commons-pool/1.6/commons-pool-1.6.jar
Setting project property: maven.dependency.antlr.antlr.jar.path -> /home/jenkins/.m2/repository/antlr/antlr/2.7.7/antlr-2.7.7.jar
Setting project property: maven.dependency.org.apache.directory.server.apacheds-jdbm-partition.jar.path
-> /home/jenkins/.m2/repository/org/apache/directory/server/apacheds-jdbm-partition/2.0.0-M15/apacheds-jdbm-partition-2.0.0-M15.jar
Setting project property: maven.dependency.org.apache.directory.jdbm.apacheds-jdbm1.bundle.path
-> /home/jenkins/.m2/repository/org/apache/directory/jdbm/apacheds-jdbm1/2.0.0-M2/apacheds-jdbm1-2.0.0-M2.jar
Setting project property: maven.dependency.org.apache.directory.server.apacheds-protocol-ldap.jar.path
-> /home/jenkins/.m2/repository/org/apache/directory/server/apacheds-protocol-ldap/2.0.0-M15/apacheds-protocol-ldap-2.0.0-M15.jar
Setting project property: maven.dependency.org.apache.directory.api.api-asn1-ber.jar.path
-> /home/jenkins/.m2/repository/org/apache/directory/api/api-asn1-ber/1.0.0-M20/api-asn1-ber-1.0.0-M20.jar
Setting project property: maven.dependency.org.apache.directory.api.api-ldap-extras-codec-api.jar.path
-> /home/jenkins/.m2/repository/org/apache/directory/api/api-ldap-extras-codec-api/1.0.0-M20/api-ldap-extras-codec-api-1.0.0-M20.jar
Setting project property: maven.dependency.org.apache.directory.api.api-ldap-extras-codec.jar.path
-> /home/jenkins/.m2/repository/org/apache/directory/api/api-ldap-extras-codec/1.0.0-M20/api-ldap-extras-codec-1.0.0-M20.jar
Setting project property: maven.dependency.org.apache.directory.api.api-ldap-extras-sp.jar.path
-> /home/jenkins/.m2/repository/org/apache/directory/api/api-ldap-extras-sp/1.0.0-M20/api-ldap-extras-sp-1.0.0-M20.jar
Setting project property: maven.dependency.bouncycastle.bcprov-jdk15.jar.path -> /home/jenkins/.m2/repository/bouncycastle/bcprov-jdk15/140/bcprov-jdk15-140.jar
Setting project property: maven.dependency.com.jcraft.jsch.jar.path -> /home/jenkins/.m2/repository/com/jcraft/jsch/0.1.42/jsch-0.1.42.jar
Setting project property: maven.dependency.org.apache.curator.curator-test.jar.path ->
/home/jenkins/.m2/repository/org/apache/curator/curator-test/2.6.0/curator-test-2.6.0.jar
Setting project property: maven.dependency.org.javassist.javassist.jar.path -> /home/jenkins/.m2/repository/org/javassist/javassist/3.18.1-GA/javassist-3.18.1-GA.jar
Setting project property: maven.dependency.org.apache.commons.commons-math.jar.path ->
/home/jenkins/.m2/repository/org/apache/commons/commons-math/2.2/commons-math-2.2.jar
Setting project property: maven.dependency.org.apache.curator.curator-client.jar.path ->
/home/jenkins/.m2/repository/org/apache/curator/curator-client/2.6.0/curator-client-2.6.0.jar
Setting project property: maven.dependency.org.apache.curator.curator-recipes.jar.path ->
/home/jenkins/.m2/repository/org/apache/curator/curator-recipes/2.6.0/curator-recipes-2.6.0.jar
Setting project property: maven.dependency.com.google.code.findbugs.jsr305.jar.path ->
/home/jenkins/.m2/repository/com/google/code/findbugs/jsr305/1.3.9/jsr305-1.3.9.jar
Setting project property: maven.dependency.org.htrace.htrace-core.jar.path -> /home/jenkins/.m2/repository/org/htrace/htrace-core/3.0.4/htrace-core-3.0.4.jar
Setting project property: maven.dependency.org.apache.zookeeper.zookeeper.jar.path -> /home/jenkins/.m2/repository/org/apache/zookeeper/zookeeper/3.4.6/zookeeper-3.4.6.jar
Setting project property: maven.dependency.io.netty.netty.jar.path -> /home/jenkins/.m2/repository/io/netty/netty/3.6.2.Final/netty-3.6.2.Final.jar
Setting project property: maven.dependency.org.apache.zookeeper.zookeeper.tests.test-jar.path
-> /home/jenkins/.m2/repository/org/apache/zookeeper/zookeeper/3.4.6/zookeeper-3.4.6-tests.jar
Setting project property: maven.dependency.jline.jline.jar.path -> /home/jenkins/.m2/repository/jline/jline/0.9.94/jline-0.9.94.jar
Setting project property: maven.dependency.org.apache.commons.commons-compress.jar.path ->
/home/jenkins/.m2/repository/org/apache/commons/commons-compress/1.4.1/commons-compress-1.4.1.jar
Setting project property: maven.dependency.org.tukaani.xz.jar.path -> /home/jenkins/.m2/repository/org/tukaani/xz/1.0/xz-1.0.jar
[INFO] Executing tasks
Build sequence for target(s) `main' is [main]
Complete build sequence is [main, ]

main:
     [exec] Current OS is Linux
     [exec] Executing 'cmake' with arguments:
     [exec] '<https://builds.apache.org/job/Hadoop-Common-trunk/ws/hadoop-common-project/hadoop-common/src/'>
     [exec] '-DGENERATED_JAVAH=<https://builds.apache.org/job/Hadoop-Common-trunk/ws/hadoop-common-project/hadoop-common/target/native/javah'>
     [exec] '-DJVM_ARCH_DATA_MODEL=32'
     [exec] '-DREQUIRE_BZIP2=false'
     [exec] '-DREQUIRE_SNAPPY=false'
     [exec] '-DCUSTOM_SNAPPY_PREFIX='
     [exec] '-DCUSTOM_SNAPPY_LIB='
     [exec] '-DCUSTOM_SNAPPY_INCLUDE='
     [exec] '-DREQUIRE_OPENSSL=false'
     [exec] '-DCUSTOM_OPENSSL_PREFIX='
     [exec] '-DCUSTOM_OPENSSL_LIB='
     [exec] '-DCUSTOM_OPENSSL_INCLUDE='
     [exec] 
     [exec] The ' characters around the executable and arguments are
     [exec] not part of the command.
Execute:Java13CommandLauncher: Executing 'cmake' with arguments:
'<https://builds.apache.org/job/Hadoop-Common-trunk/ws/hadoop-common-project/hadoop-common/src/'>
'-DGENERATED_JAVAH=<https://builds.apache.org/job/Hadoop-Common-trunk/ws/hadoop-common-project/hadoop-common/target/native/javah'>
'-DJVM_ARCH_DATA_MODEL=32'
'-DREQUIRE_BZIP2=false'
'-DREQUIRE_SNAPPY=false'
'-DCUSTOM_SNAPPY_PREFIX='
'-DCUSTOM_SNAPPY_LIB='
'-DCUSTOM_SNAPPY_INCLUDE='
'-DREQUIRE_OPENSSL=false'
'-DCUSTOM_OPENSSL_PREFIX='
'-DCUSTOM_OPENSSL_LIB='
'-DCUSTOM_OPENSSL_INCLUDE='

The ' characters around the executable and arguments are
not part of the command.
     [exec] -- The C compiler identification is GNU 4.8.2
     [exec] -- The CXX compiler identification is GNU 4.8.2
     [exec] -- Check for working C compiler: /usr/bin/cc
     [exec] -- Check for working C compiler: /usr/bin/cc -- works
     [exec] -- Detecting C compiler ABI info
     [exec] -- Detecting C compiler ABI info - done
     [exec] -- Check for working CXX compiler: /usr/bin/c++
     [exec] -- Check for working CXX compiler: /usr/bin/c++ -- works
     [exec] -- Detecting CXX compiler ABI info
     [exec] JAVA_HOME=, JAVA_JVM_LIBRARY=/home/jenkins/tools/java/latest/jre/lib/i386/server/libjvm.so
     [exec] JAVA_INCLUDE_PATH=/home/jenkins/tools/java/latest/include, JAVA_INCLUDE_PATH2=/home/jenkins/tools/java/latest/include/linux
     [exec] Located all JNI components successfully.
     [exec] -- Detecting CXX compiler ABI info - done
     [exec] -- Found JNI: /home/jenkins/tools/java/latest/jre/lib/i386/libjawt.so  
     [exec] -- Found ZLIB: /lib/x86_64-linux-gnu/libz.so.1 (found version "1.2.8") 
     [exec] -- Looking for sync_file_range
     [exec] -- Looking for sync_file_range - found
     [exec] -- Looking for posix_fadvise
     [exec] -- Looking for posix_fadvise - found
     [exec] -- Looking for dlopen in dl
     [exec] CMake Warning:
     [exec]   Manually-specified variables were not used by the project:
     [exec] 
     [exec]     REQUIRE_OPENSSL
     [exec]     REQUIRE_SNAPPY
     [exec] 
     [exec] 
     [exec] -- Looking for dlopen in dl - found
     [exec] -- Configuring done
     [exec] -- Generating done
     [exec] -- Build files have been written to: <https://builds.apache.org/job/Hadoop-Common-trunk/ws/hadoop-common-project/hadoop-common/target/native>
     [exec] Current OS is Linux
     [exec] Executing 'make' with arguments:
     [exec] 'VERBOSE=1'
     [exec] 
     [exec] The ' characters around the executable and arguments are
     [exec] not part of the command.
Execute:Java13CommandLauncher: Executing 'make' with arguments:
'VERBOSE=1'

The ' characters around the executable and arguments are
not part of the command.
     [exec] /usr/bin/cmake -H<https://builds.apache.org/job/Hadoop-Common-trunk/ws/hadoop-common-project/hadoop-common/src>
-B<https://builds.apache.org/job/Hadoop-Common-trunk/ws/hadoop-common-project/hadoop-common/target/native>
--check-build-system CMakeFiles/Makefile.cmake 0
     [exec] /usr/bin/cmake -E cmake_progress_start <https://builds.apache.org/job/Hadoop-Common-trunk/ws/hadoop-common-project/hadoop-common/target/native/CMakeFiles>
<https://builds.apache.org/job/Hadoop-Common-trunk/ws/hadoop-common-project/hadoop-common/target/native/CMakeFiles/progress.marks>
     [exec] make -f CMakeFiles/Makefile2 all
     [exec] make[1]: Entering directory `<https://builds.apache.org/job/Hadoop-Common-trunk/ws/hadoop-common-project/hadoop-common/target/native'>
     [exec] make -f CMakeFiles/hadoop.dir/build.make CMakeFiles/hadoop.dir/depend
     [exec] make[2]: Entering directory `<https://builds.apache.org/job/Hadoop-Common-trunk/ws/hadoop-common-project/hadoop-common/target/native'>
     [exec] cd <https://builds.apache.org/job/Hadoop-Common-trunk/ws/hadoop-common-project/hadoop-common/target/native>
&& /usr/bin/cmake -E cmake_depends "Unix Makefiles" <https://builds.apache.org/job/Hadoop-Common-trunk/ws/hadoop-common-project/hadoop-common/src>
<https://builds.apache.org/job/Hadoop-Common-trunk/ws/hadoop-common-project/hadoop-common/src>
<https://builds.apache.org/job/Hadoop-Common-trunk/ws/hadoop-common-project/hadoop-common/target/native>
<https://builds.apache.org/job/Hadoop-Common-trunk/ws/hadoop-common-project/hadoop-common/target/native>
<https://builds.apache.org/job/Hadoop-Common-trunk/ws/hadoop-common-project/hadoop-common/target/native/CMakeFiles/hadoop.dir/DependInfo.cmake>
--color=
     [exec] Dependee "<https://builds.apache.org/job/Hadoop-Common-trunk/ws/hadoop-common-project/hadoop-common/target/native/CMakeFiles/hadoop.dir/DependInfo.cmake">
is newer than depender "<https://builds.apache.org/job/Hadoop-Common-trunk/ws/hadoop-common-project/hadoop-common/target/native/CMakeFiles/hadoop.dir/depend.internal".>
     [exec] Dependee "<https://builds.apache.org/job/Hadoop-Common-trunk/ws/hadoop-common-project/hadoop-common/target/native/CMakeFiles/CMakeDirectoryInformation.cmake">
is newer than depender "<https://builds.apache.org/job/Hadoop-Common-trunk/ws/hadoop-common-project/hadoop-common/target/native/CMakeFiles/hadoop.dir/depend.internal".>
     [exec] Scanning dependencies of target hadoop
     [exec] make[2]: Leaving directory `<https://builds.apache.org/job/Hadoop-Common-trunk/ws/hadoop-common-project/hadoop-common/target/native'>
     [exec] make -f CMakeFiles/hadoop.dir/build.make CMakeFiles/hadoop.dir/build
     [exec] make[2]: Entering directory `<https://builds.apache.org/job/Hadoop-Common-trunk/ws/hadoop-common-project/hadoop-common/target/native'>
     [exec] /usr/bin/cmake -E cmake_progress_report <https://builds.apache.org/job/Hadoop-Common-trunk/ws/hadoop-common-project/hadoop-common/target/native/CMakeFiles>
1
     [exec] [  2%] Building C object CMakeFiles/hadoop.dir/main/native/src/exception.c.o
     [exec] /usr/bin/cc  -Dhadoop_EXPORTS -m32 -g -Wall -O2 -D_REENTRANT -D_GNU_SOURCE -D_LARGEFILE_SOURCE
-D_FILE_OFFSET_BITS=64 -fPIC -I<https://builds.apache.org/job/Hadoop-Common-trunk/ws/hadoop-common-project/hadoop-common/target/native/javah>
-I<https://builds.apache.org/job/Hadoop-Common-trunk/ws/hadoop-common-project/hadoop-common/src/main/native/src>
-I<https://builds.apache.org/job/Hadoop-Common-trunk/ws/hadoop-common-project/hadoop-common/src>
-I<https://builds.apache.org/job/Hadoop-Common-trunk/ws/hadoop-common-project/hadoop-common/src/src>
-I<https://builds.apache.org/job/Hadoop-Common-trunk/ws/hadoop-common-project/hadoop-common/target/native>
-I/home/jenkins/tools/java/latest/include -I/home/jenkins/tools/java/latest/include/linux
-I<https://builds.apache.org/job/Hadoop-Common-trunk/ws/hadoop-common-project/hadoop-common/src/main/native/src/org/apache/hadoop/util>
   -o CMakeFiles/hadoop.dir/main/native/src/exception.c.o   -c <https://builds.apache.org/job/Hadoop-Common-trunk/ws/hadoop-common-project/hadoop-common/src/main/native/src/exception.c>
     [exec] /usr/bin/cmake -E cmake_progress_report <https://builds.apache.org/job/Hadoop-Common-trunk/ws/hadoop-common-project/hadoop-common/target/native/CMakeFiles>
2
     [exec] [  4%] Building C object CMakeFiles/hadoop.dir/main/native/src/org/apache/hadoop/io/compress/lz4/Lz4Compressor.c.o
     [exec] /usr/bin/cc  -Dhadoop_EXPORTS -m32 -g -Wall -O2 -D_REENTRANT -D_GNU_SOURCE -D_LARGEFILE_SOURCE
-D_FILE_OFFSET_BITS=64 -fPIC -I<https://builds.apache.org/job/Hadoop-Common-trunk/ws/hadoop-common-project/hadoop-common/target/native/javah>
-I<https://builds.apache.org/job/Hadoop-Common-trunk/ws/hadoop-common-project/hadoop-common/src/main/native/src>
-I<https://builds.apache.org/job/Hadoop-Common-trunk/ws/hadoop-common-project/hadoop-common/src>
-I<https://builds.apache.org/job/Hadoop-Common-trunk/ws/hadoop-common-project/hadoop-common/src/src>
-I<https://builds.apache.org/job/Hadoop-Common-trunk/ws/hadoop-common-project/hadoop-common/target/native>
-I/home/jenkins/tools/java/latest/include -I/home/jenkins/tools/java/latest/include/linux
-I<https://builds.apache.org/job/Hadoop-Common-trunk/ws/hadoop-common-project/hadoop-common/src/main/native/src/org/apache/hadoop/util>
   -o CMakeFiles/hadoop.dir/main/native/src/org/apache/hadoop/io/compress/lz4/Lz4Compressor.c.o
  -c <https://builds.apache.org/job/Hadoop-Common-trunk/ws/hadoop-common-project/hadoop-common/src/main/native/src/org/apache/hadoop/io/compress/lz4/Lz4Compressor.c>
     [exec] /usr/bin/cmake -E cmake_progress_report <https://builds.apache.org/job/Hadoop-Common-trunk/ws/hadoop-common-project/hadoop-common/target/native/CMakeFiles>
3
     [exec] [  6%] Building C object CMakeFiles/hadoop.dir/main/native/src/org/apache/hadoop/io/compress/lz4/Lz4Decompressor.c.o
     [exec] /usr/bin/cc  -Dhadoop_EXPORTS -m32 -g -Wall -O2 -D_REENTRANT -D_GNU_SOURCE -D_LARGEFILE_SOURCE
-D_FILE_OFFSET_BITS=64 -fPIC -I<https://builds.apache.org/job/Hadoop-Common-trunk/ws/hadoop-common-project/hadoop-common/target/native/javah>
-I<https://builds.apache.org/job/Hadoop-Common-trunk/ws/hadoop-common-project/hadoop-common/src/main/native/src>
-I<https://builds.apache.org/job/Hadoop-Common-trunk/ws/hadoop-common-project/hadoop-common/src>
-I<https://builds.apache.org/job/Hadoop-Common-trunk/ws/hadoop-common-project/hadoop-common/src/src>
-I<https://builds.apache.org/job/Hadoop-Common-trunk/ws/hadoop-common-project/hadoop-common/target/native>
-I/home/jenkins/tools/java/latest/include -I/home/jenkins/tools/java/latest/include/linux
-I<https://builds.apache.org/job/Hadoop-Common-trunk/ws/hadoop-common-project/hadoop-common/src/main/native/src/org/apache/hadoop/util>
   -o CMakeFiles/hadoop.dir/main/native/src/org/apache/hadoop/io/compress/lz4/Lz4Decompressor.c.o
  -c <https://builds.apache.org/job/Hadoop-Common-trunk/ws/hadoop-common-project/hadoop-common/src/main/native/src/org/apache/hadoop/io/compress/lz4/Lz4Decompressor.c>
     [exec] /usr/bin/cmake -E cmake_progress_report <https://builds.apache.org/job/Hadoop-Common-trunk/ws/hadoop-common-project/hadoop-common/target/native/CMakeFiles>
4
     [exec] [  8%] Building C object CMakeFiles/hadoop.dir/main/native/src/org/apache/hadoop/io/compress/lz4/lz4.c.o
     [exec] /usr/bin/cc  -Dhadoop_EXPORTS -m32 -g -Wall -O2 -D_REENTRANT -D_GNU_SOURCE -D_LARGEFILE_SOURCE
-D_FILE_OFFSET_BITS=64 -fPIC -I<https://builds.apache.org/job/Hadoop-Common-trunk/ws/hadoop-common-project/hadoop-common/target/native/javah>
-I<https://builds.apache.org/job/Hadoop-Common-trunk/ws/hadoop-common-project/hadoop-common/src/main/native/src>
-I<https://builds.apache.org/job/Hadoop-Common-trunk/ws/hadoop-common-project/hadoop-common/src>
-I<https://builds.apache.org/job/Hadoop-Common-trunk/ws/hadoop-common-project/hadoop-common/src/src>
-I<https://builds.apache.org/job/Hadoop-Common-trunk/ws/hadoop-common-project/hadoop-common/target/native>
-I/home/jenkins/tools/java/latest/include -I/home/jenkins/tools/java/latest/include/linux
-I<https://builds.apache.org/job/Hadoop-Common-trunk/ws/hadoop-common-project/hadoop-common/src/main/native/src/org/apache/hadoop/util>
   -o CMakeFiles/hadoop.dir/main/native/src/org/apache/hadoop/io/compress/lz4/lz4.c.o   -c
<https://builds.apache.org/job/Hadoop-Common-trunk/ws/hadoop-common-project/hadoop-common/src/main/native/src/org/apache/hadoop/io/compress/lz4/lz4.c>
     [exec] /usr/bin/cmake -E cmake_progress_report <https://builds.apache.org/job/Hadoop-Common-trunk/ws/hadoop-common-project/hadoop-common/target/native/CMakeFiles>
5
     [exec] [ 10%] Building C object CMakeFiles/hadoop.dir/main/native/src/org/apache/hadoop/io/compress/lz4/lz4hc.c.o
     [exec] /usr/bin/cc  -Dhadoop_EXPORTS -m32 -g -Wall -O2 -D_REENTRANT -D_GNU_SOURCE -D_LARGEFILE_SOURCE
-D_FILE_OFFSET_BITS=64 -fPIC -I<https://builds.apache.org/job/Hadoop-Common-trunk/ws/hadoop-common-project/hadoop-common/target/native/javah>
-I<https://builds.apache.org/job/Hadoop-Common-trunk/ws/hadoop-common-project/hadoop-common/src/main/native/src>
-I<https://builds.apache.org/job/Hadoop-Common-trunk/ws/hadoop-common-project/hadoop-common/src>
-I<https://builds.apache.org/job/Hadoop-Common-trunk/ws/hadoop-common-project/hadoop-common/src/src>
-I<https://builds.apache.org/job/Hadoop-Common-trunk/ws/hadoop-common-project/hadoop-common/target/native>
-I/home/jenkins/tools/java/latest/include -I/home/jenkins/tools/java/latest/include/linux
-I<https://builds.apache.org/job/Hadoop-Common-trunk/ws/hadoop-common-project/hadoop-common/src/main/native/src/org/apache/hadoop/util>
   -o CMakeFiles/hadoop.dir/main/native/src/org/apache/hadoop/io/compress/lz4/lz4hc.c.o  
-c <https://builds.apache.org/job/Hadoop-Common-trunk/ws/hadoop-common-project/hadoop-common/src/main/native/src/org/apache/hadoop/io/compress/lz4/lz4hc.c>
     [exec] /usr/bin/cmake -E cmake_progress_report <https://builds.apache.org/job/Hadoop-Common-trunk/ws/hadoop-common-project/hadoop-common/target/native/CMakeFiles>
6
     [exec] [ 12%] Building C object CMakeFiles/hadoop.dir/main/native/src/org/apache/hadoop/io/compress/snappy/SnappyCompressor.c.o
     [exec] /usr/bin/cc  -Dhadoop_EXPORTS -m32 -g -Wall -O2 -D_REENTRANT -D_GNU_SOURCE -D_LARGEFILE_SOURCE
-D_FILE_OFFSET_BITS=64 -fPIC -I<https://builds.apache.org/job/Hadoop-Common-trunk/ws/hadoop-common-project/hadoop-common/target/native/javah>
-I<https://builds.apache.org/job/Hadoop-Common-trunk/ws/hadoop-common-project/hadoop-common/src/main/native/src>
-I<https://builds.apache.org/job/Hadoop-Common-trunk/ws/hadoop-common-project/hadoop-common/src>
-I<https://builds.apache.org/job/Hadoop-Common-trunk/ws/hadoop-common-project/hadoop-common/src/src>
-I<https://builds.apache.org/job/Hadoop-Common-trunk/ws/hadoop-common-project/hadoop-common/target/native>
-I/home/jenkins/tools/java/latest/include -I/home/jenkins/tools/java/latest/include/linux
-I<https://builds.apache.org/job/Hadoop-Common-trunk/ws/hadoop-common-project/hadoop-common/src/main/native/src/org/apache/hadoop/util>
   -o CMakeFiles/hadoop.dir/main/native/src/org/apache/hadoop/io/compress/snappy/SnappyCompressor.c.o
  -c <https://builds.apache.org/job/Hadoop-Common-trunk/ws/hadoop-common-project/hadoop-common/src/main/native/src/org/apache/hadoop/io/compress/snappy/SnappyCompressor.c>
     [exec] /usr/bin/cmake -E cmake_progress_report <https://builds.apache.org/job/Hadoop-Common-trunk/ws/hadoop-common-project/hadoop-common/target/native/CMakeFiles>
7
     [exec] [ 14%] Building C object CMakeFiles/hadoop.dir/main/native/src/org/apache/hadoop/io/compress/snappy/SnappyDecompressor.c.o
     [exec] /usr/bin/cc  -Dhadoop_EXPORTS -m32 -g -Wall -O2 -D_REENTRANT -D_GNU_SOURCE -D_LARGEFILE_SOURCE
-D_FILE_OFFSET_BITS=64 -fPIC -I<https://builds.apache.org/job/Hadoop-Common-trunk/ws/hadoop-common-project/hadoop-common/target/native/javah>
-I<https://builds.apache.org/job/Hadoop-Common-trunk/ws/hadoop-common-project/hadoop-common/src/main/native/src>
-I<https://builds.apache.org/job/Hadoop-Common-trunk/ws/hadoop-common-project/hadoop-common/src>
-I<https://builds.apache.org/job/Hadoop-Common-trunk/ws/hadoop-common-project/hadoop-common/src/src>
-I<https://builds.apache.org/job/Hadoop-Common-trunk/ws/hadoop-common-project/hadoop-common/target/native>
-I/home/jenkins/tools/java/latest/include -I/home/jenkins/tools/java/latest/include/linux
-I<https://builds.apache.org/job/Hadoop-Common-trunk/ws/hadoop-common-project/hadoop-common/src/main/native/src/org/apache/hadoop/util>
   -o CMakeFiles/hadoop.dir/main/native/src/org/apache/hadoop/io/compress/snappy/SnappyDecompressor.c.o
  -c <https://builds.apache.org/job/Hadoop-Common-trunk/ws/hadoop-common-project/hadoop-common/src/main/native/src/org/apache/hadoop/io/compress/snappy/SnappyDecompressor.c>
     [exec] /usr/bin/cmake -E cmake_progress_report <https://builds.apache.org/job/Hadoop-Common-trunk/ws/hadoop-common-project/hadoop-common/target/native/CMakeFiles>
8
     [exec] [ 16%] Building C object CMakeFiles/hadoop.dir/main/native/src/org/apache/hadoop/crypto/OpensslCipher.c.o
     [exec] /usr/bin/cc  -Dhadoop_EXPORTS -m32 -g -Wall -O2 -D_REENTRANT -D_GNU_SOURCE -D_LARGEFILE_SOURCE
-D_FILE_OFFSET_BITS=64 -fPIC -I<https://builds.apache.org/job/Hadoop-Common-trunk/ws/hadoop-common-project/hadoop-common/target/native/javah>
-I<https://builds.apache.org/job/Hadoop-Common-trunk/ws/hadoop-common-project/hadoop-common/src/main/native/src>
-I<https://builds.apache.org/job/Hadoop-Common-trunk/ws/hadoop-common-project/hadoop-common/src>
-I<https://builds.apache.org/job/Hadoop-Common-trunk/ws/hadoop-common-project/hadoop-common/src/src>
-I<https://builds.apache.org/job/Hadoop-Common-trunk/ws/hadoop-common-project/hadoop-common/target/native>
-I/home/jenkins/tools/java/latest/include -I/home/jenkins/tools/java/latest/include/linux
-I<https://builds.apache.org/job/Hadoop-Common-trunk/ws/hadoop-common-project/hadoop-common/src/main/native/src/org/apache/hadoop/util>
   -o CMakeFiles/hadoop.dir/main/native/src/org/apache/hadoop/crypto/OpensslCipher.c.o   -c
<https://builds.apache.org/job/Hadoop-Common-trunk/ws/hadoop-common-project/hadoop-common/src/main/native/src/org/apache/hadoop/crypto/OpensslCipher.c>
     [exec] make[2]: Leaving directory `<https://builds.apache.org/job/Hadoop-Common-trunk/ws/hadoop-common-project/hadoop-common/targetIn>
file included from <https://builds.apache.org/job/Hadoop-Common-trunk/ws/hadoop-common-project/hadoop-common/src/main/nat/native'>
     [exec] make[1]: Leaving directory `<https://builds.apache.org/job/Hadoop-Common-trunk/ws/hadoop-common-project/hadoop-commive/src/org/apache/hadoop/crypto/org_apache_hadoop_crypto.h>:33:0,
     [exec]                  from /home/jenkins/jenkins-slave/workspace/Haon/target/native'
     [exec] doop-Common-trunk/hadoop-common-project/hadoop-common/src/main/native/src/org/apache/hadoop/crypto/OpensslCipher.c:19:
     [exec] /usr/include/openssl/aes.h:55:33: fatal error: openssl/opensslconf.h: No such
file or directory
     [exec]  #include <openssl/opensslconf.h>
     [exec]                                  ^
     [exec] compilation terminated.
     [exec] make[2]: *** [CMakeFiles/hadoop.dir/main/native/src/org/apache/hadoop/crypto/OpensslCipher.c.o]
Error 1
     [exec] make[1]: *** [CMakeFiles/hadoop.dir/all] Error 2
     [exec] make: *** [all] Error 2
[INFO] ------------------------------------------------------------------------
[INFO] Reactor Summary:
[INFO] 
[INFO] Apache Hadoop Annotations ......................... SUCCESS [  6.818 s]
[INFO] Apache Hadoop MiniKDC ............................. SUCCESS [ 11.912 s]
[INFO] Apache Hadoop Auth ................................ SUCCESS [04:57 min]
[INFO] Apache Hadoop Auth Examples ....................... SUCCESS [  4.055 s]
[INFO] Apache Hadoop Common .............................. FAILURE [ 21.257 s]
[INFO] Apache Hadoop NFS ................................. SKIPPED
[INFO] Apache Hadoop KMS ................................. SKIPPED
[INFO] Apache Hadoop Common Project ...................... SKIPPED
[INFO] ------------------------------------------------------------------------
[INFO] BUILD FAILURE
[INFO] ------------------------------------------------------------------------
[INFO] Total time: 05:42 min
[INFO] Finished at: 2014-10-02T09:08:00+00:00
[INFO] Final Memory: 63M/744M
[INFO] ------------------------------------------------------------------------
[ERROR] Failed to execute goal org.apache.maven.plugins:maven-antrun-plugin:1.7:run (make)
on project hadoop-common: An Ant BuildException has occured: exec returned: 2
[ERROR] around Ant part ...<exec dir="<https://builds.apache.org/job/Hadoop-Common-trunk/ws/hadoop-common-project/hadoop-common/target/native">
executable="make" failonerror="true">... @ 7:160 in <https://builds.apache.org/job/Hadoop-Common-trunk/ws/hadoop-common-project/hadoop-common/target/antrun/build-main.xml>
[ERROR] -> [Help 1]
org.apache.maven.lifecycle.LifecycleExecutionException: Failed to execute goal org.apache.maven.plugins:maven-antrun-plugin:1.7:run
(make) on project hadoop-common: An Ant BuildException has occured: exec returned: 2
around Ant part ...<exec dir="<https://builds.apache.org/job/Hadoop-Common-trunk/ws/hadoop-common-project/hadoop-common/target/native">
executable="make" failonerror="true">... @ 7:160 in <https://builds.apache.org/job/Hadoop-Common-trunk/ws/hadoop-common-project/hadoop-common/target/antrun/build-main.xml>
	at org.apache.maven.lifecycle.internal.MojoExecutor.execute(MojoExecutor.java:216)
	at org.apache.maven.lifecycle.internal.MojoExecutor.execute(MojoExecutor.java:153)
	at org.apache.maven.lifecycle.internal.MojoExecutor.execute(MojoExecutor.java:145)
	at org.apache.maven.lifecycle.internal.LifecycleModuleBuilder.buildProject(LifecycleModuleBuilder.java:108)
	at org.apache.maven.lifecycle.internal.LifecycleModuleBuilder.buildProject(LifecycleModuleBuilder.java:76)
	at org.apache.maven.lifecycle.internal.builder.singlethreaded.SingleThreadedBuilder.build(SingleThreadedBuilder.java:51)
	at org.apache.maven.lifecycle.internal.LifecycleStarter.execute(LifecycleStarter.java:116)
	at org.apache.maven.DefaultMaven.doExecute(DefaultMaven.java:361)
	at org.apache.maven.DefaultMaven.execute(DefaultMaven.java:155)
	at org.apache.maven.cli.MavenCli.execute(MavenCli.java:584)
	at org.apache.maven.cli.MavenCli.doMain(MavenCli.java:213)
	at org.apache.maven.cli.MavenCli.main(MavenCli.java:157)
	at sun.reflect.NativeMethodAccessorImpl.invoke0(Native Method)
	at sun.reflect.NativeMethodAccessorImpl.invoke(NativeMethodAccessorImpl.java:39)
	at sun.reflect.DelegatingMethodAccessorImpl.invoke(DelegatingMethodAccessorImpl.java:25)
	at java.lang.reflect.Method.invoke(Method.java:597)
	at org.codehaus.plexus.classworlds.launcher.Launcher.launchEnhanced(Launcher.java:289)
	at org.codehaus.plexus.classworlds.launcher.Launcher.launch(Launcher.java:229)
	at org.codehaus.plexus.classworlds.launcher.Launcher.mainWithExitCode(Launcher.java:415)
	at org.codehaus.plexus.classworlds.launcher.Launcher.main(Launcher.java:356)
Caused by: org.apache.maven.plugin.MojoExecutionException: An Ant BuildException has occured:
exec returned: 2
around Ant part ...<exec dir="<https://builds.apache.org/job/Hadoop-Common-trunk/ws/hadoop-common-project/hadoop-common/target/native">
executable="make" failonerror="true">... @ 7:160 in <https://builds.apache.org/job/Hadoop-Common-trunk/ws/hadoop-common-project/hadoop-common/target/antrun/build-main.xml>
	at org.apache.maven.plugin.antrun.AntRunMojo.execute(AntRunMojo.java:355)
	at org.apache.maven.plugin.DefaultBuildPluginManager.executeMojo(DefaultBuildPluginManager.java:133)
	at org.apache.maven.lifecycle.internal.MojoExecutor.execute(MojoExecutor.java:208)
	... 19 more
Caused by: <https://builds.apache.org/job/Hadoop-Common-trunk/ws/hadoop-common-project/hadoop-common/target/antrun/build-main.xml>:7:
exec returned: 2
	at org.apache.tools.ant.taskdefs.ExecTask.runExecute(ExecTask.java:646)
	at org.apache.tools.ant.taskdefs.ExecTask.runExec(ExecTask.java:672)
	at org.apache.tools.ant.taskdefs.ExecTask.execute(ExecTask.java:498)
	at org.apache.tools.ant.UnknownElement.execute(UnknownElement.java:291)
	at sun.reflect.GeneratedMethodAccessor88.invoke(Unknown Source)
	at sun.reflect.DelegatingMethodAccessorImpl.invoke(DelegatingMethodAccessorImpl.java:25)
	at java.lang.reflect.Method.invoke(Method.java:597)
	at org.apache.tools.ant.dispatch.DispatchUtils.execute(DispatchUtils.java:106)
	at org.apache.tools.ant.Task.perform(Task.java:348)
	at org.apache.tools.ant.Target.execute(Target.java:390)
	at org.apache.tools.ant.Target.performTasks(Target.java:411)
	at org.apache.tools.ant.Project.executeSortedTargets(Project.java:1399)
	at org.apache.tools.ant.Project.executeTarget(Project.java:1368)
	at org.apache.maven.plugin.antrun.AntRunMojo.execute(AntRunMojo.java:327)
	... 21 more
[ERROR] 
[ERROR] 
[ERROR] For more information about the errors and possible solutions, please read the following
articles:
[ERROR] [Help 1] http://cwiki.apache.org/confluence/display/MAVEN/MojoExecutionException
[ERROR] 
[ERROR] After correcting the problems, you can resume the build with the command
[ERROR]   mvn <goals> -rf :hadoop-common
Build step 'Execute shell' marked build as failure
Archiving artifacts
Recording test results

Mime
View raw message